Test_openjdk8_hs_extended.openjdk_x86-64_linux
Started by upstream project "build-scripts/jobs/release/jobs/jdk8u/jdk8u-release-linux-x64-temurin" build number 31
originally caused by:
Started by upstream project "build-scripts/release-openjdk8-pipeline" build number 99
originally caused by:
Started by upstream project "build-scripts/utils/releaseTrigger_jdk8u" build number 6195
originally caused by:
Started by timer
Checking out git ${ADOPTOPENJDK_REPO} into /home/jenkins/.jenkins/workspace/Test_openjdk8_hs_extended.openjdk_x86-64_linux@script/7d272c0688f17ab4e5b2f6ce77a7dc9cf4df33ff05c3a95eddd38682ef795b79 to read aqa-tests/buildenv/jenkins/openjdk_tests
The recommended git tool is: git
No credentials specified
Wiping out workspace first.
Cloning the remote Git repository
Using shallow clone with depth 1
Cloning repository https://github.com/adoptium/aqa-tests.git
> git init /home/jenkins/.jenkins/workspace/Test_openjdk8_hs_extended.openjdk_x86-64_linux@script/7d272c0688f17ab4e5b2f6ce77a7dc9cf4df33ff05c3a95eddd38682ef795b79/aqa-tests # timeout=10
Fetching upstream changes from https://github.com/adoptium/aqa-tests.git
> git --version # timeout=10
> git --version # 'git version 2.43.0'
> git fetch --tags --force --progress --depth=1 -- https://github.com/adoptium/aqa-tests.git +refs/heads/*:refs/remotes/origin/* # timeout=60
> git config remote.origin.url https://github.com/adoptium/aqa-tests.git # timeout=10
> git config --add remote.origin.fetch +refs/heads/*:refs/remotes/origin/* # timeout=10
Avoid second fetch
> git rev-parse origin/v1.0.10-release^{commit} # timeout=10
Checking out Revision 1aeda1cd1c9341cd2b3ab91ba550238256fb0fbb (origin/v1.0.10-release)
> git config core.sparsecheckout # timeout=10
> git checkout -f 1aeda1cd1c9341cd2b3ab91ba550238256fb0fbb # timeout=10
Commit message: "AIX excludes for oct 25 release (#6682)"
> git rev-list --no-walk abda9a5820bcc801016ae2a58349ff4e1fb0034b # timeout=10
First time build. Skipping changelog.
[Pipeline] Start of Pipeline
[Pipeline] timestamps
[Pipeline] {
[Pipeline] echo
[2025-10-22T06:24:41.366Z] SPEC: linux_x86-64
[Pipeline] echo
[2025-10-22T06:24:41.367Z] LABEL: ci.role.test&&hw.arch.x86&&sw.os.linux
[Pipeline] stage
[Pipeline] { (Queue)
[Pipeline] nodesByLabel
[2025-10-22T06:24:41.377Z] Found a total of 11 nodes with the 'ci.role.test&&hw.arch.x86&&sw.os.linux' label
Did you forget the `def` keyword? WorkflowScript seems to be setting a field named dynamicAgents (to a value of type ArrayList) which could lead to memory leaks or other issues.
[Pipeline] echo
[2025-10-22T06:24:41.382Z] dynamicAgents: [azure, fyre, EBC]
[Pipeline] node
[2025-10-22T06:24:56.385Z] Still waiting to schedule task
[2025-10-22T06:24:56.387Z] Waiting for next available executor on ‘ci.role.test&&hw.arch.x86&&sw.os.linux’
[2025-10-22T06:52:23.208Z] Running on test-docker-ubuntu2204-x64-2 in /home/jenkins/workspace/Test_openjdk8_hs_extended.openjdk_x86-64_linux
[Pipeline] {
Did you forget the `def` keyword? WorkflowScript seems to be setting a field named ref_cache (to a value of type GStringImpl) which could lead to memory leaks or other issues.
[Pipeline] retry
[Pipeline] {
[Pipeline] timeout
[2025-10-22T06:52:23.247Z] Timeout set to expire in 1 hr 0 min
[Pipeline] {
[Pipeline] cleanWs
[2025-10-22T06:52:23.532Z] [WS-CLEANUP] Deleting project workspace...
[2025-10-22T06:52:23.532Z] [WS-CLEANUP] Deferred wipeout is disabled by the job configuration...
[2025-10-22T06:52:23.665Z] [WS-CLEANUP] done
[Pipeline] }
[Pipeline] // timeout
[Pipeline] checkout
[2025-10-22T06:52:23.832Z] The recommended git tool is: git
[2025-10-22T06:52:24.097Z] No credentials specified
[2025-10-22T06:52:24.230Z] Cloning the remote Git repository
[2025-10-22T06:52:24.427Z] Cloning repository https://github.com/adoptium/aqa-tests.git
[2025-10-22T06:52:24.427Z] > git init /home/jenkins/workspace/Test_openjdk8_hs_extended.openjdk_x86-64_linux/aqa-tests # timeout=10
[2025-10-22T06:52:24.439Z] [WARNING] Reference path does not exist: /home/jenkins/openjdk_cache
[2025-10-22T06:52:24.439Z] Fetching upstream changes from https://github.com/adoptium/aqa-tests.git
[2025-10-22T06:52:24.439Z] > git --version # timeout=10
[2025-10-22T06:52:24.441Z] > git --version # 'git version 2.34.1'
[2025-10-22T06:52:24.441Z] > git fetch --tags --force --progress -- https://github.com/adoptium/aqa-tests.git +refs/heads/*:refs/remotes/origin/* # timeout=10
[2025-10-22T06:52:28.535Z] Avoid second fetch
[2025-10-22T06:52:28.671Z] Checking out Revision 1aeda1cd1c9341cd2b3ab91ba550238256fb0fbb (origin/v1.0.10-release)
[2025-10-22T06:52:28.325Z] > git config remote.origin.url https://github.com/adoptium/aqa-tests.git # timeout=10
[2025-10-22T06:52:28.328Z] > git config --add remote.origin.fetch +refs/heads/*:refs/remotes/origin/* # timeout=10
[2025-10-22T06:52:28.599Z] > git rev-parse origin/v1.0.10-release^{commit} # timeout=10
[2025-10-22T06:52:28.736Z] > git config core.sparsecheckout # timeout=10
[2025-10-22T06:52:28.739Z] > git checkout -f 1aeda1cd1c9341cd2b3ab91ba550238256fb0fbb # timeout=10
[2025-10-22T06:52:29.775Z] Commit message: "AIX excludes for oct 25 release (#6682)"
[Pipeline] }
[Pipeline] // retry
[Pipeline] load
[Pipeline] { (/home/jenkins/workspace/Test_openjdk8_hs_extended.openjdk_x86-64_linux/aqa-tests/buildenv/jenkins/JenkinsfileBase)
[Pipeline] }
[Pipeline] // load
Did you forget the `def` keyword? WorkflowScript seems to be setting a field named jenkinsfile (to a value of type Script1) which could lead to memory leaks or other issues.
Did you forget the `def` keyword? Script1 seems to be setting a field named TIME_LIMIT (to a value of type Integer) which could lead to memory leaks or other issues.
[Pipeline] timeout
[2025-10-22T06:52:32.074Z] Timeout set to expire in 1 day 1 hr
[Pipeline] {
[Pipeline] sh
[2025-10-22T06:52:33.870Z] + which activate_multicast
[Pipeline] echo
[2025-10-22T06:52:34.962Z] which activate_multicast status code: 1
[Pipeline] echo
[2025-10-22T06:52:34.964Z] runMulticastCmd: false
[Pipeline] stage
[Pipeline] { (Setup)
[Pipeline] sh
[2025-10-22T06:52:36.534Z] + LC_TIME=C date +%a, %d %b %Y %T %z
[Pipeline] echo
[2025-10-22T06:52:37.080Z] PROCESSCATCH: Terminating any hung/left over test processes:
[Pipeline] sh
[2025-10-22T06:52:38.531Z] + aqa-tests/terminateTestProcesses.sh jenkins
[2025-10-22T06:52:38.531Z] Unix type machine..
[2025-10-22T06:52:38.531Z] Running on a Linux host
[2025-10-22T06:52:38.531Z] Woohoo - no rogue processes detected!
Did you forget the `def` keyword? Script1 seems to be setting a field named PLATFORM (to a value of type String) which could lead to memory leaks or other issues.
Did you forget the `def` keyword? Script1 seems to be setting a field named CLONE_OPENJ9 (to a value of type String) which could lead to memory leaks or other issues.
Did you forget the `def` keyword? Script1 seems to be setting a field named CUSTOM_TARGET (to a value of type String) which could lead to memory leaks or other issues.
Did you forget the `def` keyword? Script1 seems to be setting a field named UPSTREAM_JOB_NAME (to a value of type String) which could lead to memory leaks or other issues.
Did you forget the `def` keyword? Script1 seems to be setting a field named UPSTREAM_JOB_NUMBER (to a value of type String) which could lead to memory leaks or other issues.
Did you forget the `def` keyword? Script1 seems to be setting a field named SSH_AGENT_CREDENTIAL (to a value of type String) which could lead to memory leaks or other issues.
Did you forget the `def` keyword? Script1 seems to be setting a field named KEEP_WORKSPACE (to a value of type Boolean) which could lead to memory leaks or other issues.
Did you forget the `def` keyword? Script1 seems to be setting a field named OPENJ9_SHA (to a value of type String) which could lead to memory leaks or other issues.
Did you forget the `def` keyword? Script1 seems to be setting a field named CLOUD_PROVIDER (to a value of type String) which could lead to memory leaks or other issues.
Did you forget the `def` keyword? Script1 seems to be setting a field named SDK_RESOURCE (to a value of type String) which could lead to memory leaks or other issues.
Did you forget the `def` keyword? Script1 seems to be setting a field named ITERATIONS (to a value of type Integer) which could lead to memory leaks or other issues.
Did you forget the `def` keyword? Script1 seems to be setting a field named NUM_MACHINES (to a value of type Integer) which could lead to memory leaks or other issues.
[Pipeline] sh
[2025-10-22T06:52:41.408Z] + printenv
[2025-10-22T06:52:41.408Z] JENKINS_HOME=/home/jenkins/.jenkins
[2025-10-22T06:52:41.408Z] OPENJ9_REPO=https://github.com/eclipse-openj9/openj9.git
[2025-10-22T06:52:41.408Z] SETUP_JCK_RUN=false
[2025-10-22T06:52:41.408Z] USE_TESTENV_PROPERTIES=true
[2025-10-22T06:52:41.408Z] EXTERNAL_CUSTOM_BRANCH=master
[2025-10-22T06:52:41.408Z] SSH_CLIENT=78.47.239.97 40604 22
[2025-10-22T06:52:41.408Z] USER=jenkins
[2025-10-22T06:52:41.408Z] BUILD_LIST=openjdk
[2025-10-22T06:52:41.408Z] SDK_RESOURCE=upstream
[2025-10-22T06:52:41.408Z] OPENJ9_BRANCH=master
[2025-10-22T06:52:41.408Z] jobStatus=SUCCESS
[2025-10-22T06:52:41.408Z] CI=true
[2025-10-22T06:52:41.408Z] RUN_CHANGES_DISPLAY_URL=https://ci.adoptium.net/job/Test_openjdk8_hs_extended.openjdk_x86-64_linux/281/display/redirect?page=changes
[2025-10-22T06:52:41.408Z] ADOPTOPENJDK_REPO=https://github.com/adoptium/aqa-tests.git
[2025-10-22T06:52:41.408Z] UPSTREAM_JOB_NUMBER=31
[2025-10-22T06:52:41.408Z] TARGET=extended.openjdk
[2025-10-22T06:52:41.408Z] EXIT_FAILURE=false
[2025-10-22T06:52:41.408Z] NODE_LABELS=hw.dockerhost.dockerhost-azure-ubuntu2204-x64-1 ci.role.test sw.os.linux test-docker-ubuntu2204-x64-2 hw.arch.x86
[2025-10-22T06:52:41.408Z] HUDSON_URL=https://ci.adoptium.net/
[2025-10-22T06:52:41.408Z] MOTD_SHOWN=pam
[2025-10-22T06:52:41.408Z] USE_JRE=false
[2025-10-22T06:52:41.408Z] OLDPWD=/home/jenkins
[2025-10-22T06:52:41.408Z] STF_OWNER_BRANCH=adoptium:master
[2025-10-22T06:52:41.408Z] HOME=/home/jenkins
[2025-10-22T06:52:41.408Z] ADOPTOPENJDK_BRANCH=v1.0.10-release
[2025-10-22T06:52:41.408Z] BUILD_URL=https://ci.adoptium.net/job/Test_openjdk8_hs_extended.openjdk_x86-64_linux/281/
[2025-10-22T06:52:41.408Z] TAP_NAME=Test_openjdk8_hs_extended.openjdk_x86-64_linux.tap
[2025-10-22T06:52:41.408Z] JDK_IMPL=hotspot
[2025-10-22T06:52:41.408Z] DOCKER_REQUIRED=false
[2025-10-22T06:52:41.408Z] HUDSON_COOKIE=58ed6f30-e050-4aeb-8874-475f5a68636f
[2025-10-22T06:52:41.408Z] JENKINS_SERVER_COOKIE=durable-dde1f5010b571b52a987a33fecec6d87e34e26fde4efa14d885f6402615f70c3
[2025-10-22T06:52:41.408Z] PERF_ROOT=/home/jenkins/workspace/Test_openjdk8_hs_extended.openjdk_x86-64_linux/../../benchmarks
[2025-10-22T06:52:41.408Z] JDK_REPO=https://github.com/adoptium/jdk8u
[2025-10-22T06:52:41.408Z] WORKSPACE=/home/jenkins/workspace/Test_openjdk8_hs_extended.openjdk_x86-64_linux
[2025-10-22T06:52:41.408Z] KEEP_WORKSPACE=false
[2025-10-22T06:52:41.408Z] ARCHIVE_TEST_RESULTS=false
[2025-10-22T06:52:41.408Z] GENERATE_JOBS=true
[2025-10-22T06:52:41.408Z] TKG_OWNER_BRANCH=adoptium:master
[2025-10-22T06:52:41.408Z] PERSONAL_BUILD=false
[2025-10-22T06:52:41.408Z] LOGNAME=jenkins
[2025-10-22T06:52:41.408Z] NODE_NAME=test-docker-ubuntu2204-x64-2
[2025-10-22T06:52:41.408Z] JDK_BRANCH=jdk8u472-b08_adopt
[2025-10-22T06:52:41.408Z] RUN_ARTIFACTS_DISPLAY_URL=https://ci.adoptium.net/job/Test_openjdk8_hs_extended.openjdk_x86-64_linux/281/display/redirect?page=artifacts
[2025-10-22T06:52:41.408Z] STAGE_NAME=Setup
[2025-10-22T06:52:41.408Z] AUTO_DETECT=true
[2025-10-22T06:52:41.408Z] EXECUTOR_NUMBER=0
[2025-10-22T06:52:41.408Z] JDK_VERSION=8
[2025-10-22T06:52:41.408Z] EXTERNAL_TEST_CMD=mvn clean install
[2025-10-22T06:52:41.408Z] RUN_TESTS_DISPLAY_URL=https://ci.adoptium.net/job/Test_openjdk8_hs_extended.openjdk_x86-64_linux/281/display/redirect?page=tests
[2025-10-22T06:52:41.408Z] BUILD_DISPLAY_NAME=#281
[2025-10-22T06:52:41.408Z] CUSTOMIZED_SDK_URL_CREDENTIAL_ID=eclipse_temurin_bot_email_and_token
[2025-10-22T06:52:41.408Z] TIME_LIMIT=25
[2025-10-22T06:52:41.408Z] HUDSON_HOME=/home/jenkins/.jenkins
[2025-10-22T06:52:41.408Z] JOB_BASE_NAME=Test_openjdk8_hs_extended.openjdk_x86-64_linux
[2025-10-22T06:52:41.408Z] PATH=/usr/lib/jvm/jdk17:/usr/local/sbin:/usr/local/bin:/usr/sbin:/usr/bin:/sbin:/bin:/usr/games:/usr/local/games:/snap/bin
[2025-10-22T06:52:41.408Z] PLATFORM=x86-64_linux
[2025-10-22T06:52:41.408Z] TKG_ITERATIONS=1
[2025-10-22T06:52:41.408Z] EXIT_SUCCESS=false
[2025-10-22T06:52:41.408Z] BUILD_ID=281
[2025-10-22T06:52:41.408Z] RERUN_FAILURE=true
[2025-10-22T06:52:41.408Z] ACTIVE_NODE_TIMEOUT=5
[2025-10-22T06:52:41.408Z] BUILD_TAG=jenkins-Test_openjdk8_hs_extended.openjdk_x86-64_linux-281
[2025-10-22T06:52:41.408Z] SYSTEM_LIB_DIR=/home/jenkins/workspace/Test_openjdk8_hs_extended.openjdk_x86-64_linux/../../externalDependency/system_lib
[2025-10-22T06:52:41.408Z] JENKINS_URL=https://ci.adoptium.net/
[2025-10-22T06:52:41.408Z] OPENJCEPLUS_GIT_REPO=https://github.com/ibmruntimes/OpenJCEPlus.git
[2025-10-22T06:52:41.408Z] JOB_URL=https://ci.adoptium.net/job/Test_openjdk8_hs_extended.openjdk_x86-64_linux/
[2025-10-22T06:52:41.408Z] KEEP_REPORTDIR=true
[2025-10-22T06:52:41.408Z] JCK_GIT_BRANCH=master
[2025-10-22T06:52:41.408Z] ORIGIN_JDK_VERSION=8
[2025-10-22T06:52:41.408Z] BUILD_NUMBER=281
[2025-10-22T06:52:41.408Z] JENKINS_NODE_COOKIE=353a8571-c177-448a-addf-f15688c48035
[2025-10-22T06:52:41.408Z] SHELL=/bin/sh
[2025-10-22T06:52:41.408Z] ITERATIONS=1
[2025-10-22T06:52:41.408Z] OPENJCEPLUS_GIT_BRANCH=semeru-java8
[2025-10-22T06:52:41.408Z] TEST_JDK_HOME=/home/jenkins/workspace/Test_openjdk8_hs_extended.openjdk_x86-64_linux/jdkbinary/j2sdk-image
[2025-10-22T06:52:41.408Z] RUN_DISPLAY_URL=https://ci.adoptium.net/job/Test_openjdk8_hs_extended.openjdk_x86-64_linux/281/display/redirect
[2025-10-22T06:52:41.408Z] OPENJ9_SYSTEMTEST_OWNER_BRANCH=eclipse:master
[2025-10-22T06:52:41.408Z] SPEC=linux_x86-64
[2025-10-22T06:52:41.408Z] LIGHT_WEIGHT_CHECKOUT=false
[2025-10-22T06:52:41.408Z] HUDSON_SERVER_COOKIE=2d832652af5afba8
[2025-10-22T06:52:41.408Z] JOB_DISPLAY_URL=https://ci.adoptium.net/job/Test_openjdk8_hs_extended.openjdk_x86-64_linux/display/redirect
[2025-10-22T06:52:41.408Z] UPSTREAM_JOB_NAME=build-scripts/jobs/release/jobs/jdk8u/jdk8u-release-linux-x64-temurin
[2025-10-22T06:52:41.408Z] JOB_NAME=Test_openjdk8_hs_extended.openjdk_x86-64_linux
[2025-10-22T06:52:41.408Z] SLACK_CHANNEL=aqavit-bot
[2025-10-22T06:52:41.408Z] ADOPTOPENJDK_SYSTEMTEST_OWNER_BRANCH=adoptium:master
[2025-10-22T06:52:41.408Z] PWD=/home/jenkins/workspace/Test_openjdk8_hs_extended.openjdk_x86-64_linux
[2025-10-22T06:52:41.408Z] LIB_DIR=/home/jenkins/workspace/Test_openjdk8_hs_extended.openjdk_x86-64_linux/../../externalDependency/lib
[2025-10-22T06:52:41.408Z] JAVA_HOME=/usr/lib/jvm/jdk17
[2025-10-22T06:52:41.408Z] TEST_TIME=120
[2025-10-22T06:52:41.408Z] SSH_CONNECTION=78.47.239.97 40604 172.17.0.8 22
[2025-10-22T06:52:41.409Z] WORKSPACE_TMP=/home/jenkins/workspace/Test_openjdk8_hs_extended.openjdk_x86-64_linux@tmp
[2025-10-22T06:52:41.409Z] PARALLEL=Dynamic
[2025-10-22T06:52:41.409Z] JOBSTARTTIME=Wed, 22 Oct 2025 06:52:35 +0000
[2025-10-22T06:52:41.409Z] DYNAMIC_COMPILE=false
[2025-10-22T06:52:41.409Z] RERUN_ITERATIONS=1
Did you forget the `def` keyword? Script1 seems to be setting a field named CUSTOMIZED_SDK_URL_OPTION (to a value of type String) which could lead to memory leaks or other issues.
[Pipeline] timeout
[2025-10-22T06:52:41.945Z] Timeout set to expire in 1 hr 0 min
[Pipeline] {
[Pipeline] dir
[2025-10-22T06:52:41.955Z] Running in /home/jenkins/workspace/Test_openjdk8_hs_extended.openjdk_x86-64_linux/jdkbinary
[Pipeline] {
[Pipeline] copyArtifacts
[2025-10-22T06:55:22.087Z] Copied 6 artifacts from "build-scripts » jobs » release » jobs » jdk8u » jdk8u-release-linux-x64-temurin" build number 31
[Pipeline] }
[Pipeline] // dir
[Pipeline] }
[Pipeline] // timeout
Did you forget the `def` keyword? Script1 seems to be setting a field named OPENJ9_REPO_OPTION (to a value of type String) which could lead to memory leaks or other issues.
Did you forget the `def` keyword? Script1 seems to be setting a field named OPENJ9_BRANCH_OPTION (to a value of type String) which could lead to memory leaks or other issues.
Did you forget the `def` keyword? Script1 seems to be setting a field named TKG_REPO_OPTION (to a value of type String) which could lead to memory leaks or other issues.
Did you forget the `def` keyword? Script1 seems to be setting a field named TKG_BRANCH_OPTION (to a value of type String) which could lead to memory leaks or other issues.
Did you forget the `def` keyword? Script1 seems to be setting a field named OPENJ9_SHA_OPTION (to a value of type String) which could lead to memory leaks or other issues.
Did you forget the `def` keyword? Script1 seems to be setting a field named CLONE_OPENJ9_OPTION (to a value of type String) which could lead to memory leaks or other issues.
Did you forget the `def` keyword? Script1 seems to be setting a field named CLONE_OPENJ9_OPTION (to a value of type String) which could lead to memory leaks or other issues.
Did you forget the `def` keyword? Script1 seems to be setting a field named JDK_VERSION_OPTION (to a value of type GStringImpl) which could lead to memory leaks or other issues.
Did you forget the `def` keyword? Script1 seems to be setting a field named JDK_IMPL_OPTION (to a value of type GStringImpl) which could lead to memory leaks or other issues.
Did you forget the `def` keyword? Script1 seems to be setting a field named VENDOR_TEST_REPOS (to a value of type String) which could lead to memory leaks or other issues.
Did you forget the `def` keyword? Script1 seems to be setting a field named VENDOR_TEST_BRANCHES (to a value of type String) which could lead to memory leaks or other issues.
Did you forget the `def` keyword? Script1 seems to be setting a field named VENDOR_TEST_DIRS (to a value of type String) which could lead to memory leaks or other issues.
Did you forget the `def` keyword? Script1 seems to be setting a field named VENDOR_TEST_SHAS (to a value of type String) which could lead to memory leaks or other issues.
[Pipeline] echo
[2025-10-22T06:55:22.274Z] IS_SVT_TESTREPO is set to false
Did you forget the `def` keyword? Script1 seems to be setting a field named TEST_IMAGES_REQUIRED (to a value of type String) which could lead to memory leaks or other issues.
Did you forget the `def` keyword? Script1 seems to be setting a field named DEBUG_IMAGES_REQUIRED (to a value of type String) which could lead to memory leaks or other issues.
Did you forget the `def` keyword? Script1 seems to be setting a field named CODE_COVERAGE_OPTION (to a value of type String) which could lead to memory leaks or other issues.
Did you forget the `def` keyword? Script1 seems to be setting a field named ADDITIONAL_ARTIFACTS_REQUIRED_OPTION (to a value of type String) which could lead to memory leaks or other issues.
Did you forget the `def` keyword? Script1 seems to be setting a field named CURL_OPTS (to a value of type String) which could lead to memory leaks or other issues.
Did you forget the `def` keyword? Script1 seems to be setting a field named GET_SH_CMD (to a value of type GStringImpl) which could lead to memory leaks or other issues.
Did you forget the `def` keyword? Script1 seems to be setting a field named RESOLVED_MAKE (to a value of type String) which could lead to memory leaks or other issues.
[Pipeline] dir
[2025-10-22T06:55:22.280Z] Running in /home/jenkins/workspace/Test_openjdk8_hs_extended.openjdk_x86-64_linux
[Pipeline] {
[Pipeline] sshagent
[2025-10-22T06:55:22.365Z] $ ssh-agent
[2025-10-22T06:55:22.962Z] SSH_AUTH_SOCK=/tmp/ssh-XXXXXX6PqSLp/agent.2244380
[2025-10-22T06:55:22.962Z] SSH_AGENT_PID=2244383
[2025-10-22T06:55:22.962Z] [ssh-agent] Started.
[Pipeline] {
[Pipeline] dir
[2025-10-22T06:55:22.982Z] Running in /home/jenkins/workspace/Test_openjdk8_hs_extended.openjdk_x86-64_linux/aqa-tests
[Pipeline] {
[Pipeline] withCredentials
[2025-10-22T06:55:23.024Z] Masking supported pattern matches of $USERNAME or $PASSWORD
[Pipeline] {
[Pipeline] sh
[2025-10-22T06:55:26.000Z] + pwd
[2025-10-22T06:55:26.001Z] + ./get.sh -s /home/jenkins/workspace/Test_openjdk8_hs_extended.openjdk_x86-64_linux/aqa-tests/.. -p x86-64_linux -r upstream -j 8 -i hotspot --clone_openj9 false
[2025-10-22T06:55:26.001Z] TESTDIR: /home/jenkins/workspace/Test_openjdk8_hs_extended.openjdk_x86-64_linux/aqa-tests
[2025-10-22T06:55:26.001Z] load ./testenv/testenv.properties
[2025-10-22T06:55:26.001Z] Running checkTags with ./testenv/testenv.properties and 8
[2025-10-22T06:55:26.777Z] 3159c57c20c69ab24b246303d0bf068ac1339de4 refs/tags/jdk8u472-ga
[2025-10-22T06:55:26.777Z] Use tag name jdk8u472-ga from ./testenv/testenv.properties
[2025-10-22T06:55:26.777Z] get jdk binary...
[2025-10-22T06:55:26.777Z] --sdkdir is set to upstream. Therefore, skip download jdk binary
[2025-10-22T06:55:26.777Z] Uncompressing file: OpenJDK8U-jdk-sources_8u472b08.tar.gz ...
[2025-10-22T06:55:30.339Z] List files in jdkbinary folder...
[2025-10-22T06:55:30.339Z] total 385592
[2025-10-22T06:55:30.339Z] -rw-r--r-- 1 jenkins jenkins 157015424 Oct 22 03:31 OpenJDK8U-debugimage_x64_linux_hotspot_8u472b08.tar.gz
[2025-10-22T06:55:30.339Z] -rw-r--r-- 1 jenkins jenkins 93140483 Oct 22 03:12 OpenJDK8U-jdk-sources_8u472b08.tar.gz
[2025-10-22T06:55:30.339Z] -rw-r--r-- 1 jenkins jenkins 103123206 Oct 22 03:31 OpenJDK8U-jdk_x64_linux_hotspot_8u472b08.tar.gz
[2025-10-22T06:55:30.339Z] -rw-r--r-- 1 jenkins jenkins 41435724 Oct 22 03:31 OpenJDK8U-jre_x64_linux_hotspot_8u472b08.tar.gz
[2025-10-22T06:55:30.339Z] -rw-rw-r-- 1 jenkins jenkins 21448 Oct 22 03:35 OpenJDK8U-sbom_x64_linux_hotspot_8u472b08-metadata.json
[2025-10-22T06:55:30.339Z] -rw-r--r-- 1 jenkins jenkins 80969 Oct 22 03:42 OpenJDK8U-sbom_x64_linux_hotspot_8u472b08.json
[2025-10-22T06:55:30.339Z] drwxrwxr-x 3 jenkins jenkins 4096 Oct 22 06:55 tmp
[2025-10-22T06:55:30.339Z] List files in jdkbinary/tmp folder...
[2025-10-22T06:55:30.339Z] total 4
[2025-10-22T06:55:30.339Z] drwxr-xr-x 15 jenkins jenkins 4096 Oct 22 03:12 jdk8u472-b08-src
[2025-10-22T06:55:30.339Z] Moving directory jdk8u472-b08-src/ to ../source-image
[2025-10-22T06:55:30.339Z] Uncompressing file: OpenJDK8U-jdk_x64_linux_hotspot_8u472b08.tar.gz ...
[2025-10-22T06:55:31.115Z] List files in jdkbinary folder...
[2025-10-22T06:55:31.115Z] total 385596
[2025-10-22T06:55:31.115Z] -rw-r--r-- 1 jenkins jenkins 157015424 Oct 22 03:31 OpenJDK8U-debugimage_x64_linux_hotspot_8u472b08.tar.gz
[2025-10-22T06:55:31.115Z] -rw-r--r-- 1 jenkins jenkins 93140483 Oct 22 03:12 OpenJDK8U-jdk-sources_8u472b08.tar.gz
[2025-10-22T06:55:31.115Z] -rw-r--r-- 1 jenkins jenkins 103123206 Oct 22 03:31 OpenJDK8U-jdk_x64_linux_hotspot_8u472b08.tar.gz
[2025-10-22T06:55:31.115Z] -rw-r--r-- 1 jenkins jenkins 41435724 Oct 22 03:31 OpenJDK8U-jre_x64_linux_hotspot_8u472b08.tar.gz
[2025-10-22T06:55:31.115Z] -rw-rw-r-- 1 jenkins jenkins 21448 Oct 22 03:35 OpenJDK8U-sbom_x64_linux_hotspot_8u472b08-metadata.json
[2025-10-22T06:55:31.115Z] -rw-r--r-- 1 jenkins jenkins 80969 Oct 22 03:42 OpenJDK8U-sbom_x64_linux_hotspot_8u472b08.json
[2025-10-22T06:55:31.115Z] drwxr-xr-x 15 jenkins jenkins 4096 Oct 22 03:12 source-image
[2025-10-22T06:55:31.115Z] drwxrwxr-x 3 jenkins jenkins 4096 Oct 22 06:55 tmp
[2025-10-22T06:55:31.115Z] List files in jdkbinary/tmp folder...
[2025-10-22T06:55:31.115Z] total 4
[2025-10-22T06:55:31.115Z] drwxr-xr-x 8 jenkins jenkins 4096 Oct 22 03:31 jdk8u472-b08
[2025-10-22T06:55:31.115Z] Moving directory jdk8u472-b08/ to ../j2sdk-image
[2025-10-22T06:55:31.115Z] Uncompressing file: OpenJDK8U-jre_x64_linux_hotspot_8u472b08.tar.gz ...
[2025-10-22T06:55:31.890Z] List files in jdkbinary folder...
[2025-10-22T06:55:31.890Z] total 385600
[2025-10-22T06:55:31.890Z] -rw-r--r-- 1 jenkins jenkins 157015424 Oct 22 03:31 OpenJDK8U-debugimage_x64_linux_hotspot_8u472b08.tar.gz
[2025-10-22T06:55:31.890Z] -rw-r--r-- 1 jenkins jenkins 93140483 Oct 22 03:12 OpenJDK8U-jdk-sources_8u472b08.tar.gz
[2025-10-22T06:55:31.890Z] -rw-r--r-- 1 jenkins jenkins 103123206 Oct 22 03:31 OpenJDK8U-jdk_x64_linux_hotspot_8u472b08.tar.gz
[2025-10-22T06:55:31.891Z] -rw-r--r-- 1 jenkins jenkins 41435724 Oct 22 03:31 OpenJDK8U-jre_x64_linux_hotspot_8u472b08.tar.gz
[2025-10-22T06:55:31.891Z] -rw-rw-r-- 1 jenkins jenkins 21448 Oct 22 03:35 OpenJDK8U-sbom_x64_linux_hotspot_8u472b08-metadata.json
[2025-10-22T06:55:31.891Z] -rw-r--r-- 1 jenkins jenkins 80969 Oct 22 03:42 OpenJDK8U-sbom_x64_linux_hotspot_8u472b08.json
[2025-10-22T06:55:31.891Z] drwxr-xr-x 8 jenkins jenkins 4096 Oct 22 03:31 j2sdk-image
[2025-10-22T06:55:31.891Z] drwxr-xr-x 15 jenkins jenkins 4096 Oct 22 03:12 source-image
[2025-10-22T06:55:31.891Z] drwxrwxr-x 3 jenkins jenkins 4096 Oct 22 06:55 tmp
[2025-10-22T06:55:31.891Z] List files in jdkbinary/tmp folder...
[2025-10-22T06:55:31.891Z] total 4
[2025-10-22T06:55:31.891Z] drwxr-xr-x 5 jenkins jenkins 4096 Oct 22 03:31 jdk8u472-b08-jre
[2025-10-22T06:55:31.891Z] Moving directory jdk8u472-b08-jre/ to ../j2re-image
[2025-10-22T06:55:31.891Z] Uncompressing OpenJDK8U-debugimage_x64_linux_hotspot_8u472b08.tar.gz over ./j2sdk-image/jre...
[2025-10-22T06:55:37.535Z] Removing top-level folder jdk8u472-b08-debug-image/
[2025-10-22T06:55:37.535Z] Removing top-level folder jdk8u472-b08/
[2025-10-22T06:55:44.450Z] Run /home/jenkins/workspace/Test_openjdk8_hs_extended.openjdk_x86-64_linux/jdkbinary/j2sdk-image/bin/java -version
[2025-10-22T06:55:44.451Z] =JAVA VERSION OUTPUT BEGIN=
[2025-10-22T06:55:44.451Z] openjdk version "1.8.0_472"
[2025-10-22T06:55:44.451Z] OpenJDK Runtime Environment (Temurin)(build 1.8.0_472-b08)
[2025-10-22T06:55:44.451Z] OpenJDK 64-Bit Server VM (Temurin)(build 25.472-b08, mixed mode)
[2025-10-22T06:55:44.451Z] =JAVA VERSION OUTPUT END=
[2025-10-22T06:55:44.451Z] =RELEASE INFO BEGIN=
[2025-10-22T06:55:44.451Z] JAVA_VERSION="1.8.0_472"
[2025-10-22T06:55:44.451Z] OS_NAME="Linux"
[2025-10-22T06:55:44.451Z] OS_VERSION="2.6"
[2025-10-22T06:55:44.451Z] OS_ARCH="amd64"
[2025-10-22T06:55:44.451Z] SOURCE=".:git:7c0a02d6a25b+"
[2025-10-22T06:55:44.451Z] IMPLEMENTOR="Eclipse Adoptium"
[2025-10-22T06:55:44.451Z] BUILD_SOURCE="git:839fa0b45d809157cffd3dc8515aad262a4a1776"
[2025-10-22T06:55:44.451Z] BUILD_SOURCE_REPO="https://github.com/adoptium/temurin-build.git"
[2025-10-22T06:55:44.451Z] SOURCE_REPO="https://github.com/adoptium/jdk8u.git"
[2025-10-22T06:55:44.451Z] FULL_VERSION="1.8.0_472-b08"
[2025-10-22T06:55:44.451Z] SEMANTIC_VERSION="8.0.472+8"
[2025-10-22T06:55:44.451Z] BUILD_INFO="OS: Linux Version: 6.8.0-1036-azure"
[2025-10-22T06:55:44.451Z] JVM_VARIANT="Hotspot"
[2025-10-22T06:55:44.451Z] JVM_VERSION="25.472-b08"
[2025-10-22T06:55:44.451Z] IMAGE_TYPE="JDK"
[2025-10-22T06:55:44.451Z] =RELEASE INFO END=
[2025-10-22T06:55:44.451Z] get testKitGen...
[2025-10-22T06:55:44.451Z] git clone -q https://github.com/adoptium/TKG.git
[2025-10-22T06:55:46.053Z] git rev-parse v1.0.10
[2025-10-22T06:55:46.053Z] git checkout -q -f 55ee750b47cfb6fc024c7c35899397d0fcf6ceab
[Pipeline] }
[Pipeline] // withCredentials
[Pipeline] }
[Pipeline] // dir
[Pipeline] }
[2025-10-22T06:55:46.576Z] $ ssh-agent -k
[2025-10-22T06:55:46.581Z] unset SSH_AUTH_SOCK;
[2025-10-22T06:55:46.581Z] unset SSH_AGENT_PID;
[2025-10-22T06:55:46.581Z] echo Agent pid 2244383 killed;
[2025-10-22T06:55:47.177Z] [ssh-agent] Stopped.
[Pipeline] // sshagent
[Pipeline] fileExists
[Pipeline] }
[Pipeline] // dir
[Pipeline] }
[Pipeline] // stage
[Pipeline] echo
[2025-10-22T06:55:47.759Z] Rerun in Grinder: https://ci.adoptium.net/job/Grinder/parambuild/?SDK_RESOURCE=upstream&TARGET=extended.openjdk&BASE_DOCKER_REGISTRY_CREDENTIAL_ID=&TEST_FLAG=&UPSTREAM_TEST_JOB_NAME=&DOCKER_REQUIRED=false&ACTIVE_NODE_TIMEOUT=5&VENDOR_TEST_DIRS=&EXTRA_DOCKER_ARGS=&TKG_OWNER_BRANCH=adoptium%3Amaster&OPENJ9_SYSTEMTEST_OWNER_BRANCH=eclipse%3Amaster&PLATFORM=x86-64_linux&GENERATE_JOBS=true&KEEP_REPORTDIR=true&PERSONAL_BUILD=false&DOCKER_REGISTRY_DIR=&RERUN_ITERATIONS=0&ADOPTOPENJDK_REPO=https%3A%2F%2Fgithub.com%2Fadoptium%2Faqa-tests.git&SETUP_JCK_RUN=false&DOCKER_REGISTRY_URL_CREDENTIAL_ID=&LABEL=&EXTRA_OPTIONS=&CUSTOMIZED_SDK_URL=&BUILD_IDENTIFIER=&JENKINS_KEY=&ADOPTOPENJDK_BRANCH=v1.0.10-release&LIGHT_WEIGHT_CHECKOUT=false&USE_JRE=false&ARTIFACTORY_SERVER=&KEEP_WORKSPACE=false&USER_CREDENTIALS_ID=&JDK_VERSION=8&DOCKER_REGISTRY_URL=&ITERATIONS=1&VENDOR_TEST_REPOS=&JDK_REPO=https%3A%2F%2Fgithub.com%2Fadoptium%2Fjdk8u&JCK_GIT_BRANCH=master&OPENJ9_BRANCH=master&OPENJ9_SHA=&JCK_GIT_REPO=&VENDOR_TEST_BRANCHES=&UPSTREAM_JOB_NAME=build-scripts%2Fjobs%2Frelease%2Fjobs%2Fjdk8u%2Fjdk8u-release-linux-x64-temurin&OPENJ9_REPO=https%3A%2F%2Fgithub.com%2Feclipse-openj9%2Fopenj9.git&CLOUD_PROVIDER=&CUSTOM_TARGET=&VENDOR_TEST_SHAS=&JDK_BRANCH=jdk8u472-b08_adopt&LABEL_ADDITION=&ARTIFACTORY_REPO=&ARTIFACTORY_ROOT_DIR=&UPSTREAM_TEST_JOB_NUMBER=&DOCKERIMAGE_TAG=&TEST_TIME=120&JDK_IMPL=hotspot&SSH_AGENT_CREDENTIAL=&AUTO_DETECT=true&SLACK_CHANNEL=aqavit-bot&DYNAMIC_COMPILE=false&RELATED_NODES=&ADOPTOPENJDK_SYSTEMTEST_OWNER_BRANCH=adoptium%3Amaster&APPLICATION_OPTIONS=&CUSTOMIZED_SDK_URL_CREDENTIAL_ID=eclipse_temurin_bot_email_and_token&ARCHIVE_TEST_RESULTS=false&NUM_MACHINES=&OPENJDK_SHA=&TRSS_URL=&RERUN_FAILURE=false&USE_TESTENV_PROPERTIES=true&BUILD_LIST=openjdk&ADDITIONAL_ARTIFACTS_REQUIRED=&UPSTREAM_JOB_NUMBER=31&STF_OWNER_BRANCH=adoptium%3Amaster&TIME_LIMIT=25&JVM_OPTIONS=&PARALLEL=None
[Pipeline] echo
[2025-10-22T06:55:47.773Z] Rerun in Grinder on same machine: https://ci.adoptium.net/job/Grinder/parambuild/?SDK_RESOURCE=upstream&TARGET=extended.openjdk&BASE_DOCKER_REGISTRY_CREDENTIAL_ID=&TEST_FLAG=&UPSTREAM_TEST_JOB_NAME=&DOCKER_REQUIRED=false&ACTIVE_NODE_TIMEOUT=5&VENDOR_TEST_DIRS=&EXTRA_DOCKER_ARGS=&TKG_OWNER_BRANCH=adoptium%3Amaster&OPENJ9_SYSTEMTEST_OWNER_BRANCH=eclipse%3Amaster&PLATFORM=x86-64_linux&GENERATE_JOBS=true&KEEP_REPORTDIR=true&PERSONAL_BUILD=false&DOCKER_REGISTRY_DIR=&RERUN_ITERATIONS=0&ADOPTOPENJDK_REPO=https%3A%2F%2Fgithub.com%2Fadoptium%2Faqa-tests.git&SETUP_JCK_RUN=false&DOCKER_REGISTRY_URL_CREDENTIAL_ID=&LABEL=test-docker-ubuntu2204-x64-2&EXTRA_OPTIONS=&CUSTOMIZED_SDK_URL=&BUILD_IDENTIFIER=&JENKINS_KEY=&ADOPTOPENJDK_BRANCH=v1.0.10-release&LIGHT_WEIGHT_CHECKOUT=false&USE_JRE=false&ARTIFACTORY_SERVER=&KEEP_WORKSPACE=false&USER_CREDENTIALS_ID=&JDK_VERSION=8&DOCKER_REGISTRY_URL=&ITERATIONS=1&VENDOR_TEST_REPOS=&JDK_REPO=https%3A%2F%2Fgithub.com%2Fadoptium%2Fjdk8u&JCK_GIT_BRANCH=master&OPENJ9_BRANCH=master&OPENJ9_SHA=&JCK_GIT_REPO=&VENDOR_TEST_BRANCHES=&UPSTREAM_JOB_NAME=build-scripts%2Fjobs%2Frelease%2Fjobs%2Fjdk8u%2Fjdk8u-release-linux-x64-temurin&OPENJ9_REPO=https%3A%2F%2Fgithub.com%2Feclipse-openj9%2Fopenj9.git&CLOUD_PROVIDER=&CUSTOM_TARGET=&VENDOR_TEST_SHAS=&JDK_BRANCH=jdk8u472-b08_adopt&LABEL_ADDITION=&ARTIFACTORY_REPO=&ARTIFACTORY_ROOT_DIR=&UPSTREAM_TEST_JOB_NUMBER=&DOCKERIMAGE_TAG=&TEST_TIME=120&JDK_IMPL=hotspot&SSH_AGENT_CREDENTIAL=&AUTO_DETECT=true&SLACK_CHANNEL=aqavit-bot&DYNAMIC_COMPILE=false&RELATED_NODES=&ADOPTOPENJDK_SYSTEMTEST_OWNER_BRANCH=adoptium%3Amaster&APPLICATION_OPTIONS=&CUSTOMIZED_SDK_URL_CREDENTIAL_ID=eclipse_temurin_bot_email_and_token&ARCHIVE_TEST_RESULTS=false&NUM_MACHINES=&OPENJDK_SHA=&TRSS_URL=&RERUN_FAILURE=false&USE_TESTENV_PROPERTIES=true&BUILD_LIST=openjdk&ADDITIONAL_ARTIFACTS_REQUIRED=&UPSTREAM_JOB_NUMBER=31&STF_OWNER_BRANCH=adoptium%3Amaster&TIME_LIMIT=25&JVM_OPTIONS=&PARALLEL=None
[Pipeline] stage
[Pipeline] { (setupParallelEnv)
Did you forget the `def` keyword? Script1 seems to be setting a field named parallel_tests (to a value of type LinkedHashMap) which could lead to memory leaks or other issues.
[Pipeline] timeout
[2025-10-22T06:55:47.830Z] Timeout set to expire in 1 hr 0 min
[Pipeline] {
[Pipeline] copyArtifacts
[2025-10-22T06:55:48.651Z] Copied 1 artifact from "getTRSSOutput" build number 1933
[Pipeline] sh
[2025-10-22T06:55:50.118Z] + cd ./aqa-tests/TKG/resources/TRSS
[2025-10-22T06:55:50.119Z] + gzip -cd TRSSOutput.tar.gz
[2025-10-22T06:55:50.119Z] + tar xof -
[2025-10-22T06:55:50.119Z] + rm TRSSOutput.tar.gz
[Pipeline] }
[Pipeline] // timeout
[Pipeline] timeout
[2025-10-22T06:55:50.561Z] Timeout set to expire in 20 min
[Pipeline] {
[Pipeline] echo
[2025-10-22T06:55:50.583Z] Custom URL: https://ci.adoptium.net//job/test.getDependency/lastSuccessfulBuild/artifact/
[Pipeline] sh
[2025-10-22T06:55:52.035Z] + perl ./aqa-tests/TKG/scripts/getDependencies.pl -path /home/jenkins/workspace/Test_openjdk8_hs_extended.openjdk_x86-64_linux/../../externalDependency/lib -task default -customUrl https://ci.adoptium.net//job/test.getDependency/lastSuccessfulBuild/artifact/
[2025-10-22T06:55:55.480Z] --------------------------------------------
[2025-10-22T06:55:55.480Z] path is set to /home/jenkins/workspace/Test_openjdk8_hs_extended.openjdk_x86-64_linux/../../externalDependency/lib
[2025-10-22T06:55:55.480Z] task is set to default
[2025-10-22T06:55:55.480Z] dependencyList is set to all
[2025-10-22T06:55:55.480Z] --------------------------------------------
[2025-10-22T06:55:55.480Z] Starting download third party dependent jars
[2025-10-22T06:55:55.480Z] --------------------------------------------
[2025-10-22T06:55:55.480Z] downloading dependent third party jars to /home/jenkins/workspace/Test_openjdk8_hs_extended.openjdk_x86-64_linux/../../externalDependency/lib
[2025-10-22T06:55:55.480Z] /home/jenkins/workspace/Test_openjdk8_hs_extended.openjdk_x86-64_linux/../../externalDependency/lib/byte-buddy.jar exists with correct hash, not downloading
[2025-10-22T06:55:55.480Z] /home/jenkins/workspace/Test_openjdk8_hs_extended.openjdk_x86-64_linux/../../externalDependency/lib/commons-cli.jar exists with correct hash, not downloading
[2025-10-22T06:55:55.480Z] /home/jenkins/workspace/Test_openjdk8_hs_extended.openjdk_x86-64_linux/../../externalDependency/lib/asm.jar exists with correct hash, not downloading
[2025-10-22T06:55:55.480Z] /home/jenkins/workspace/Test_openjdk8_hs_extended.openjdk_x86-64_linux/../../externalDependency/lib/jaxb-api.jar exists with correct hash, not downloading
[2025-10-22T06:55:55.480Z] /home/jenkins/workspace/Test_openjdk8_hs_extended.openjdk_x86-64_linux/../../externalDependency/lib/jtreg_7_4_1.tar.gz exists with correct hash, not downloading
[2025-10-22T06:55:55.480Z] /home/jenkins/workspace/Test_openjdk8_hs_extended.openjdk_x86-64_linux/../../externalDependency/lib/jtreg_7_3_1_1.tar.gz exists with correct hash, not downloading
[2025-10-22T06:55:55.480Z] /home/jenkins/workspace/Test_openjdk8_hs_extended.openjdk_x86-64_linux/../../externalDependency/lib/jcstress-tests-all-20240222.jar exists with correct hash, not downloading
[2025-10-22T06:55:55.480Z] /home/jenkins/workspace/Test_openjdk8_hs_extended.openjdk_x86-64_linux/../../externalDependency/lib/jtreg_7_5_2_1.tar.gz exists with correct hash, not downloading
[2025-10-22T06:55:55.480Z] /home/jenkins/workspace/Test_openjdk8_hs_extended.openjdk_x86-64_linux/../../externalDependency/lib/openj9jtregtimeouthandler.jar exists with correct hash, not downloading
[2025-10-22T06:55:55.480Z] /home/jenkins/workspace/Test_openjdk8_hs_extended.openjdk_x86-64_linux/../../externalDependency/lib/objenesis.jar exists with correct hash, not downloading
[2025-10-22T06:55:55.480Z] /home/jenkins/workspace/Test_openjdk8_hs_extended.openjdk_x86-64_linux/../../externalDependency/lib/junit4.jar exists with correct hash, not downloading
[2025-10-22T06:55:55.480Z] /home/jenkins/workspace/Test_openjdk8_hs_extended.openjdk_x86-64_linux/../../externalDependency/lib/json-simple.jar exists with correct hash, not downloading
[2025-10-22T06:55:55.480Z] /home/jenkins/workspace/Test_openjdk8_hs_extended.openjdk_x86-64_linux/../../externalDependency/lib/jcommander.jar exists with correct hash, not downloading
[2025-10-22T06:55:55.480Z] /home/jenkins/workspace/Test_openjdk8_hs_extended.openjdk_x86-64_linux/../../externalDependency/lib/apache-maven-bin.tar.gz exists with correct hash, not downloading
[2025-10-22T06:55:55.480Z] /home/jenkins/workspace/Test_openjdk8_hs_extended.openjdk_x86-64_linux/../../externalDependency/lib/jtreg_5_1_b01.tar.gz exists with correct hash, not downloading
[2025-10-22T06:55:55.480Z] /home/jenkins/workspace/Test_openjdk8_hs_extended.openjdk_x86-64_linux/../../externalDependency/lib/org.eclipse.osgi-3.16.100.jar exists with correct hash, not downloading
[2025-10-22T06:55:55.480Z] /home/jenkins/workspace/Test_openjdk8_hs_extended.openjdk_x86-64_linux/../../externalDependency/lib/byte-buddy-agent.jar exists with correct hash, not downloading
[2025-10-22T06:55:55.480Z] /home/jenkins/workspace/Test_openjdk8_hs_extended.openjdk_x86-64_linux/../../externalDependency/lib/commons-exec.jar exists with correct hash, not downloading
[2025-10-22T06:55:55.480Z] /home/jenkins/workspace/Test_openjdk8_hs_extended.openjdk_x86-64_linux/../../externalDependency/lib/dacapo.zip exists with correct hash, not downloading
[2025-10-22T06:55:55.480Z] /home/jenkins/workspace/Test_openjdk8_hs_extended.openjdk_x86-64_linux/../../externalDependency/lib/testng.jar exists with correct hash, not downloading
[2025-10-22T06:55:55.480Z] /home/jenkins/workspace/Test_openjdk8_hs_extended.openjdk_x86-64_linux/../../externalDependency/lib/asm-all.jar exists with correct hash, not downloading
[2025-10-22T06:55:55.480Z] /home/jenkins/workspace/Test_openjdk8_hs_extended.openjdk_x86-64_linux/../../externalDependency/lib/jtreg_7_5_1_1.tar.gz exists with correct hash, not downloading
[2025-10-22T06:55:55.480Z] /home/jenkins/workspace/Test_openjdk8_hs_extended.openjdk_x86-64_linux/../../externalDependency/lib/jtreg_6_1.tar.gz exists with correct hash, not downloading
[2025-10-22T06:55:55.480Z] /home/jenkins/workspace/Test_openjdk8_hs_extended.openjdk_x86-64_linux/../../externalDependency/lib/jython-standalone.jar exists with correct hash, not downloading
[2025-10-22T06:55:55.480Z] /home/jenkins/workspace/Test_openjdk8_hs_extended.openjdk_x86-64_linux/../../externalDependency/lib/asmtools.jar exists with correct hash, not downloading
[2025-10-22T06:55:55.480Z] /home/jenkins/workspace/Test_openjdk8_hs_extended.openjdk_x86-64_linux/../../externalDependency/lib/javassist.jar exists with correct hash, not downloading
[2025-10-22T06:55:55.480Z] /home/jenkins/workspace/Test_openjdk8_hs_extended.openjdk_x86-64_linux/../../externalDependency/lib/mockito-core.jar exists with correct hash, not downloading
[2025-10-22T06:55:55.480Z] downloaded dependent third party jars successfully
[Pipeline] }
[Pipeline] // timeout
[Pipeline] nodesByLabel
[2025-10-22T06:55:55.918Z] Found a total of 11 nodes with the 'ci.role.test&&hw.arch.x86&&sw.os.linux' label
[Pipeline] sh
[2025-10-22T06:55:57.389Z] + cd ./aqa-tests/TKG
[2025-10-22T06:55:57.389Z] + uname
[2025-10-22T06:55:57.389Z] + [ Linux = AIX ]
[2025-10-22T06:55:57.389Z] + uname
[2025-10-22T06:55:57.389Z] + [ Linux = SunOS ]
[2025-10-22T06:55:57.389Z] + uname
[2025-10-22T06:55:57.389Z] + [ Linux = *BSD ]
[2025-10-22T06:55:57.389Z] + MAKE=make
[2025-10-22T06:55:57.389Z] + make genParallelList TEST=extended.openjdk TEST_TIME=120 NUM_MACHINES=
[2025-10-22T06:55:57.389Z] JAVA_HOME is set to /home/jenkins/workspace/Test_openjdk8_hs_extended.openjdk_x86-64_linux/jdkbinary/j2sdk-image
[2025-10-22T06:55:57.389Z] LIB_DIR is set to /home/jenkins/workspace/Test_openjdk8_hs_extended.openjdk_x86-64_linux/../../externalDependency/lib
[2025-10-22T06:55:57.389Z] rm -f -r /home/jenkins/workspace/Test_openjdk8_hs_extended.openjdk_x86-64_linux/aqa-tests/TKG/../TKG/output_compilation; \
[2025-10-22T06:55:57.389Z] mkdir -p /home/jenkins/workspace/Test_openjdk8_hs_extended.openjdk_x86-64_linux/aqa-tests/TKG/../TKG/output_compilation; \
[2025-10-22T06:55:57.389Z] (ant -f ./scripts/build_tools.xml "-DTEST_JDK_HOME=/home/jenkins/workspace/Test_openjdk8_hs_extended.openjdk_x86-64_linux/jdkbinary/j2sdk-image" "-DTEST_ROOT=/home/jenkins/workspace/Test_openjdk8_hs_extended.openjdk_x86-64_linux/aqa-tests/TKG/.." "-DLIB_DIR=/home/jenkins/workspace/Test_openjdk8_hs_extended.openjdk_x86-64_linux/../../externalDependency/lib" 2>&1; echo $? ) | tee "/home/jenkins/workspace/Test_openjdk8_hs_extended.openjdk_x86-64_linux/aqa-tests/TKG/../TKG/output_compilation/compilation.log"; \
[2025-10-22T06:55:57.389Z] if [ -z "$(tail -1 /home/jenkins/workspace/Test_openjdk8_hs_extended.openjdk_x86-64_linux/aqa-tests/TKG/../TKG/output_compilation/compilation.log | grep 0)" ]; then perl scripts/moveDmp.pl --compileLogPath="/home/jenkins/workspace/Test_openjdk8_hs_extended.openjdk_x86-64_linux/aqa-tests/TKG/../TKG/output_compilation/compilation.log" --testRoot="/home/jenkins/workspace/Test_openjdk8_hs_extended.openjdk_x86-64_linux/aqa-tests/TKG/.."; false; else rm -f -r "/home/jenkins/workspace/Test_openjdk8_hs_extended.openjdk_x86-64_linux/aqa-tests/TKG/../TKG/output_compilation"; fi
[2025-10-22T06:55:57.389Z] Buildfile: /home/jenkins/workspace/Test_openjdk8_hs_extended.openjdk_x86-64_linux/aqa-tests/TKG/scripts/build_tools.xml
[2025-10-22T06:55:57.389Z]
[2025-10-22T06:55:57.389Z] build:
[2025-10-22T06:55:57.389Z]
[2025-10-22T06:55:57.389Z] clean:
[2025-10-22T06:55:57.389Z]
[2025-10-22T06:55:57.389Z] init:
[2025-10-22T06:55:57.389Z] [mkdir] Created dir: /home/jenkins/workspace/Test_openjdk8_hs_extended.openjdk_x86-64_linux/aqa-tests/TKG/bin
[2025-10-22T06:55:57.389Z]
[2025-10-22T06:55:57.389Z] getDependentLibs:
[2025-10-22T06:55:57.389Z] [exec] --------------------------------------------
[2025-10-22T06:55:57.389Z] [exec] path is set to /home/jenkins/workspace/Test_openjdk8_hs_extended.openjdk_x86-64_linux/../../externalDependency/lib
[2025-10-22T06:55:57.389Z] [exec] task is set to default
[2025-10-22T06:55:57.389Z] [exec] dependencyList is set to json_simple
[2025-10-22T06:55:57.390Z] [exec] --------------------------------------------
[2025-10-22T06:55:57.390Z] [exec] Starting download third party dependent jars
[2025-10-22T06:55:57.390Z] [exec] --------------------------------------------
[2025-10-22T06:55:57.390Z] [exec] downloading dependent third party jars to /home/jenkins/workspace/Test_openjdk8_hs_extended.openjdk_x86-64_linux/../../externalDependency/lib
[2025-10-22T06:55:57.390Z] [exec] /home/jenkins/workspace/Test_openjdk8_hs_extended.openjdk_x86-64_linux/../../externalDependency/lib/json-simple.jar exists with correct hash, not downloading
[2025-10-22T06:55:57.390Z] [exec] downloaded dependent third party jars successfully
[2025-10-22T06:55:57.390Z]
[2025-10-22T06:55:57.390Z] compile:
[2025-10-22T06:55:57.390Z] [echo] Ant version is Apache Ant(TM) version 1.10.5 compiled on July 10 2018
[2025-10-22T06:55:57.390Z] [echo] ============COMPILER SETTINGS============
[2025-10-22T06:55:57.390Z] [echo] ===fork: yes
[2025-10-22T06:55:57.390Z] [echo] ===debug: on
[2025-10-22T06:55:57.390Z] [javac] Compiling 28 source files to /home/jenkins/workspace/Test_openjdk8_hs_extended.openjdk_x86-64_linux/aqa-tests/TKG/bin
[2025-10-22T06:55:58.998Z]
[2025-10-22T06:55:58.998Z] dist:
[2025-10-22T06:55:58.998Z] [jar] Building jar: /home/jenkins/workspace/Test_openjdk8_hs_extended.openjdk_x86-64_linux/aqa-tests/TKG/bin/TestKitGen.jar
[2025-10-22T06:55:58.998Z]
[2025-10-22T06:55:58.998Z] BUILD SUCCESSFUL
[2025-10-22T06:55:58.998Z] Total time: 2 seconds
[2025-10-22T06:55:58.998Z] 0
[2025-10-22T06:55:58.998Z] /home/jenkins/workspace/Test_openjdk8_hs_extended.openjdk_x86-64_linux/jdkbinary/j2sdk-image/bin/java -cp ./bin/TestKitGen.jar org.openj9.envInfo.EnvDetector
[2025-10-22T06:55:58.998Z] Unfamiliar microArch detected in TKG. It will not be added in TKG microArch!
[2025-10-22T06:55:58.998Z] microArchOutput: model name : Intel(R) Xeon(R) Platinum 8272CL CPU @ 2.60GHz
[2025-10-22T06:55:59.782Z] ****************************** MACHINE INFO ******************************
[2025-10-22T06:55:59.782Z] File path : /home/jenkins/workspace/Test_openjdk8_hs_extended.openjdk_x86-64_linux/aqa-tests/TKG
[2025-10-22T06:55:59.782Z] Free Physical Memory Size : 1801572352
[2025-10-22T06:55:59.782Z] Free space (bytes) : 281435586560
[2025-10-22T06:55:59.782Z] Total Physical Memory Size : 6442450944
[2025-10-22T06:55:59.782Z] Total space (bytes) : 480790110208
[2025-10-22T06:55:59.782Z] Usable space (bytes) : 259085361152
[2025-10-22T06:55:59.782Z] antVersion : Apache Ant(TM) version 1.10.5 compiled on July 10 2018
[2025-10-22T06:55:59.782Z] bashVersion :
[2025-10-22T06:55:59.782Z] GNU bash, version 5.1.16(1)-release (x86_64-pc-linux-gnu)
[2025-10-22T06:55:59.782Z] Copyright (C) 2020 Free Software Foundation, Inc.
[2025-10-22T06:55:59.782Z] License GPLv3+: GNU GPL version 3 or later <http://gnu.org/licenses/gpl.html>
[2025-10-22T06:55:59.782Z]
[2025-10-22T06:55:59.782Z] This is free software; you are free to change and redistribute it.
[2025-10-22T06:55:59.782Z] There is NO WARRANTY, to the extent permitted by law.
[2025-10-22T06:55:59.782Z] cpuCores : 16
[2025-10-22T06:55:59.782Z] curlVersion :
[2025-10-22T06:55:59.782Z] curl 7.81.0 (x86_64-pc-linux-gnu) libcurl/7.81.0 OpenSSL/3.0.2 zlib/1.2.11 brotli/1.0.9 zstd/1.4.8 libidn2/2.3.2 libpsl/0.21.0 (+libidn2/2.3.2) libssh/0.9.6/openssl/zlib nghttp2/1.43.0 librtmp/2.3 OpenLDAP/2.5.19
[2025-10-22T06:55:59.782Z] Release-Date: 2022-01-05
[2025-10-22T06:55:59.782Z] Protocols: dict file ftp ftps gopher gophers http https imap imaps ldap ldaps mqtt pop3 pop3s rtmp rtsp scp sftp smb smbs smtp smtps telnet tftp
[2025-10-22T06:55:59.782Z] Features: alt-svc AsynchDNS brotli GSS-API HSTS HTTP2 HTTPS-proxy IDN IPv6 Kerberos Largefile libz NTLM NTLM_WB PSL SPNEGO SSL TLS-SRP UnixSockets zstd
[2025-10-22T06:55:59.782Z] dockerVersion : bash: line 1: docker: command not found
[2025-10-22T06:55:59.782Z] gcc version : 11
[2025-10-22T06:55:59.782Z] gclibc version : ldd (Ubuntu GLIBC 2.35-0ubuntu3.11) 2.35
[2025-10-22T06:55:59.782Z] gdb version : bash: line 1: gdb: command not found
[2025-10-22T06:55:59.782Z] lldb version : Command could not be executed
[2025-10-22T06:55:59.782Z] makeVersion :
[2025-10-22T06:55:59.782Z] GNU Make 4.3
[2025-10-22T06:55:59.782Z] Built for x86_64-pc-linux-gnu
[2025-10-22T06:55:59.782Z] Copyright (C) 1988-2020 Free Software Foundation, Inc.
[2025-10-22T06:55:59.782Z] License GPLv3+: GNU GPL version 3 or later <http://gnu.org/licenses/gpl.html>
[2025-10-22T06:55:59.782Z] This is free software: you are free to change and redistribute it.
[2025-10-22T06:55:59.782Z] There is NO WARRANTY, to the extent permitted by law.
[2025-10-22T06:55:59.782Z] mavenVersion : bash: line 1: mvn: command not found
[2025-10-22T06:55:59.782Z] osInfo :
[2025-10-22T06:55:59.782Z] PRETTY_NAME="Ubuntu 22.04.5 LTS"
[2025-10-22T06:55:59.782Z] NAME="Ubuntu"
[2025-10-22T06:55:59.782Z] VERSION_ID="22.04"
[2025-10-22T06:55:59.782Z] VERSION="22.04.5 LTS (Jammy Jellyfish)"
[2025-10-22T06:55:59.782Z] VERSION_CODENAME=jammy
[2025-10-22T06:55:59.782Z] ID=ubuntu
[2025-10-22T06:55:59.782Z] ID_LIKE=debian
[2025-10-22T06:55:59.782Z] HOME_URL="https://www.ubuntu.com/"
[2025-10-22T06:55:59.782Z] SUPPORT_URL="https://help.ubuntu.com/"
[2025-10-22T06:55:59.782Z] BUG_REPORT_URL="https://bugs.launchpad.net/ubuntu/"
[2025-10-22T06:55:59.782Z] PRIVACY_POLICY_URL="https://www.ubuntu.com/legal/terms-and-policies/privacy-policy"
[2025-10-22T06:55:59.782Z] UBUNTU_CODENAME=jammy
[2025-10-22T06:55:59.782Z] osLabel : ubuntu.22
[2025-10-22T06:55:59.782Z] perlVersion :
[2025-10-22T06:55:59.782Z]
[2025-10-22T06:55:59.782Z] This is perl 5, version 34, subversion 0 (v5.34.0) built for x86_64-linux-gnu-thread-multi
[2025-10-22T06:55:59.782Z] (with 67 registered patches, see perl -V for more detail)
[2025-10-22T06:55:59.782Z]
[2025-10-22T06:55:59.782Z] Copyright 1987-2021, Larry Wall
[2025-10-22T06:55:59.782Z]
[2025-10-22T06:55:59.782Z] Perl may be copied only under the terms of either the Artistic License or the
[2025-10-22T06:55:59.782Z] GNU General Public License, which may be found in the Perl 5 source kit.
[2025-10-22T06:55:59.782Z]
[2025-10-22T06:55:59.782Z] Complete documentation for Perl, including FAQ lists, should be found on
[2025-10-22T06:55:59.782Z] this system using "man perl" or "perldoc perl". If you have access to the
[2025-10-22T06:55:59.782Z] Internet, point your browser at http://www.perl.org/, the Perl Home Page.
[2025-10-22T06:55:59.782Z]
[2025-10-22T06:55:59.782Z] podmanVersion : bash: line 1: podman: command not found
[2025-10-22T06:55:59.782Z] procArch : x86_64
[2025-10-22T06:55:59.782Z] sysArch : x86_64
[2025-10-22T06:55:59.782Z] sysOS : Linux
[2025-10-22T06:55:59.782Z] ulimit :
[2025-10-22T06:55:59.782Z] real-time non-blocking time (microseconds, -R) unlimited
[2025-10-22T06:55:59.782Z] core file size (blocks, -c) unlimited
[2025-10-22T06:55:59.782Z] data seg size (kbytes, -d) unlimited
[2025-10-22T06:55:59.782Z] scheduling priority (-e) 0
[2025-10-22T06:55:59.782Z] file size (blocks, -f) unlimited
[2025-10-22T06:55:59.782Z] pending signals (-i) 257167
[2025-10-22T06:55:59.782Z] max locked memory (kbytes, -l) 8192
[2025-10-22T06:55:59.782Z] max memory size (kbytes, -m) unlimited
[2025-10-22T06:55:59.782Z] open files (-n) 1048576
[2025-10-22T06:55:59.782Z] pipe size (512 bytes, -p) 8
[2025-10-22T06:55:59.782Z] POSIX message queues (bytes, -q) 819200
[2025-10-22T06:55:59.782Z] real-time priority (-r) 0
[2025-10-22T06:55:59.782Z] stack size (kbytes, -s) 8192
[2025-10-22T06:55:59.782Z] cpu time (seconds, -t) unlimited
[2025-10-22T06:55:59.782Z] max user processes (-u) unlimited
[2025-10-22T06:55:59.782Z] virtual memory (kbytes, -v) unlimited
[2025-10-22T06:55:59.782Z] file locks (-x) unlimited
[2025-10-22T06:55:59.782Z] uname : Linux 54fffb56b639 6.8.0-1018-azure #21~22.04.1-Ubuntu SMP Fri Nov 8 00:21:25 UTC 2024 x86_64 x86_64 x86_64 GNU/Linux
[2025-10-22T06:55:59.782Z] vmVendor : Oracle Corporation
[2025-10-22T06:55:59.782Z] vmVersion : 25.472-b08
[2025-10-22T06:55:59.782Z] xlc version : bash: line 1: xlC: command not found
[2025-10-22T06:55:59.782Z] **************************************************************************
[2025-10-22T06:55:59.782Z]
[2025-10-22T06:55:59.782Z] System.getProperty('java.vm.name')=OpenJDK 64-Bit Server VM
[2025-10-22T06:55:59.782Z]
[2025-10-22T06:55:59.782Z] System.getProperty('java.vendor')=Temurin
[2025-10-22T06:55:59.782Z]
[2025-10-22T06:55:59.782Z] System.getProperty('os.name')=Linux
[2025-10-22T06:55:59.782Z]
[2025-10-22T06:55:59.782Z] System.getProperty('os.arch')=amd64
[2025-10-22T06:55:59.782Z]
[2025-10-22T06:55:59.782Z] System.getProperty('java.fullversion')=null
[2025-10-22T06:55:59.782Z]
[2025-10-22T06:55:59.782Z] System.getProperty('sun.arch.data.model')=64
[2025-10-22T06:55:59.782Z]
[2025-10-22T06:55:59.782Z] make -f makeGen.mk AUTO_DETECT=true MODE=parallelList NUM_MACHINES= TEST_TIME=120 TESTTARGET=extended.openjdk TESTLIST= TRSS_URL= LIB_DIR=/home/jenkins/workspace/Test_openjdk8_hs_extended.openjdk_x86-64_linux/../../externalDependency/lib
[2025-10-22T06:55:59.782Z] make[1]: Entering directory '/home/jenkins/workspace/Test_openjdk8_hs_extended.openjdk_x86-64_linux/aqa-tests/TKG'
[2025-10-22T06:55:59.782Z] perl scripts/configure.pl
[2025-10-22T06:55:59.783Z] /home/jenkins/workspace/Test_openjdk8_hs_extended.openjdk_x86-64_linux/jdkbinary/j2sdk-image/bin/java -cp "./bin/TestKitGen.jar:/home/jenkins/workspace/Test_openjdk8_hs_extended.openjdk_x86-64_linux/../../externalDependency/lib/json-simple.jar" org.testKitGen.MainRunner --mode=parallelList --spec=linux_x86-64 --microArch="" --osLabel="ubuntu.22" --jdkVersion=8 --impl=hotspot --vendor="temurin" --buildList=openjdk --iterations=1 --aotIterations= --testFlag= --testTarget=extended.openjdk --testList= --numOfMachines= --testTime=120 --TRSSURL=
[2025-10-22T06:55:59.783Z] Modes data parsed from resources/modes.xml and resources/ottawa.csv.
[2025-10-22T06:55:59.783Z]
[2025-10-22T06:55:59.783Z]
[2025-10-22T06:55:59.783Z] Starting to generate parallel test lists.
[2025-10-22T06:55:59.783Z]
[2025-10-22T06:56:00.561Z] Parsing /home/jenkins/workspace/Test_openjdk8_hs_extended.openjdk_x86-64_linux/aqa-tests/TKG/../openjdk/playlist.xml
[2025-10-22T06:56:00.561Z] Attempting to get test duration data from TRSS.
[2025-10-22T06:56:00.561Z] curl --silent --max-time 120 -L -k https://trss.adoptopenjdk.net/api/getTestAvgDuration?limit=10&jdkVersion=8&impl=hs&platform=x86-64_linux&group=openjdk&level=extended
[2025-10-22T06:56:00.561Z] Attempting to get test duration data from cached files.
[2025-10-22T06:56:00.561Z] Reading file: Test_openjdk8_hs_openjdk_x86-64_linux.json
[2025-10-22T06:56:00.561Z] Warning: cannot get data from cached files.
[2025-10-22T06:56:00.561Z]
[2025-10-22T06:56:00.561Z] TEST DURATION
[2025-10-22T06:56:00.561Z] ====================================================================================
[2025-10-22T06:56:00.561Z] Total number of tests searched: 64
[2025-10-22T06:56:00.561Z] Number of test durations found: 64
[2025-10-22T06:56:00.561Z] Top slowest tests:
[2025-10-22T06:56:00.561Z] 22m26s hotspot_jdk_0
[2025-10-22T06:56:00.561Z] 17m03s jdk_security3_1
[2025-10-22T06:56:00.561Z] 17m01s jdk_security3_0
[2025-10-22T06:56:00.561Z] ====================================================================================
[2025-10-22T06:56:00.561Z]
[2025-10-22T06:56:00.561Z] Test target is split into 2 lists.
[2025-10-22T06:56:00.561Z] Reducing estimated test running time from 232m08s to 116m20s.
[2025-10-22T06:56:00.561Z]
[2025-10-22T06:56:00.561Z] -------------------------------------testList_0-------------------------------------
[2025-10-22T06:56:00.561Z] Number of tests: 9
[2025-10-22T06:56:00.561Z] Estimated running time: 116m20s
[2025-10-22T06:56:00.561Z] TESTLIST=hotspot_jdk_0,jdk_security3_1,jdk_security3_0,jdk_other_1,jdk_other_0,jdk_jfr_0,jdk_jfr_1,jdk_management_1,jdk_text_0
[2025-10-22T06:56:00.561Z] ------------------------------------------------------------------------------------
[2025-10-22T06:56:00.561Z]
[2025-10-22T06:56:00.561Z] -------------------------------------testList_1-------------------------------------
[2025-10-22T06:56:00.561Z] Number of tests: 55
[2025-10-22T06:56:00.561Z] Estimated running time: 115m47s
[2025-10-22T06:56:00.561Z] TESTLIST=jdk_nio_0,jdk_nio_1,jdk_net_0,jdk_net_1,jdk_rmi_0,jdk_rmi_1,jdk_jmx_0,jdk_jmx_1,jdk_beans_1,jdk_beans_0,jdk_tools_0,jdk_tools_1,jdk_instrument_1,jdk_instrument_0,jdk_imageio_1,jdk_imageio_0,jdk_time_1,jdk_time_0,jdk_io_0,jdk_io_1,jdk_management_0,jdk_text_1,jdk_sound_2,jdk_sound_0,jdk_security_infra_2,jdk_awt_1,jdk_swing_2,jdk_swing_1,jdk_swing_0,jdk_awt_2,jdk_2d_2,jdk_2d_0,jdk_sound_1,jdk_security_infra_1,jdk_security_infra_0,jdk_awt_0,jdk_2d_1,jdk_tools_2,jdk_time_2,jdk_text_2,jdk_security_infra_zos_2,jdk_security_infra_zos_1,jdk_security_infra_zos_0,jdk_nio_2,jdk_net_2,jdk_jmx_2,jdk_jfr_2,jdk_instrument_2,jdk_imageio_2,jdk_beans_2,jdk_other_2,jdk_management_2,jdk_security3_2,jdk_rmi_2,jdk_io_2
[2025-10-22T06:56:00.561Z] ------------------------------------------------------------------------------------
[2025-10-22T06:56:00.561Z]
[2025-10-22T06:56:00.561Z] Parallel test lists file (/home/jenkins/workspace/Test_openjdk8_hs_extended.openjdk_x86-64_linux/aqa-tests/TKG/../TKG/parallelList.mk) is generated successfully.
[2025-10-22T06:56:00.561Z] make[1]: Leaving directory '/home/jenkins/workspace/Test_openjdk8_hs_extended.openjdk_x86-64_linux/aqa-tests/TKG'
[Pipeline] fileExists
[Pipeline] echo
[2025-10-22T06:56:01.099Z] read parallelList.mk file: aqa-tests/TKG/parallelList.mk
[Pipeline] readProperties
[Pipeline] echo
[2025-10-22T06:56:01.511Z] Saving parallelList.mk file on jenkins...
[Pipeline] dir
[2025-10-22T06:56:01.513Z] Running in /home/jenkins/workspace/Test_openjdk8_hs_extended.openjdk_x86-64_linux/aqa-tests/TKG
[Pipeline] {
[Pipeline] archiveArtifacts
[2025-10-22T06:56:01.663Z] Archiving artifacts
[2025-10-22T06:56:01.936Z] Recording fingerprints
[Pipeline] }
[Pipeline] // dir
[Pipeline] echo
[2025-10-22T06:56:02.132Z] [PARALLEL: Dynamic] childJobNum is 2, creating jobs and running them in parallel...
Did you forget the `def` keyword? Script1 seems to be setting a field named create_jobs (to a value of type LinkedHashMap) which could lead to memory leaks or other issues.
Did you forget the `def` keyword? Script1 seems to be setting a field named parallelTestParams (to a value of type LinkedHashMap) which could lead to memory leaks or other issues.
[Pipeline] parallel
[Pipeline] { (Branch: testList_0)
[Pipeline] { (Branch: testList_1)
[Pipeline] echo
[2025-10-22T06:56:02.546Z] GENERATE_JOBS is set to true, set test job Test_openjdk8_hs_extended.openjdk_x86-64_linux_testList_0 params for generating the job
[Pipeline] echo
[2025-10-22T06:56:02.552Z] GENERATE_JOBS is set to true, set test job Test_openjdk8_hs_extended.openjdk_x86-64_linux_testList_1 params for generating the job
[Pipeline] fileExists
[Pipeline] fileExists
[Pipeline] jobDsl
[Pipeline] jobDsl
[2025-10-22T06:56:03.368Z] Processing DSL script aqa-tests/buildenv/jenkins/testJobTemplate
[2025-10-22T06:56:03.496Z] Processing DSL script aqa-tests/buildenv/jenkins/testJobTemplate
[2025-10-22T07:00:46.763Z] LEVELS: [extended]
[2025-10-22T07:00:46.763Z] JDK_VERSIONS: [8]
[2025-10-22T07:00:46.763Z] GROUPS: [openjdk]
[2025-10-22T07:00:46.763Z] ARCH_OS_LIST: [x86-64_linux]
[2025-10-22T07:00:46.766Z] LEVELS: [extended]
[2025-10-22T07:00:46.771Z] JDK_VERSIONS: [8]
[2025-10-22T07:00:46.771Z] GROUPS: [openjdk]
[2025-10-22T07:00:46.771Z] ARCH_OS_LIST: [x86-64_linux]
[2025-10-22T07:00:46.999Z] Existing items:
[2025-10-22T07:00:46.999Z] GeneratedJob{name='Test_openjdk8_hs_extended.openjdk_x86-64_linux_testList_0'}
[2025-10-22T07:00:46.999Z] Unreferenced items:
[2025-10-22T07:00:46.999Z] GeneratedJob{name='Test_openjdk8_hs_extended.openjdk_x86-64_linux_rerun'}
[2025-10-22T07:00:46.999Z] GeneratedJob{name='Test_openjdk8_hs_extended.openjdk_x86-64_linux_testList_1'}
[2025-10-22T07:00:46.999Z] GeneratedJob{name='Test_openjdk8_hs_extended.openjdk_x86-64_linux_testList_2'}
[2025-10-22T07:00:47.024Z] Existing items:
[2025-10-22T07:00:47.025Z] GeneratedJob{name='Test_openjdk8_hs_extended.openjdk_x86-64_linux_testList_0'}
[2025-10-22T07:00:47.025Z] GeneratedJob{name='Test_openjdk8_hs_extended.openjdk_x86-64_linux_testList_1'}
[2025-10-22T07:00:47.025Z] Unreferenced items:
[2025-10-22T07:00:47.025Z] GeneratedJob{name='Test_openjdk8_hs_extended.openjdk_x86-64_linux_rerun'}
[2025-10-22T07:00:47.025Z] GeneratedJob{name='Test_openjdk8_hs_extended.openjdk_x86-64_linux_testList_2'}
[Pipeline] }
[Pipeline] }
[Pipeline] // parallel
[Pipeline] }
[Pipeline] // stage
[Pipeline] echo
[2025-10-22T07:09:01.440Z] PROCESSCATCH: Terminating any hung/left over test processes:
[Pipeline] sh
[2025-10-22T07:09:02.975Z] + aqa-tests/terminateTestProcesses.sh jenkins
[2025-10-22T07:09:02.975Z] Unix type machine..
[2025-10-22T07:09:02.975Z] Running on a Linux host
[2025-10-22T07:09:02.975Z] Woohoo - no rogue processes detected!
[Pipeline] cleanWs
[2025-10-22T07:09:03.633Z] [WS-CLEANUP] Deleting project workspace...
[2025-10-22T07:09:03.633Z] [WS-CLEANUP] Deferred wipeout is disabled by the job configuration...
[2025-10-22T07:09:07.524Z] [WS-CLEANUP] done
[Pipeline] sh
[2025-10-22T07:09:09.408Z] + find /tmp -name *core* -print -exec rm -f {} ;
[Pipeline] }
[Pipeline] // timeout
[Pipeline] timeout
[2025-10-22T07:09:10.245Z] Timeout set to expire in 5 min 0 sec
[Pipeline] {
[Pipeline] }
[Pipeline] // timeout
[Pipeline] }
[Pipeline] // node
[Pipeline] }
[Pipeline] // stage
[Pipeline] stage
[Pipeline] { (Parallel Tests)
[Pipeline] parallel
[Pipeline] { (Branch: testList_0)
[Pipeline] { (Branch: testList_1)
[Pipeline] build
[2025-10-22T07:09:10.423Z] Scheduling project: Test_openjdk8_hs_extended.openjdk_x86-64_linux_testList_0
[Pipeline] build
[2025-10-22T07:09:10.434Z] Scheduling project: Test_openjdk8_hs_extended.openjdk_x86-64_linux_testList_1
[2025-10-22T07:09:20.701Z] Starting building: Test_openjdk8_hs_extended.openjdk_x86-64_linux_testList_0 #45
[2025-10-22T07:09:20.707Z] Starting building: Test_openjdk8_hs_extended.openjdk_x86-64_linux_testList_1 #45
[2025-10-22T09:39:13.906Z] Build Test_openjdk8_hs_extended.openjdk_x86-64_linux_testList_0 #45 completed: UNSTABLE
[Pipeline] }
[2025-10-22T10:46:57.025Z] Build Test_openjdk8_hs_extended.openjdk_x86-64_linux_testList_1 #45 completed: UNSTABLE
[Pipeline] }
[Pipeline] // parallel
[Pipeline] node
[2025-10-22T10:46:57.367Z] Running on test-docker-alpine320-armv8-2 in /home/jenkins/workspace/Test_openjdk8_hs_extended.openjdk_x86-64_linux
[Pipeline] {
[Pipeline] cleanWs
[2025-10-22T10:46:57.742Z] [WS-CLEANUP] Deleting project workspace...
[2025-10-22T10:46:57.742Z] [WS-CLEANUP] Deferred wipeout is disabled by the job configuration...
[2025-10-22T10:46:57.917Z] [WS-CLEANUP] done
[Pipeline] echo
[2025-10-22T10:46:57.941Z] Test_openjdk8_hs_extended.openjdk_x86-64_linux_testList_0 #45 completed with status UNSTABLE
[Pipeline] timeout
[2025-10-22T10:46:57.960Z] Timeout set to expire in 1 hr 0 min
[Pipeline] {
[Pipeline] copyArtifacts
[2025-10-22T10:46:59.044Z] Copied 1 artifact from "Test_openjdk8_hs_extended.openjdk_x86-64_linux_testList_0" build number 45
[Pipeline] }
[Pipeline] // timeout
[Pipeline] echo
[2025-10-22T10:46:59.090Z] Saving Test_openjdk8_hs_extended.openjdk_x86-64_linux_testList_0/45/**/*.tap file on jenkins.
[Pipeline] archiveArtifacts
[2025-10-22T10:46:59.272Z] Archiving artifacts
[2025-10-22T10:46:59.633Z] Recording fingerprints
[Pipeline] echo
[2025-10-22T10:46:59.837Z] Test_openjdk8_hs_extended.openjdk_x86-64_linux_testList_1 #45 completed with status UNSTABLE
[Pipeline] timeout
[2025-10-22T10:46:59.853Z] Timeout set to expire in 1 hr 0 min
[Pipeline] {
[Pipeline] copyArtifacts
[2025-10-22T10:47:00.935Z] Copied 1 artifact from "Test_openjdk8_hs_extended.openjdk_x86-64_linux_testList_1" build number 45
[Pipeline] }
[Pipeline] // timeout
[Pipeline] echo
[2025-10-22T10:47:00.983Z] Saving Test_openjdk8_hs_extended.openjdk_x86-64_linux_testList_1/45/**/*.tap file on jenkins.
[Pipeline] archiveArtifacts
[2025-10-22T10:47:01.164Z] Archiving artifacts
[2025-10-22T10:47:01.528Z] Recording fingerprints
[Pipeline] findFiles
[Pipeline] echo
[2025-10-22T10:47:02.469Z] Tap file found: Test_openjdk8_hs_extended.openjdk_x86-64_linux_testList_0/45/aqa-tests/TKG/output_17611205935498/Test_openjdk8_hs_extended.openjdk_x86-64_linux_testList_0.tap...
[Pipeline] readFile
[Pipeline] findFiles
[Pipeline] echo
[2025-10-22T10:47:03.379Z] Tap file found: Test_openjdk8_hs_extended.openjdk_x86-64_linux_testList_1/45/aqa-tests/TKG/output_17611223031115/Test_openjdk8_hs_extended.openjdk_x86-64_linux_testList_1.tap...
[Pipeline] readFile
[Pipeline] cleanWs
[2025-10-22T10:47:04.045Z] [WS-CLEANUP] Deleting project workspace...
[2025-10-22T10:47:04.045Z] [WS-CLEANUP] Deferred wipeout is disabled by the job configuration...
[2025-10-22T10:47:04.224Z] [WS-CLEANUP] done
[Pipeline] }
[Pipeline] // node
[Pipeline] }
[Pipeline] // stage
[Pipeline] stage
[Pipeline] { (Rerun)
[Pipeline] echo
[2025-10-22T10:47:04.309Z] allocate a node for generating rerun job ...
[Pipeline] node
[2025-10-22T10:47:04.341Z] Running on test-docker-alpine320-armv8-2 in /home/jenkins/workspace/Test_openjdk8_hs_extended.openjdk_x86-64_linux
[Pipeline] {
[Pipeline] echo
[2025-10-22T10:47:04.360Z] Generating rerun Test_openjdk8_hs_extended.openjdk_x86-64_linux_rerun job for running failed test(s) ...
[Pipeline] parallel
[Pipeline] { (Branch: Test_openjdk8_hs_extended.openjdk_x86-64_linux_rerun)
[Pipeline] echo
[2025-10-22T10:47:04.399Z] GENERATE_JOBS is set to true, set test job Test_openjdk8_hs_extended.openjdk_x86-64_linux_rerun params for generating the job
[Pipeline] fileExists
[Pipeline] sh
[2025-10-22T10:47:06.489Z] + curl -Os https://raw.githubusercontent.com/adoptium/aqa-tests/master/buildenv/jenkins/testJobTemplate
[Pipeline] jobDsl
[2025-10-22T10:47:08.848Z] Processing DSL script testJobTemplate
[2025-10-22T10:51:52.850Z] LEVELS: [extended]
[2025-10-22T10:51:52.850Z] JDK_VERSIONS: [8]
[2025-10-22T10:51:52.850Z] GROUPS: [openjdk]
[2025-10-22T10:51:52.850Z] ARCH_OS_LIST: [x86-64_linux]
[2025-10-22T10:51:53.093Z] Existing items:
[2025-10-22T10:51:53.093Z] GeneratedJob{name='Test_openjdk8_hs_extended.openjdk_x86-64_linux_rerun'}
[2025-10-22T10:51:53.093Z] GeneratedJob{name='Test_openjdk8_hs_extended.openjdk_x86-64_linux_testList_0'}
[2025-10-22T10:51:53.093Z] GeneratedJob{name='Test_openjdk8_hs_extended.openjdk_x86-64_linux_testList_1'}
[2025-10-22T10:51:53.093Z] Unreferenced items:
[2025-10-22T10:51:53.093Z] GeneratedJob{name='Test_openjdk8_hs_extended.openjdk_x86-64_linux_testList_2'}
[Pipeline] }
[Pipeline] // parallel
[Pipeline] }
[Pipeline] // node
[Pipeline] echo
[2025-10-22T10:55:55.855Z] Triggering rerun jobs in parallel ...
[Pipeline] parallel
[Pipeline] { (Branch: Test_openjdk8_hs_extended.openjdk_x86-64_linux_rerun)
[Pipeline] build
[2025-10-22T10:55:55.886Z] Scheduling project: Test_openjdk8_hs_extended.openjdk_x86-64_linux_rerun
[2025-10-22T10:56:01.142Z] Starting building: Test_openjdk8_hs_extended.openjdk_x86-64_linux_rerun #54
[2025-10-22T11:40:37.711Z] Build Test_openjdk8_hs_extended.openjdk_x86-64_linux_rerun #54 completed: UNSTABLE
[Pipeline] }
[Pipeline] // parallel
[Pipeline] node
[2025-10-22T11:40:37.778Z] Running on test-ibmcloud-rhel6-x64-1 in /home/jenkins/workspace/Test_openjdk8_hs_extended.openjdk_x86-64_linux
[Pipeline] {
[Pipeline] cleanWs
[2025-10-22T11:40:38.002Z] [WS-CLEANUP] Deleting project workspace...
[2025-10-22T11:40:38.002Z] [WS-CLEANUP] Deferred wipeout is disabled by the job configuration...
[2025-10-22T11:40:38.107Z] [WS-CLEANUP] done
[Pipeline] echo
[2025-10-22T11:40:38.119Z] Test_openjdk8_hs_extended.openjdk_x86-64_linux_rerun #54 completed with status UNSTABLE
[Pipeline] timeout
[2025-10-22T11:40:38.141Z] Timeout set to expire in 1 hr 0 min
[Pipeline] {
[Pipeline] copyArtifacts
[2025-10-22T11:40:38.818Z] Copied 1 artifact from "Test_openjdk8_hs_extended.openjdk_x86-64_linux_rerun" build number 54
[Pipeline] }
[Pipeline] // timeout
[Pipeline] echo
[2025-10-22T11:40:38.851Z] Saving Test_openjdk8_hs_extended.openjdk_x86-64_linux_rerun/54/**/*.tap file on jenkins.
[Pipeline] archiveArtifacts
[2025-10-22T11:40:38.964Z] Archiving artifacts
[2025-10-22T11:40:39.184Z] Recording fingerprints
[Pipeline] findFiles
[Pipeline] echo
[2025-10-22T11:40:39.795Z] Tap file found: Test_openjdk8_hs_extended.openjdk_x86-64_linux_rerun/54/aqa-tests/TKG/output_1761133187586/Test_openjdk8_hs_extended.openjdk_x86-64_linux_rerun.tap...
[Pipeline] readFile
[Pipeline] echo
[2025-10-22T11:40:40.051Z] Rerun failed jdk test cases in Grinder with jdk_custom target: https://ci.adoptium.net/job/Grinder/parambuild/?SDK_RESOURCE=upstream&TARGET=jdk_custom&BASE_DOCKER_REGISTRY_CREDENTIAL_ID=&TEST_FLAG=&UPSTREAM_TEST_JOB_NAME=&DOCKER_REQUIRED=false&ACTIVE_NODE_TIMEOUT=5&VENDOR_TEST_DIRS=&EXTRA_DOCKER_ARGS=&TKG_OWNER_BRANCH=adoptium%3Amaster&OPENJ9_SYSTEMTEST_OWNER_BRANCH=eclipse%3Amaster&PLATFORM=x86-64_linux&GENERATE_JOBS=true&KEEP_REPORTDIR=true&PERSONAL_BUILD=false&DOCKER_REGISTRY_DIR=&RERUN_ITERATIONS=0&ADOPTOPENJDK_REPO=https%3A%2F%2Fgithub.com%2Fadoptium%2Faqa-tests.git&SETUP_JCK_RUN=false&DOCKER_REGISTRY_URL_CREDENTIAL_ID=&LABEL=&EXTRA_OPTIONS=&CUSTOMIZED_SDK_URL=&BUILD_IDENTIFIER=&JENKINS_KEY=&ADOPTOPENJDK_BRANCH=v1.0.10-release&LIGHT_WEIGHT_CHECKOUT=false&USE_JRE=false&ARTIFACTORY_SERVER=&KEEP_WORKSPACE=false&USER_CREDENTIALS_ID=&JDK_VERSION=8&DOCKER_REGISTRY_URL=&ITERATIONS=1&VENDOR_TEST_REPOS=&JDK_REPO=https%3A%2F%2Fgithub.com%2Fadoptium%2Fjdk8u&JCK_GIT_BRANCH=master&OPENJ9_BRANCH=master&OPENJ9_SHA=&JCK_GIT_REPO=&VENDOR_TEST_BRANCHES=&UPSTREAM_JOB_NAME=build-scripts%2Fjobs%2Frelease%2Fjobs%2Fjdk8u%2Fjdk8u-release-linux-x64-temurin&OPENJ9_REPO=https%3A%2F%2Fgithub.com%2Feclipse-openj9%2Fopenj9.git&CLOUD_PROVIDER=&CUSTOM_TARGET=jdk%2Fjfr%2Fevent%2Fsampling%2FTestNative.java&VENDOR_TEST_SHAS=&JDK_BRANCH=jdk8u472-b08_adopt&LABEL_ADDITION=&ARTIFACTORY_REPO=&ARTIFACTORY_ROOT_DIR=&UPSTREAM_TEST_JOB_NUMBER=&DOCKERIMAGE_TAG=&TEST_TIME=120&JDK_IMPL=hotspot&SSH_AGENT_CREDENTIAL=&AUTO_DETECT=true&SLACK_CHANNEL=aqavit-bot&DYNAMIC_COMPILE=false&RELATED_NODES=&ADOPTOPENJDK_SYSTEMTEST_OWNER_BRANCH=adoptium%3Amaster&APPLICATION_OPTIONS=&CUSTOMIZED_SDK_URL_CREDENTIAL_ID=eclipse_temurin_bot_email_and_token&ARCHIVE_TEST_RESULTS=false&NUM_MACHINES=&OPENJDK_SHA=&TRSS_URL=&RERUN_FAILURE=false&USE_TESTENV_PROPERTIES=true&BUILD_LIST=openjdk&ADDITIONAL_ARTIFACTS_REQUIRED=&UPSTREAM_JOB_NUMBER=31&STF_OWNER_BRANCH=adoptium%3Amaster&TIME_LIMIT=25&JVM_OPTIONS=&PARALLEL=None
[Pipeline] cleanWs
[2025-10-22T11:40:40.295Z] [WS-CLEANUP] Deleting project workspace...
[2025-10-22T11:40:40.295Z] [WS-CLEANUP] Deferred wipeout is disabled by the job configuration...
[2025-10-22T11:40:40.404Z] [WS-CLEANUP] done
[Pipeline] }
[Pipeline] // node
[Pipeline] }
[Pipeline] // stage
[Pipeline] }
[Pipeline] // timestamps
[Pipeline] End of Pipeline
Finished: UNSTABLE