Post Test
[2024-08-30T21:10:04.594Z] make[5]: Leaving directory '/cygdrive/c/workspace/workspace/Test_openjdk21_hs_dev.system_x86-64_windows_testList_1/aqa-tests/system/reproducibleCompare'
[2024-08-30T21:10:04.594Z] make[4]: Leaving directory '/cygdrive/c/workspace/workspace/Test_openjdk21_hs_dev.system_x86-64_windows_testList_1/aqa-tests/system'
[2024-08-30T21:10:04.594Z] make[3]: Leaving directory '/cygdrive/c/workspace/workspace/Test_openjdk21_hs_dev.system_x86-64_windows_testList_1/aqa-tests'
[2024-08-30T21:10:04.594Z]
[2024-08-30T21:10:04.594Z]
[2024-08-30T21:10:04.912Z] All tests finished, run result summary:
[2024-08-30T21:10:04.912Z] cd "C:/workspace/workspace/Test_openjdk21_hs_dev.system_x86-64_windows_testList_1/aqa-tests/\\TKG\\scripts"; \
[2024-08-30T21:10:04.912Z] perl "resultsSum.pl" --failuremk="C:/workspace/workspace/Test_openjdk21_hs_dev.system_x86-64_windows_testList_1/aqa-tests/\\TKG\\failedtargets.mk" --resultFile="C:/workspace/workspace/Test_openjdk21_hs_dev.system_x86-64_windows_testList_1/aqa-tests/\\TKG\\output_17250519877336\\TestTargetResult" --platFile="C:/workspace/workspace/Test_openjdk21_hs_dev.system_x86-64_windows_testList_1/aqa-tests/\\TKG\\resources\\buildPlatformMap.properties" --diagnostic=failure --jdkVersion=21 --jdkImpl=hotspot --jdkVendor="eclipse" --spec=win_x86-64 --buildList=system --customTarget="" --testTarget=testList --tapPath=C:/workspace/workspace/Test_openjdk21_hs_dev.system_x86-64_windows_testList_1/aqa-tests/\\TKG\\output_17250519877336\\ --tapName=Test_openjdk21_hs_dev.system_x86-64_windows_testList_1.tap --comment=""
[2024-08-30T21:10:05.231Z]
[2024-08-30T21:10:05.231Z]
[2024-08-30T21:10:05.231Z] TEST TARGETS SUMMARY
[2024-08-30T21:10:05.231Z] ++++++++++++++++++++++++++++++++++++++++++++++++++++++++++++++++++++++++++
[2024-08-30T21:10:05.231Z] DISABLED test targets:
[2024-08-30T21:10:05.231Z] churn_custom_0
[2024-08-30T21:10:05.231Z] jcstress.all_0
[2024-08-30T21:10:05.231Z] jcstress.mxbeans_0
[2024-08-30T21:10:05.231Z] jcstress.threadlocal_0
[2024-08-30T21:10:05.231Z] jcstress.collections_0
[2024-08-30T21:10:05.231Z] jcstress.sample_0
[2024-08-30T21:10:05.231Z] jcstress.future_0
[2024-08-30T21:10:05.231Z] jcstress.executors_0
[2024-08-30T21:10:05.231Z] jcstress.varhandles_0
[2024-08-30T21:10:05.231Z] jcstress.unsafe_0
[2024-08-30T21:10:05.231Z] jcstress.oota_0
[2024-08-30T21:10:05.231Z] jcstress.interrupt_0
[2024-08-30T21:10:05.231Z] jcstress.fences_0
[2024-08-30T21:10:05.231Z] jcstress.strings_0
[2024-08-30T21:10:05.231Z] jcstress.countdownlatch_0
[2024-08-30T21:10:05.231Z] jcstress.atomics_0
[2024-08-30T21:10:05.231Z] jcstress.copy.clone_0
[2024-08-30T21:10:05.231Z] jcstress.copy.manual_0
[2024-08-30T21:10:05.231Z] jcstress.singletons_0
[2024-08-30T21:10:05.231Z] jcstress.defaultValues_0
[2024-08-30T21:10:05.231Z] jcstress.defaultValues.arrays_0
[2024-08-30T21:10:05.231Z] jcstress.init.arrays_0
[2024-08-30T21:10:05.231Z] jcstress.initClass_0
[2024-08-30T21:10:05.231Z] jcstress.initClass.arrays_0
[2024-08-30T21:10:05.231Z] jcstress.initLen.arrays_0
[2024-08-30T21:10:05.231Z] jcstress.locks_0
[2024-08-30T21:10:05.231Z] jcstress.volatiles_0
[2024-08-30T21:10:05.231Z] jcstress.causality_0
[2024-08-30T21:10:05.231Z] jcstress.init_0
[2024-08-30T21:10:05.231Z] jcstress.accessAtomic_0
[2024-08-30T21:10:05.231Z] jcstress.accessAtomic.fields_0
[2024-08-30T21:10:05.231Z] jcstress.coherence_0
[2024-08-30T21:10:05.231Z] jcstress.tearing.arrays_0
[2024-08-30T21:10:05.231Z] jcstress.copy.arraycopy.arrays_0
[2024-08-30T21:10:05.231Z] jcstress.copy.clone.arrays_0
[2024-08-30T21:10:05.231Z] jcstress.copy.copyof.arrays_0
[2024-08-30T21:10:05.231Z] jcstress.copy.manual.arrays_0
[2024-08-30T21:10:05.231Z] jcstress.accessAtomic.varHandles.byteArray_0
[2024-08-30T21:10:05.231Z] jcstress.accessAtomic.varHandles.byteBuffer.direct_0
[2024-08-30T21:10:05.231Z] jcstress.accessAtomic.varHandles.byteBuffer.heap_0
[2024-08-30T21:10:05.231Z] jcstress.coherence.varHandles.byteArray_0
[2024-08-30T21:10:05.231Z] jcstress.coherence.varHandles.byteBuffer.direct_0
[2024-08-30T21:10:05.231Z] jcstress.coherence.varHandles.byteBuffer.heap_0
[2024-08-30T21:10:05.231Z] jcstress.tearing_0
[2024-08-30T21:10:05.231Z] jcstress.accessAtomic.varHandles_0
[2024-08-30T21:10:05.231Z] jcstress.atomicity.varHandles.arrays.WeakCASContendStrongTest_0
[2024-08-30T21:10:05.231Z] jcstress.atomicity.varHandles.arrays.WeakCASTest_0
[2024-08-30T21:10:05.231Z] jcstress.atomicity.varHandles.fields.WeakCASContendStrongTest_0
[2024-08-30T21:10:05.231Z] jcstress.atomicity.varHandles.fields.WeakCASTest_0
[2024-08-30T21:10:05.231Z] jcstress.coherence.varHandles_0
[2024-08-30T21:10:05.231Z] jcstress.atomics.integer.AtomicIntegerArrayPairwiseTests_0
[2024-08-30T21:10:05.231Z] jcstress.atomics.integer.AtomicIntegerFieldUpdaterPairwiseTests_0
[2024-08-30T21:10:05.231Z] jcstress.atomics.integer.AtomicIntegerPairwiseTests_0
[2024-08-30T21:10:05.231Z] jcstress.atomics.longs.AtomicLongArrayPairwiseTests_0
[2024-08-30T21:10:05.231Z] jcstress.atomics.longs.AtomicLongFieldUpdaterPairwiseTests_0
[2024-08-30T21:10:05.231Z] jcstress.atomics.longs.AtomicLongPairwiseTests_0
[2024-08-30T21:10:05.231Z] jcstress.acqrel.fields.sync_0
[2024-08-30T21:10:05.231Z] jcstress.acqrel.fields.volatiles_0
[2024-08-30T21:10:05.231Z] jcstress.acqrel.varHandles.arrays.acqrel_0
[2024-08-30T21:10:05.231Z] jcstress.acqrel.varHandles.arrays.volatiles_0
[2024-08-30T21:10:05.231Z] jcstress.acqrel.varHandles.fields.acqrel_0
[2024-08-30T21:10:05.231Z] jcstress.acqrel.varHandles.fields.volatiles_0
[2024-08-30T21:10:05.231Z] jcstress.atomicity_0
[2024-08-30T21:10:05.231Z] jcstress.atomicity.varHandles.arrays_0
[2024-08-30T21:10:05.231Z] jcstress.atomicity.varHandles.fields_0
[2024-08-30T21:10:05.231Z] jcstress.memeffects.basic_0
[2024-08-30T21:10:05.231Z] jcstress.locks.mutex_0
[2024-08-30T21:10:05.231Z] jcstress.atomicity.varHandles.byteArray_0
[2024-08-30T21:10:05.231Z] jcstress.atomicity.varHandles.byteBuffer.direct_0
[2024-08-30T21:10:05.231Z] jcstress.atomicity.varHandles.byteBuffer.heap_0
[2024-08-30T21:10:05.231Z] jcstress.acqrel.varHandles.byteArray.big_0
[2024-08-30T21:10:05.231Z] jcstress.acqrel.varHandles.byteArray.little_0
[2024-08-30T21:10:05.231Z] jcstress.acqrel.varHandles.byteBuffer.direct.big_0
[2024-08-30T21:10:05.231Z] jcstress.acqrel.varHandles.byteBuffer.direct.little_0
[2024-08-30T21:10:05.231Z] jcstress.acqrel.varHandles.byteBuffer.heap.big_0
[2024-08-30T21:10:05.231Z] jcstress.acqrel.varHandles.byteBuffer.heap.little_0
[2024-08-30T21:10:05.231Z] jcstress.memeffects.basic.atomic.AtomicInteger_0
[2024-08-30T21:10:05.231Z] jcstress.memeffects.basic.atomic.AtomicLong_0
[2024-08-30T21:10:05.231Z] jcstress.memeffects.basic.atomicupdaters.AtomicIntegerFieldUpdater_0
[2024-08-30T21:10:05.231Z] jcstress.memeffects.basic.atomicupdaters.AtomicLongFieldUpdater_0
[2024-08-30T21:10:05.231Z] jcstress.fences.varHandles_0
[2024-08-30T21:10:05.231Z] jcstress.locks.stamped.StampedLockPairwiseTests_0
[2024-08-30T21:10:05.231Z] jcstress.seqcst.sync_0
[2024-08-30T21:10:05.231Z] jcstress.seqcst.volatiles_0
[2024-08-30T21:10:05.231Z]
[2024-08-30T21:10:05.231Z] FAILED test targets:
[2024-08-30T21:10:05.231Z] Rebuild_Same_JDK_Reproducibility_Test_win_0
[2024-08-30T21:10:05.231Z]
[2024-08-30T21:10:05.231Z] TOTAL: 85 EXECUTED: 1 PASSED: 0 FAILED: 1 DISABLED: 84 SKIPPED: 0
[2024-08-30T21:10:05.231Z] ++++++++++++++++++++++++++++++++++++++++++++++++++++++++++++++++++++++++++
[2024-08-30T21:10:05.231Z]
[2024-08-30T21:10:05.559Z] cat: 'C:/workspace/workspace/Test_openjdk21_hs_dev.system_x86-64_windows_testList_1/aqa-tests/TKGoutput_17250519877336../AQACert.log': No such file or directory
[2024-08-30T21:10:05.559Z] cat: 'C:/workspace/workspace/Test_openjdk21_hs_dev.system_x86-64_windows_testList_1/aqa-tests/TKGoutput_17250519877336../SHA.txt': No such file or directory
[2024-08-30T21:10:05.559Z] make[2]: *** [settings.mk:446: resultsSummary] Error 2
[2024-08-30T21:10:05.559Z] make[2]: Leaving directory '/cygdrive/c/workspace/workspace/Test_openjdk21_hs_dev.system_x86-64_windows_testList_1/aqa-tests/TKG'
[2024-08-30T21:10:05.559Z] make[1]: *** [makefile:70: _testList] Error 2
[2024-08-30T21:10:05.559Z] make[1]: Leaving directory '/cygdrive/c/workspace/workspace/Test_openjdk21_hs_dev.system_x86-64_windows_testList_1/aqa-tests/TKG'
[2024-08-30T21:10:05.559Z] make: *** [parallelList.mk:11: testList_1] Error 2
[Pipeline] sh
[2024-08-30T21:10:06.088Z] ++ uname
[2024-08-30T21:10:06.411Z] + '[' CYGWIN_NT-10.0-20348 = AIX ']'
[2024-08-30T21:10:06.411Z] ++ uname
[2024-08-30T21:10:06.411Z] + '[' CYGWIN_NT-10.0-20348 = SunOS ']'
[2024-08-30T21:10:06.411Z] ++ uname
[2024-08-30T21:10:06.411Z] + '[' CYGWIN_NT-10.0-20348 = '*BSD' ']'
[2024-08-30T21:10:06.411Z] + MAKE=make
[2024-08-30T21:10:06.411Z] + make -f ./aqa-tests/TKG/testEnv.mk testEnvTeardown
[2024-08-30T21:10:06.411Z] make: Nothing to be done for 'testEnvTeardown'.
[Pipeline] echo
[2024-08-30T21:10:06.499Z] There were test failures, set build result to UNSTABLE.
[Pipeline] }
[Pipeline] // stage
[Pipeline] stage
[Pipeline] { (Post)
[Pipeline] step
[2024-08-30T21:10:06.584Z] TAP Reports Processing: START
[2024-08-30T21:10:06.585Z] Looking for TAP results report in workspace using pattern: aqa-tests/TKG/**/*.tap
[2024-08-30T21:10:06.620Z] Saving reports...
[2024-08-30T21:10:06.659Z] Processing '/home/jenkins/.jenkins/jobs/Test_openjdk21_hs_dev.system_x86-64_windows_testList_1/builds/6/tap-master-files/aqa-tests/TKG/output_17250519877336/Test_openjdk21_hs_dev.system_x86-64_windows_testList_1.tap'
[2024-08-30T21:10:06.659Z] Parsing TAP test result [/home/jenkins/.jenkins/jobs/Test_openjdk21_hs_dev.system_x86-64_windows_testList_1/builds/6/tap-master-files/aqa-tests/TKG/output_17250519877336/Test_openjdk21_hs_dev.system_x86-64_windows_testList_1.tap].
[2024-08-30T21:10:06.668Z] There are failed test cases. Marking build as UNSTABLE
[2024-08-30T21:10:06.669Z] TAP Reports Processing: FINISH
[Pipeline] echo
[2024-08-30T21:10:06.676Z] Saving aqa-tests/testenv/testenv.properties file on jenkins.
[Pipeline] archiveArtifacts
[2024-08-30T21:10:06.704Z] Archiving artifacts
[2024-08-30T21:10:06.753Z] Recording fingerprints
[Pipeline] echo
[2024-08-30T21:10:06.797Z] Saving aqa-tests/TKG/**/*.tap file on jenkins.
[Pipeline] archiveArtifacts
[2024-08-30T21:10:06.825Z] Archiving artifacts
[2024-08-30T21:10:06.912Z] Recording fingerprints
[Pipeline] sh
[2024-08-30T21:10:07.483Z] + tar -cf - ./aqa-tests/TKG/output_17250519877336
[2024-08-30T21:10:07.483Z] + pigz -9
[2024-08-30T21:10:07.812Z] + gzip -9
[Pipeline] echo
[2024-08-30T21:10:07.864Z] ARTIFACTORY_SERVER is not set. Saving artifacts on jenkins.
[Pipeline] archiveArtifacts
[2024-08-30T21:10:07.895Z] Archiving artifacts
[2024-08-30T21:10:07.942Z] Recording fingerprints
[Pipeline] findFiles
[Pipeline] echo
[2024-08-30T21:10:08.741Z] Tap file found: aqa-tests\TKG\output_17250519877336\Test_openjdk21_hs_dev.system_x86-64_windows_testList_1.tap...
[Pipeline] readFile
[Pipeline] echo
[2024-08-30T21:10:08.863Z] Rerun in Grinder with failed test targets: https://ci.adoptium.net/job/Grinder/parambuild/?SDK_RESOURCE=upstream&TARGET=testList+TESTLIST=Rebuild_Same_JDK_Reproducibility_Test_win_0&BASE_DOCKER_REGISTRY_CREDENTIAL_ID=&TEST_FLAG=&UPSTREAM_TEST_JOB_NAME=Test_openjdk21_hs_dev.system_x86-64_windows&DOCKER_REQUIRED=false&ACTIVE_NODE_TIMEOUT=5&VENDOR_TEST_DIRS=%2Ftest%2Fsystem&EXTRA_DOCKER_ARGS=&TKG_OWNER_BRANCH=adoptium%3Amaster&OPENJ9_SYSTEMTEST_OWNER_BRANCH=eclipse%3Amaster&PLATFORM=x86-64_windows&GENERATE_JOBS=true&KEEP_REPORTDIR=false&PERSONAL_BUILD=false&DOCKER_REGISTRY_DIR=&RERUN_ITERATIONS=0&ADOPTOPENJDK_REPO=https%3A%2F%2Fgithub.com%2Fadoptium%2Faqa-tests.git&SETUP_JCK_RUN=false&DOCKER_REGISTRY_URL_CREDENTIAL_ID=&LABEL=&EXTRA_OPTIONS=&CUSTOMIZED_SDK_URL=&BUILD_IDENTIFIER=&JENKINS_KEY=&ADOPTOPENJDK_BRANCH=master&LIGHT_WEIGHT_CHECKOUT=false&USE_JRE=false&ARTIFACTORY_SERVER=&KEEP_WORKSPACE=false&USER_CREDENTIALS_ID=&JDK_VERSION=21&DOCKER_REGISTRY_URL=&ITERATIONS=1&VENDOR_TEST_REPOS=https%3A%2F%2Fgithub.com%2Fadoptium%2Ftemurin-build&JDK_REPO=https%3A%2F%2Fgithub.com%2Fadoptium%2Fjdk21u&JCK_GIT_BRANCH=master&OPENJ9_BRANCH=master&OPENJ9_SHA=&JCK_GIT_REPO=&VENDOR_TEST_BRANCHES=master&UPSTREAM_JOB_NAME=build-scripts%2Fjobs%2Fjdk21u%2Fjdk21u-windows-x64-temurin&OPENJ9_REPO=https%3A%2F%2Fgithub.com%2Feclipse-openj9%2Fopenj9.git&CLOUD_PROVIDER=&CUSTOM_TARGET=&VENDOR_TEST_SHAS=&JDK_BRANCH=jdk-21.0.5%2B5_adopt&LABEL_ADDITION=&ARTIFACTORY_REPO=&ARTIFACTORY_ROOT_DIR=&UPSTREAM_TEST_JOB_NUMBER=14&DOCKERIMAGE_TAG=&TEST_TIME=&JDK_IMPL=hotspot&SSH_AGENT_CREDENTIAL=&AUTO_DETECT=true&SLACK_CHANNEL=&DYNAMIC_COMPILE=false&RELATED_NODES=&ADOPTOPENJDK_SYSTEMTEST_OWNER_BRANCH=adoptium%3Amaster&APPLICATION_OPTIONS=&CUSTOMIZED_SDK_URL_CREDENTIAL_ID=eclipse_temurin_bot_email_and_token&ARCHIVE_TEST_RESULTS=false&NUM_MACHINES=&OPENJDK_SHA=&TRSS_URL=&USE_TESTENV_PROPERTIES=false&BUILD_LIST=system&ADDITIONAL_ARTIFACTS_REQUIRED=&UPSTREAM_JOB_NUMBER=152&STF_OWNER_BRANCH=adoptium%3Amaster&TIME_LIMIT=25&JVM_OPTIONS=&PARALLEL=None
[Pipeline] junit
[2024-08-30T21:10:08.902Z] Recording test results
[2024-08-30T21:10:09.622Z] None of the test reports contained any result
[2024-08-30T21:10:09.622Z] [Checks API] No suitable checks publisher found.
[Pipeline] }
[Pipeline] // stage
[Pipeline] echo
[2024-08-30T21:10:09.670Z] PROCESSCATCH: Terminating any hung/left over test processes:
[Pipeline] sh
[2024-08-30T21:10:09.583Z] No test report files were found. Configuration error?
[2024-08-30T21:10:10.517Z] + aqa-tests/terminateTestProcesses.sh null
[2024-08-30T21:10:10.518Z] Windows machine, using powershell queries...
[2024-08-30T21:10:11.217Z] Woohoo - no rogue processes detected!
[Pipeline] cleanWs
[2024-08-30T21:10:11.314Z] [WS-CLEANUP] Deleting project workspace...
[2024-08-30T21:10:11.315Z] [WS-CLEANUP] Deferred wipeout is disabled by the job configuration...
[2024-08-30T21:10:15.840Z] [WS-CLEANUP] done
[Pipeline] sh
[2024-08-30T21:10:16.696Z] + find /cygdrive/c/temp -name '*core*' -print -exec rm -f '{}' ';'
[Pipeline] }
[Pipeline] // timeout
[Pipeline] }
[Pipeline] // node
[Pipeline] }
[Pipeline] // stage
[Pipeline] echo
[2024-08-30T21:10:17.984Z] SETUP_LABEL: ci.role.test
[Pipeline] }
[Pipeline] // timestamps
[Pipeline] End of Pipeline
/home/jenkins/.jenkins/workspace/Test_openjdk21_hs_dev.system_x86-64_windows_testList_1@tmp/jfrog/6/.jfrog deleted
Finished: UNSTABLE