jdk_beans_1
[2023-04-18T23:53:03.301Z] Running test jdk_beans_1 ...
[2023-04-18T23:53:03.301Z] ===============================================
[2023-04-18T23:53:03.301Z] jdk_beans_1 Start Time: Tue Apr 18 23:53:01 2023 Epoch Time (ms): 1681861981734
[2023-04-18T23:53:03.301Z] variation: Mode650
[2023-04-18T23:53:03.301Z] JVM_OPTIONS: -XX:-UseCompressedOops
[2023-04-18T23:53:03.301Z] { \
[2023-04-18T23:53:03.301Z] echo ""; echo "TEST SETUP:"; \
[2023-04-18T23:53:03.301Z] echo "Nothing to be done for setup."; \
[2023-04-18T23:53:03.301Z] mkdir -p "/home/jenkins/workspace/Test_openjdk17_hs_extended.openjdk_x86-64_alpine-linux_testList_2/aqa-tests/TKG/../TKG/output_16818616629195/jdk_beans_1"; \
[2023-04-18T23:53:03.301Z] cd "/home/jenkins/workspace/Test_openjdk17_hs_extended.openjdk_x86-64_alpine-linux_testList_2/aqa-tests/TKG/../TKG/output_16818616629195/jdk_beans_1"; \
[2023-04-18T23:53:03.301Z] echo ""; echo "TESTING:"; \
[2023-04-18T23:53:03.301Z] "/home/jenkins/workspace/Test_openjdk17_hs_extended.openjdk_x86-64_alpine-linux_testList_2/openjdkbinary/j2sdk-image/bin/java" -Xmx512m -jar "/home/jenkins/workspace/Test_openjdk17_hs_extended.openjdk_x86-64_alpine-linux_testList_2/aqa-tests/TKG/../../jvmtest/openjdk/jtreg/lib/jtreg.jar" \
[2023-04-18T23:53:03.301Z] -agentvm -a -ea -esa -v:fail,error,time,nopass -retain:fail,error,*.dmp,javacore.*,heapdump.*,*.trc -ignore:quiet -timeoutFactor:8 -xml:verify -k:'!headful' -concurrency:1 -nativepath:"/home/jenkins/workspace/Test_openjdk17_hs_extended.openjdk_x86-64_alpine-linux_testList_2/openjdkbinary/openjdk-test-image/jdk/jtreg/native" -vmoptions:"-Xmx512m -XX:-UseCompressedOops -Djava.awt.headless=true" \
[2023-04-18T23:53:03.301Z] -w ""/home/jenkins/workspace/Test_openjdk17_hs_extended.openjdk_x86-64_alpine-linux_testList_2/aqa-tests/TKG/../TKG/output_16818616629195/jdk_beans_1"/work" \
[2023-04-18T23:53:03.301Z] -r ""/home/jenkins/workspace/Test_openjdk17_hs_extended.openjdk_x86-64_alpine-linux_testList_2/aqa-tests/TKG/../TKG/output_16818616629195/jdk_beans_1"/report" \
[2023-04-18T23:53:03.301Z] -jdk:"/home/jenkins/workspace/Test_openjdk17_hs_extended.openjdk_x86-64_alpine-linux_testList_2/openjdkbinary/j2sdk-image" \
[2023-04-18T23:53:03.301Z] -exclude:"/home/jenkins/workspace/Test_openjdk17_hs_extended.openjdk_x86-64_alpine-linux_testList_2/aqa-tests/TKG/../openjdk/openjdk-jdk/test/jdk/ProblemList.txt" \
[2023-04-18T23:53:03.302Z] -exclude:"/home/jenkins/workspace/Test_openjdk17_hs_extended.openjdk_x86-64_alpine-linux_testList_2/aqa-tests/TKG/../../jvmtest/openjdk/excludes/ProblemList_openjdk17.txt" \
[2023-04-18T23:53:03.302Z] \
[2023-04-18T23:53:03.302Z] \
[2023-04-18T23:53:03.302Z] "/home/jenkins/workspace/Test_openjdk17_hs_extended.openjdk_x86-64_alpine-linux_testList_2/aqa-tests/TKG/../openjdk/openjdk-jdk/test/jdk:jdk_beans"; \
[2023-04-18T23:53:03.302Z] if [ $? -eq 0 ]; then echo "-----------------------------------"; echo "jdk_beans_1""_PASSED"; echo "-----------------------------------"; cd /home/jenkins/workspace/Test_openjdk17_hs_extended.openjdk_x86-64_alpine-linux_testList_2/aqa-tests/TKG/..; else echo "-----------------------------------"; echo "jdk_beans_1""_FAILED"; echo "-----------------------------------"; fi; \
[2023-04-18T23:53:03.302Z] echo ""; echo "TEST TEARDOWN:"; \
[2023-04-18T23:53:03.302Z] echo "Nothing to be done for teardown."; \
[2023-04-18T23:53:03.302Z] } 2>&1 | tee -a "/home/jenkins/workspace/Test_openjdk17_hs_extended.openjdk_x86-64_alpine-linux_testList_2/aqa-tests/TKG/../TKG/output_16818616629195/TestTargetResult";
[2023-04-18T23:53:03.302Z]
[2023-04-18T23:53:03.302Z] TEST SETUP:
[2023-04-18T23:53:03.302Z] Nothing to be done for setup.
[2023-04-18T23:53:03.302Z]
[2023-04-18T23:53:03.302Z] TESTING:
[2023-04-18T23:53:03.302Z] Directory "/home/jenkins/workspace/Test_openjdk17_hs_extended.openjdk_x86-64_alpine-linux_testList_2/aqa-tests/TKG/../TKG/output_16818616629195/jdk_beans_1/work" not found: creating
[2023-04-18T23:53:03.302Z] Directory "/home/jenkins/workspace/Test_openjdk17_hs_extended.openjdk_x86-64_alpine-linux_testList_2/aqa-tests/TKG/../TKG/output_16818616629195/jdk_beans_1/report" not found: creating
[2023-04-18T23:53:05.025Z] XML output with verification to /home/jenkins/workspace/Test_openjdk17_hs_extended.openjdk_x86-64_alpine-linux_testList_2/aqa-tests/TKG/output_16818616629195/jdk_beans_1/work
[2023-04-18T23:54:43.725Z] --------------------------------------------------
[2023-04-18T23:54:43.725Z] TEST: java/beans/PropertyChangeSupport/Test4682386.java
[2023-04-18T23:54:43.725Z] TEST JDK: /home/jenkins/workspace/Test_openjdk17_hs_extended.openjdk_x86-64_alpine-linux_testList_2/openjdkbinary/j2sdk-image
[2023-04-18T23:54:43.725Z]
[2023-04-18T23:54:43.725Z] ACTION: build -- Passed. Build successful
[2023-04-18T23:54:43.725Z] REASON: Named class compiled on demand
[2023-04-18T23:54:43.725Z] TIME: 0.766 seconds
[2023-04-18T23:54:43.725Z] messages:
[2023-04-18T23:54:43.725Z] command: build Test4682386
[2023-04-18T23:54:43.725Z] reason: Named class compiled on demand
[2023-04-18T23:54:43.725Z] Test directory:
[2023-04-18T23:54:43.725Z] compile: Test4682386
[2023-04-18T23:54:43.725Z] elapsed time (seconds): 0.766
[2023-04-18T23:54:43.725Z]
[2023-04-18T23:54:43.725Z] ACTION: compile -- Passed. Compilation successful
[2023-04-18T23:54:43.725Z] REASON: .class file out of date or does not exist
[2023-04-18T23:54:43.725Z] TIME: 0.766 seconds
[2023-04-18T23:54:43.725Z] messages:
[2023-04-18T23:54:43.725Z] command: compile /home/jenkins/workspace/Test_openjdk17_hs_extended.openjdk_x86-64_alpine-linux_testList_2/aqa-tests/openjdk/openjdk-jdk/test/jdk/java/beans/PropertyChangeSupport/Test4682386.java
[2023-04-18T23:54:43.725Z] reason: .class file out of date or does not exist
[2023-04-18T23:54:43.725Z] Additional options from @modules: --add-modules java.desktop
[2023-04-18T23:54:43.725Z] Mode: othervm
[2023-04-18T23:54:43.725Z] elapsed time (seconds): 0.766
[2023-04-18T23:54:43.725Z] configuration:
[2023-04-18T23:54:43.725Z] javac compilation environment
[2023-04-18T23:54:43.725Z] add modules: java.desktop
[2023-04-18T23:54:43.725Z] source path: /home/jenkins/workspace/Test_openjdk17_hs_extended.openjdk_x86-64_alpine-linux_testList_2/aqa-tests/openjdk/openjdk-jdk/test/jdk/java/beans/PropertyChangeSupport
[2023-04-18T23:54:43.725Z] class path: /home/jenkins/workspace/Test_openjdk17_hs_extended.openjdk_x86-64_alpine-linux_testList_2/aqa-tests/openjdk/openjdk-jdk/test/jdk/java/beans/PropertyChangeSupport
[2023-04-18T23:54:43.725Z] /home/jenkins/workspace/Test_openjdk17_hs_extended.openjdk_x86-64_alpine-linux_testList_2/aqa-tests/TKG/output_16818616629195/jdk_beans_1/work/classes/java/beans/PropertyChangeSupport/Test4682386.d
[2023-04-18T23:54:43.725Z]
[2023-04-18T23:54:43.725Z] rerun:
[2023-04-18T23:54:43.725Z] cd /home/jenkins/workspace/Test_openjdk17_hs_extended.openjdk_x86-64_alpine-linux_testList_2/aqa-tests/TKG/output_16818616629195/jdk_beans_1/work/java/beans/PropertyChangeSupport/Test4682386 && \
[2023-04-18T23:54:43.725Z] DISPLAY=:0 \
[2023-04-18T23:54:43.725Z] HOME=/home/jenkins \
[2023-04-18T23:54:43.725Z] PATH=/bin:/usr/bin:/usr/sbin \
[2023-04-18T23:54:43.725Z] /home/jenkins/workspace/Test_openjdk17_hs_extended.openjdk_x86-64_alpine-linux_testList_2/openjdkbinary/j2sdk-image/bin/javac \
[2023-04-18T23:54:43.725Z] -J-ea \
[2023-04-18T23:54:43.725Z] -J-esa \
[2023-04-18T23:54:43.725Z] -J-Xmx512m \
[2023-04-18T23:54:43.725Z] -J-XX:-UseCompressedOops \
[2023-04-18T23:54:43.725Z] -J-Djava.awt.headless=true \
[2023-04-18T23:54:43.725Z] -J-Dtest.vm.opts='-ea -esa -Xmx512m -XX:-UseCompressedOops -Djava.awt.headless=true' \
[2023-04-18T23:54:43.725Z] -J-Dtest.tool.vm.opts='-J-ea -J-esa -J-Xmx512m -J-XX:-UseCompressedOops -J-Djava.awt.headless=true' \
[2023-04-18T23:54:43.725Z] -J-Dtest.compiler.opts= \
[2023-04-18T23:54:43.725Z] -J-Dtest.java.opts= \
[2023-04-18T23:54:43.725Z] -J-Dtest.jdk=/home/jenkins/workspace/Test_openjdk17_hs_extended.openjdk_x86-64_alpine-linux_testList_2/openjdkbinary/j2sdk-image \
[2023-04-18T23:54:43.725Z] -J-Dcompile.jdk=/home/jenkins/workspace/Test_openjdk17_hs_extended.openjdk_x86-64_alpine-linux_testList_2/openjdkbinary/j2sdk-image \
[2023-04-18T23:54:43.725Z] -J-Dtest.timeout.factor=8.0 \
[2023-04-18T23:54:43.725Z] -J-Dtest.nativepath=/home/jenkins/workspace/Test_openjdk17_hs_extended.openjdk_x86-64_alpine-linux_testList_2/openjdkbinary/openjdk-test-image/jdk/jtreg/native \
[2023-04-18T23:54:43.725Z] -J-Dtest.root=/home/jenkins/workspace/Test_openjdk17_hs_extended.openjdk_x86-64_alpine-linux_testList_2/aqa-tests/openjdk/openjdk-jdk/test/jdk \
[2023-04-18T23:54:43.725Z] -J-Dtest.name=java/beans/PropertyChangeSupport/Test4682386.java \
[2023-04-18T23:54:43.725Z] -J-Dtest.file=/home/jenkins/workspace/Test_openjdk17_hs_extended.openjdk_x86-64_alpine-linux_testList_2/aqa-tests/openjdk/openjdk-jdk/test/jdk/java/beans/PropertyChangeSupport/Test4682386.java \
[2023-04-18T23:54:43.725Z] -J-Dtest.src=/home/jenkins/workspace/Test_openjdk17_hs_extended.openjdk_x86-64_alpine-linux_testList_2/aqa-tests/openjdk/openjdk-jdk/test/jdk/java/beans/PropertyChangeSupport \
[2023-04-18T23:54:43.725Z] -J-Dtest.src.path=/home/jenkins/workspace/Test_openjdk17_hs_extended.openjdk_x86-64_alpine-linux_testList_2/aqa-tests/openjdk/openjdk-jdk/test/jdk/java/beans/PropertyChangeSupport \
[2023-04-18T23:54:43.725Z] -J-Dtest.classes=/home/jenkins/workspace/Test_openjdk17_hs_extended.openjdk_x86-64_alpine-linux_testList_2/aqa-tests/TKG/output_16818616629195/jdk_beans_1/work/classes/java/beans/PropertyChangeSupport/Test4682386.d \
[2023-04-18T23:54:43.725Z] -J-Dtest.class.path=/home/jenkins/workspace/Test_openjdk17_hs_extended.openjdk_x86-64_alpine-linux_testList_2/aqa-tests/TKG/output_16818616629195/jdk_beans_1/work/classes/java/beans/PropertyChangeSupport/Test4682386.d \
[2023-04-18T23:54:43.725Z] -J-Dtest.modules=java.desktop \
[2023-04-18T23:54:43.725Z] --add-modules java.desktop \
[2023-04-18T23:54:43.725Z] -d /home/jenkins/workspace/Test_openjdk17_hs_extended.openjdk_x86-64_alpine-linux_testList_2/aqa-tests/TKG/output_16818616629195/jdk_beans_1/work/classes/java/beans/PropertyChangeSupport/Test4682386.d \
[2023-04-18T23:54:43.725Z] -sourcepath /home/jenkins/workspace/Test_openjdk17_hs_extended.openjdk_x86-64_alpine-linux_testList_2/aqa-tests/openjdk/openjdk-jdk/test/jdk/java/beans/PropertyChangeSupport \
[2023-04-18T23:54:43.726Z] -classpath /home/jenkins/workspace/Test_openjdk17_hs_extended.openjdk_x86-64_alpine-linux_testList_2/aqa-tests/openjdk/openjdk-jdk/test/jdk/java/beans/PropertyChangeSupport:/home/jenkins/workspace/Test_openjdk17_hs_extended.openjdk_x86-64_alpine-linux_testList_2/aqa-tests/TKG/output_16818616629195/jdk_beans_1/work/classes/java/beans/PropertyChangeSupport/Test4682386.d /home/jenkins/workspace/Test_openjdk17_hs_extended.openjdk_x86-64_alpine-linux_testList_2/aqa-tests/openjdk/openjdk-jdk/test/jdk/java/beans/PropertyChangeSupport/Test4682386.java
[2023-04-18T23:54:43.726Z] STDOUT:
[2023-04-18T23:54:43.726Z] STDERR:
[2023-04-18T23:54:43.726Z] /home/jenkins/workspace/Test_openjdk17_hs_extended.openjdk_x86-64_alpine-linux_testList_2/aqa-tests/openjdk/openjdk-jdk/test/jdk/java/beans/PropertyChangeSupport/Test4682386.java:73: warning: [removal] JApplet in javax.swing has been deprecated and marked for removal
[2023-04-18T23:54:43.726Z] JApplet.class,
[2023-04-18T23:54:43.726Z] ^
[2023-04-18T23:54:43.726Z] 1 warning
[2023-04-18T23:54:43.726Z]
[2023-04-18T23:54:43.726Z] ACTION: main -- Failed. Execution failed: `main' threw exception: java.lang.InternalError: java.lang.reflect.InvocationTargetException
[2023-04-18T23:54:43.726Z] REASON: Assumed action based on file name: run main Test4682386
[2023-04-18T23:54:43.726Z] TIME: 0.477 seconds
[2023-04-18T23:54:43.726Z] messages:
[2023-04-18T23:54:43.726Z] command: main Test4682386
[2023-04-18T23:54:43.726Z] reason: Assumed action based on file name: run main Test4682386
[2023-04-18T23:54:43.726Z] Mode: othervm
[2023-04-18T23:54:43.726Z] Additional options from @modules: --add-modules java.desktop
[2023-04-18T23:54:43.726Z] elapsed time (seconds): 0.477
[2023-04-18T23:54:43.726Z] configuration:
[2023-04-18T23:54:43.726Z] Boot Layer
[2023-04-18T23:54:43.726Z] add modules: java.desktop
[2023-04-18T23:54:43.726Z]
[2023-04-18T23:54:43.726Z] STDOUT:
[2023-04-18T23:54:43.726Z] Exception for javax.swing.JApplet : class javax.swing.JApplet : java.awt.HeadlessException
[2023-04-18T23:54:43.726Z] Bound property found: UI
[2023-04-18T23:54:43.726Z] Bound property found: action
[2023-04-18T23:54:43.726Z] Bound property found: actionCommand
[2023-04-18T23:54:43.726Z] Bound property found: actionMap
[2023-04-18T23:54:43.726Z] Bound property found: alignmentX
[2023-04-18T23:54:43.726Z] Reflective method invocation Exception for class javax.swing.JButton : null
[2023-04-18T23:54:43.726Z] Bound property found: alignmentY
[2023-04-18T23:54:43.726Z] Reflective method invocation Exception for class javax.swing.JButton : null
[2023-04-18T23:54:43.726Z] Bound property found: background
[2023-04-18T23:54:43.726Z] Bound property found: border
[2023-04-18T23:54:43.726Z] Bound property found: borderPainted
[2023-04-18T23:54:43.726Z] Bound property found: component
[2023-04-18T23:54:43.726Z] Reflective method invocation Exception for class javax.swing.JButton : Cannot invoke "java.lang.reflect.Method.invoke(Object, Object[])" because "<local12>" is null
[2023-04-18T23:54:43.726Z] Bound property found: componentCount
[2023-04-18T23:54:43.726Z] Reflective method invocation Exception for class javax.swing.JButton : Cannot invoke "java.lang.reflect.Method.invoke(Object, Object[])" because "<local13>" is null
[2023-04-18T23:54:43.726Z] Bound property found: componentPopupMenu
[2023-04-18T23:54:43.726Z] Bound property found: components
[2023-04-18T23:54:43.726Z] Reflective method invocation Exception for class javax.swing.JButton : Cannot invoke "java.lang.reflect.Method.invoke(Object, Object[])" because "<local13>" is null
[2023-04-18T23:54:43.726Z] Bound property found: containerListeners
[2023-04-18T23:54:43.726Z] Reflective method invocation Exception for class javax.swing.JButton : Cannot invoke "java.lang.reflect.Method.invoke(Object, Object[])" because "<local13>" is null
[2023-04-18T23:54:43.726Z] Bound property found: contentAreaFilled
[2023-04-18T23:54:43.726Z] Bound property found: defaultCapable
[2023-04-18T23:54:43.726Z] Bound property found: disabledIcon
[2023-04-18T23:54:43.726Z] Bound property found: disabledSelectedIcon
[2023-04-18T23:54:43.726Z] Bound property found: displayedMnemonicIndex
[2023-04-18T23:54:43.726Z] Reflective method invocation Exception for class javax.swing.JButton : null
[2023-04-18T23:54:43.726Z] Bound property found: doubleBuffered
[2023-04-18T23:54:43.726Z] Bound property found: enabled
[2023-04-18T23:54:43.726Z] Bound property found: focusCycleRoot
[2023-04-18T23:54:43.726Z] Bound property found: focusPainted
[2023-04-18T23:54:43.726Z] Bound property found: focusTraversalKeys
[2023-04-18T23:54:43.726Z] Reflective method invocation Exception for class javax.swing.JButton : Cannot invoke "java.lang.reflect.Method.invoke(Object, Object[])" because "<local12>" is null
[2023-04-18T23:54:43.726Z] Bound property found: focusTraversalPolicy
[2023-04-18T23:54:43.726Z] Bound property found: focusTraversalPolicyProvider
[2023-04-18T23:54:43.726Z] Bound property found: focusTraversalPolicySet
[2023-04-18T23:54:43.726Z] Reflective method invocation Exception for class javax.swing.JButton : Cannot invoke "java.lang.reflect.Method.invoke(Object, Object[])" because "<local13>" is null
[2023-04-18T23:54:43.726Z] Bound property found: focusable
[2023-04-18T23:54:43.726Z] Bound property found: font
[2023-04-18T23:54:43.726Z] Bound property found: foreground
[2023-04-18T23:54:43.726Z] Bound property found: hideActionText
[2023-04-18T23:54:43.726Z] Bound property found: horizontalAlignment
[2023-04-18T23:54:43.726Z] Reflective method invocation Exception for class javax.swing.JButton : null
[2023-04-18T23:54:43.726Z] Bound property found: horizontalTextPosition
[2023-04-18T23:54:43.726Z] Reflective method invocation Exception for class javax.swing.JButton : null
[2023-04-18T23:54:43.726Z] Bound property found: icon
[2023-04-18T23:54:43.726Z] Bound property found: iconTextGap
[2023-04-18T23:54:43.726Z] Bound property found: inheritsPopupMenu
[2023-04-18T23:54:43.726Z] Bound property found: inputMap
[2023-04-18T23:54:43.726Z] Reflective method invocation Exception for class javax.swing.JButton : Cannot invoke "java.lang.reflect.Method.invoke(Object, Object[])" because "<local13>" is null
[2023-04-18T23:54:43.726Z] Bound property found: inputVerifier
[2023-04-18T23:54:43.726Z] Bound property found: insets
[2023-04-18T23:54:43.726Z] Reflective method invocation Exception for class javax.swing.JButton : Cannot invoke "java.lang.reflect.Method.invoke(Object, Object[])" because "<local13>" is null
[2023-04-18T23:54:43.726Z] Bound property found: label
[2023-04-18T23:54:43.726Z] Bound property found: layout
[2023-04-18T23:54:43.726Z] Bound property found: margin
[2023-04-18T23:54:43.726Z] Bound property found: maximumSize
[2023-04-18T23:54:43.726Z] Bound property found: minimumSize
[2023-04-18T23:54:43.726Z] Bound property found: mnemonic
[2023-04-18T23:54:43.726Z] Bound property found: model
[2023-04-18T23:54:43.726Z] Bound property found: multiClickThreshhold
[2023-04-18T23:54:43.726Z] Reflective method invocation Exception for class javax.swing.JButton : null
[2023-04-18T23:54:43.726Z] Bound property found: name
[2023-04-18T23:54:43.726Z] Bound property found: nextFocusableComponent
[2023-04-18T23:54:43.726Z] Bound property found: opaque
[2023-04-18T23:54:43.726Z] Bound property found: preferredSize
[2023-04-18T23:54:43.726Z] Bound property found: pressedIcon
[2023-04-18T23:54:43.726Z] Bound property found: requestFocusEnabled
[2023-04-18T23:54:43.726Z] Bound property found: rolloverEnabled
[2023-04-18T23:54:43.726Z] Bound property found: rolloverIcon
[2023-04-18T23:54:43.726Z] Bound property found: rolloverSelectedIcon
[2023-04-18T23:54:43.726Z] Bound property found: selected
[2023-04-18T23:54:43.726Z] Reflective method invocation Exception for class javax.swing.JButton : null
[2023-04-18T23:54:43.726Z] Bound property found: selectedIcon
[2023-04-18T23:54:43.726Z] Bound property found: text
[2023-04-18T23:54:43.726Z] Bound property found: transferHandler
[2023-04-18T23:54:43.726Z] Bound property found: validateRoot
[2023-04-18T23:54:43.726Z] Reflective method invocation Exception for class javax.swing.JButton : Cannot invoke "java.lang.reflect.Method.invoke(Object, Object[])" because "<local13>" is null
[2023-04-18T23:54:43.726Z] Bound property found: verifyInputWhenFocusTarget
[2023-04-18T23:54:43.726Z] Bound property found: verticalAlignment
[2023-04-18T23:54:43.726Z] Bound property found: verticalTextPosition
[2023-04-18T23:54:43.726Z] Bound property found: visible
[2023-04-18T23:54:43.726Z] Bound property found: UI
[2023-04-18T23:54:43.726Z] Bound property found: action
[2023-04-18T23:54:43.726Z] Bound property found: actionCommand
[2023-04-18T23:54:43.727Z] Bound property found: actionMap
[2023-04-18T23:54:43.727Z] Bound property found: alignmentX
[2023-04-18T23:54:43.727Z] Reflective method invocation Exception for class javax.swing.JCheckBox : null
[2023-04-18T23:54:43.727Z] Bound property found: alignmentY
[2023-04-18T23:54:43.727Z] Reflective method invocation Exception for class javax.swing.JCheckBox : null
[2023-04-18T23:54:43.727Z] Bound property found: background
[2023-04-18T23:54:43.727Z] Bound property found: border
[2023-04-18T23:54:43.727Z] Bound property found: borderPainted
[2023-04-18T23:54:43.727Z] Bound property found: borderPaintedFlat
[2023-04-18T23:54:43.727Z] Bound property found: component
[2023-04-18T23:54:43.727Z] Reflective method invocation Exception for class javax.swing.JCheckBox : Cannot invoke "java.lang.reflect.Method.invoke(Object, Object[])" because "<local12>" is null
[2023-04-18T23:54:43.727Z] Bound property found: componentCount
[2023-04-18T23:54:43.727Z] Reflective method invocation Exception for class javax.swing.JCheckBox : Cannot invoke "java.lang.reflect.Method.invoke(Object, Object[])" because "<local13>" is null
[2023-04-18T23:54:43.727Z] Bound property found: componentPopupMenu
[2023-04-18T23:54:43.727Z] Bound property found: components
[2023-04-18T23:54:43.727Z] Reflective method invocation Exception for class javax.swing.JCheckBox : Cannot invoke "java.lang.reflect.Method.invoke(Object, Object[])" because "<local13>" is null
[2023-04-18T23:54:43.727Z] Bound property found: containerListeners
[2023-04-18T23:54:43.727Z] Reflective method invocation Exception for class javax.swing.JCheckBox : Cannot invoke "java.lang.reflect.Method.invoke(Object, Object[])" because "<local13>" is null
[2023-04-18T23:54:43.727Z] Bound property found: contentAreaFilled
[2023-04-18T23:54:43.727Z] Bound property found: disabledIcon
[2023-04-18T23:54:43.727Z] Bound property found: disabledSelectedIcon
[2023-04-18T23:54:43.727Z] Bound property found: displayedMnemonicIndex
[2023-04-18T23:54:43.727Z] Reflective method invocation Exception for class javax.swing.JCheckBox : null
[2023-04-18T23:54:43.727Z] Bound property found: doubleBuffered
[2023-04-18T23:54:43.727Z] Bound property found: enabled
[2023-04-18T23:54:43.727Z] Bound property found: focusCycleRoot
[2023-04-18T23:54:43.727Z] Bound property found: focusPainted
[2023-04-18T23:54:43.727Z] Bound property found: focusTraversalKeys
[2023-04-18T23:54:43.727Z] Reflective method invocation Exception for class javax.swing.JCheckBox : Cannot invoke "java.lang.reflect.Method.invoke(Object, Object[])" because "<local12>" is null
[2023-04-18T23:54:43.727Z] Bound property found: focusTraversalPolicy
[2023-04-18T23:54:43.727Z] Bound property found: focusTraversalPolicyProvider
[2023-04-18T23:54:43.727Z] Bound property found: focusTraversalPolicySet
[2023-04-18T23:54:43.727Z] Reflective method invocation Exception for class javax.swing.JCheckBox : Cannot invoke "java.lang.reflect.Method.invoke(Object, Object[])" because "<local13>" is null
[2023-04-18T23:54:43.727Z] Bound property found: focusable
[2023-04-18T23:54:43.727Z] Bound property found: font
[2023-04-18T23:54:43.727Z] Bound property found: foreground
[2023-04-18T23:54:43.727Z] Bound property found: hideActionText
[2023-04-18T23:54:43.727Z] Bound property found: horizontalAlignment
[2023-04-18T23:54:43.727Z] Bound property found: horizontalTextPosition
[2023-04-18T23:54:43.727Z] Reflective method invocation Exception for class javax.swing.JCheckBox : null
[2023-04-18T23:54:43.727Z] Bound property found: icon
[2023-04-18T23:54:43.727Z] Bound property found: iconTextGap
[2023-04-18T23:54:43.727Z] Bound property found: inheritsPopupMenu
[2023-04-18T23:54:43.727Z] Bound property found: inputMap
[2023-04-18T23:54:43.727Z] Reflective method invocation Exception for class javax.swing.JCheckBox : Cannot invoke "java.lang.reflect.Method.invoke(Object, Object[])" because "<local13>" is null
[2023-04-18T23:54:43.727Z] Bound property found: inputVerifier
[2023-04-18T23:54:43.727Z] Bound property found: insets
[2023-04-18T23:54:43.727Z] Reflective method invocation Exception for class javax.swing.JCheckBox : Cannot invoke "java.lang.reflect.Method.invoke(Object, Object[])" because "<local13>" is null
[2023-04-18T23:54:43.727Z] Bound property found: label
[2023-04-18T23:54:43.727Z] Bound property found: layout
[2023-04-18T23:54:43.727Z] Bound property found: margin
[2023-04-18T23:54:43.727Z] Bound property found: maximumSize
[2023-04-18T23:54:43.727Z] Bound property found: minimumSize
[2023-04-18T23:54:43.727Z] Bound property found: mnemonic
[2023-04-18T23:54:43.727Z] Bound property found: model
[2023-04-18T23:54:43.727Z] Bound property found: multiClickThreshhold
[2023-04-18T23:54:43.727Z] Reflective method invocation Exception for class javax.swing.JCheckBox : null
[2023-04-18T23:54:43.727Z] Bound property found: name
[2023-04-18T23:54:43.727Z] Bound property found: nextFocusableComponent
[2023-04-18T23:54:43.727Z] Bound property found: opaque
[2023-04-18T23:54:43.727Z] Bound property found: preferredSize
[2023-04-18T23:54:43.727Z] Bound property found: pressedIcon
[2023-04-18T23:54:43.727Z] Bound property found: requestFocusEnabled
[2023-04-18T23:54:43.727Z] Bound property found: rolloverEnabled
[2023-04-18T23:54:43.727Z] Bound property found: rolloverIcon
[2023-04-18T23:54:43.727Z] Bound property found: rolloverSelectedIcon
[2023-04-18T23:54:43.727Z] Bound property found: selected
[2023-04-18T23:54:43.727Z] Reflective method invocation Exception for class javax.swing.JCheckBox : null
[2023-04-18T23:54:43.727Z] Bound property found: selectedIcon
[2023-04-18T23:54:43.727Z] Bound property found: text
[2023-04-18T23:54:43.727Z] Bound property found: transferHandler
[2023-04-18T23:54:43.727Z] Bound property found: validateRoot
[2023-04-18T23:54:43.727Z] Reflective method invocation Exception for class javax.swing.JCheckBox : Cannot invoke "java.lang.reflect.Method.invoke(Object, Object[])" because "<local13>" is null
[2023-04-18T23:54:43.727Z] Bound property found: verifyInputWhenFocusTarget
[2023-04-18T23:54:43.727Z] Bound property found: verticalAlignment
[2023-04-18T23:54:43.727Z] Bound property found: verticalTextPosition
[2023-04-18T23:54:43.727Z] Bound property found: visible
[2023-04-18T23:54:43.727Z] Bound property found: UI
[2023-04-18T23:54:43.727Z] Bound property found: action
[2023-04-18T23:54:43.727Z] Bound property found: actionCommand
[2023-04-18T23:54:43.727Z] Bound property found: actionMap
[2023-04-18T23:54:43.727Z] Bound property found: alignmentX
[2023-04-18T23:54:43.727Z] Reflective method invocation Exception for class javax.swing.JComboBox : null
[2023-04-18T23:54:43.727Z] Bound property found: alignmentY
[2023-04-18T23:54:43.727Z] Reflective method invocation Exception for class javax.swing.JComboBox : null
[2023-04-18T23:54:43.727Z] Bound property found: background
[2023-04-18T23:54:43.727Z] Bound property found: border
[2023-04-18T23:54:43.727Z] Bound property found: component
[2023-04-18T23:54:43.727Z] Reflective method invocation Exception for class javax.swing.JComboBox : Cannot invoke "java.lang.reflect.Method.invoke(Object, Object[])" because "<local12>" is null
[2023-04-18T23:54:43.727Z] Bound property found: componentCount
[2023-04-18T23:54:43.727Z] Reflective method invocation Exception for class javax.swing.JComboBox : Cannot invoke "java.lang.reflect.Method.invoke(Object, Object[])" because "<local13>" is null
[2023-04-18T23:54:43.727Z] Bound property found: componentPopupMenu
[2023-04-18T23:54:43.727Z] Bound property found: components
[2023-04-18T23:54:43.727Z] Reflective method invocation Exception for class javax.swing.JComboBox : Cannot invoke "java.lang.reflect.Method.invoke(Object, Object[])" because "<local13>" is null
[2023-04-18T23:54:43.727Z] Bound property found: containerListeners
[2023-04-18T23:54:43.727Z] Reflective method invocation Exception for class javax.swing.JComboBox : Cannot invoke "java.lang.reflect.Method.invoke(Object, Object[])" because "<local13>" is null
[2023-04-18T23:54:43.727Z] Bound property found: doubleBuffered
[2023-04-18T23:54:43.727Z] Bound property found: editable
[2023-04-18T23:54:43.727Z] Bound property found: editor
[2023-04-18T23:54:43.727Z] Bound property found: enabled
[2023-04-18T23:54:43.727Z] Bound property found: focusCycleRoot
[2023-04-18T23:54:43.727Z] Bound property found: focusTraversalKeys
[2023-04-18T23:54:43.727Z] Reflective method invocation Exception for class javax.swing.JComboBox : Cannot invoke "java.lang.reflect.Method.invoke(Object, Object[])" because "<local12>" is null
[2023-04-18T23:54:43.727Z] Bound property found: focusTraversalPolicy
[2023-04-18T23:54:43.728Z] Bound property found: focusTraversalPolicyProvider
[2023-04-18T23:54:43.728Z] Bound property found: focusTraversalPolicySet
[2023-04-18T23:54:43.728Z] Reflective method invocation Exception for class javax.swing.JComboBox : Cannot invoke "java.lang.reflect.Method.invoke(Object, Object[])" because "<local13>" is null
[2023-04-18T23:54:43.728Z] Bound property found: focusable
[2023-04-18T23:54:43.728Z] Bound property found: font
[2023-04-18T23:54:43.728Z] Bound property found: foreground
[2023-04-18T23:54:43.728Z] Bound property found: inheritsPopupMenu
[2023-04-18T23:54:43.728Z] Bound property found: inputMap
[2023-04-18T23:54:43.728Z] Reflective method invocation Exception for class javax.swing.JComboBox : Cannot invoke "java.lang.reflect.Method.invoke(Object, Object[])" because "<local13>" is null
[2023-04-18T23:54:43.728Z] Bound property found: inputVerifier
[2023-04-18T23:54:43.728Z] Bound property found: insets
[2023-04-18T23:54:43.728Z] Reflective method invocation Exception for class javax.swing.JComboBox : Cannot invoke "java.lang.reflect.Method.invoke(Object, Object[])" because "<local13>" is null
[2023-04-18T23:54:43.728Z] Bound property found: itemAt
[2023-04-18T23:54:43.728Z] Reflective method invocation Exception for class javax.swing.JComboBox : Cannot invoke "java.lang.reflect.Method.invoke(Object, Object[])" because "<local12>" is null
[2023-04-18T23:54:43.728Z] Bound property found: layout
[2023-04-18T23:54:43.728Z] Bound property found: lightWeightPopupEnabled
[2023-04-18T23:54:43.728Z] Bound property found: maximumRowCount
[2023-04-18T23:54:43.728Z] Bound property found: maximumSize
[2023-04-18T23:54:43.728Z] Bound property found: minimumSize
[2023-04-18T23:54:43.728Z] Bound property found: model
[2023-04-18T23:54:43.728Z] Reflective method invocation Exception for class javax.swing.JComboBox : null
[2023-04-18T23:54:43.728Z] Bound property found: name
[2023-04-18T23:54:43.728Z] Bound property found: nextFocusableComponent
[2023-04-18T23:54:43.728Z] Bound property found: opaque
[2023-04-18T23:54:43.728Z] Bound property found: popupVisible
[2023-04-18T23:54:43.728Z] Reflective method invocation Exception for class javax.swing.JComboBox : null
[2023-04-18T23:54:43.728Z] Bound property found: preferredSize
[2023-04-18T23:54:43.728Z] Bound property found: prototypeDisplayValue
[2023-04-18T23:54:43.728Z] Bound property found: renderer
[2023-04-18T23:54:43.728Z] Bound property found: requestFocusEnabled
[2023-04-18T23:54:43.728Z] Bound property found: transferHandler
[2023-04-18T23:54:43.728Z] Bound property found: validateRoot
[2023-04-18T23:54:43.728Z] Reflective method invocation Exception for class javax.swing.JComboBox : Cannot invoke "java.lang.reflect.Method.invoke(Object, Object[])" because "<local13>" is null
[2023-04-18T23:54:43.728Z] Bound property found: verifyInputWhenFocusTarget
[2023-04-18T23:54:43.728Z] Bound property found: visible
[2023-04-18T23:54:43.728Z] Bound property found: UI
[2023-04-18T23:54:43.728Z] Bound property found: actionMap
[2023-04-18T23:54:43.728Z] Bound property found: alignmentX
[2023-04-18T23:54:43.728Z] Reflective method invocation Exception for class javax.swing.JLabel : null
[2023-04-18T23:54:43.728Z] Bound property found: alignmentY
[2023-04-18T23:54:43.728Z] Reflective method invocation Exception for class javax.swing.JLabel : null
[2023-04-18T23:54:43.728Z] Bound property found: background
[2023-04-18T23:54:43.728Z] Bound property found: border
[2023-04-18T23:54:43.728Z] Bound property found: component
[2023-04-18T23:54:43.728Z] Reflective method invocation Exception for class javax.swing.JLabel : Cannot invoke "java.lang.reflect.Method.invoke(Object, Object[])" because "<local12>" is null
[2023-04-18T23:54:43.728Z] Bound property found: componentCount
[2023-04-18T23:54:43.728Z] Reflective method invocation Exception for class javax.swing.JLabel : Cannot invoke "java.lang.reflect.Method.invoke(Object, Object[])" because "<local13>" is null
[2023-04-18T23:54:43.728Z] Bound property found: componentPopupMenu
[2023-04-18T23:54:43.728Z] Bound property found: components
[2023-04-18T23:54:43.728Z] Reflective method invocation Exception for class javax.swing.JLabel : Cannot invoke "java.lang.reflect.Method.invoke(Object, Object[])" because "<local13>" is null
[2023-04-18T23:54:43.728Z] Bound property found: containerListeners
[2023-04-18T23:54:43.728Z] Reflective method invocation Exception for class javax.swing.JLabel : Cannot invoke "java.lang.reflect.Method.invoke(Object, Object[])" because "<local13>" is null
[2023-04-18T23:54:43.728Z] Bound property found: disabledIcon
[2023-04-18T23:54:43.728Z] Bound property found: displayedMnemonic
[2023-04-18T23:54:43.728Z] Bound property found: displayedMnemonicIndex
[2023-04-18T23:54:43.728Z] Reflective method invocation Exception for class javax.swing.JLabel : null
[2023-04-18T23:54:43.728Z] Bound property found: doubleBuffered
[2023-04-18T23:54:43.728Z] Bound property found: enabled
[2023-04-18T23:54:43.728Z] Bound property found: focusCycleRoot
[2023-04-18T23:54:43.728Z] Bound property found: focusTraversalKeys
[2023-04-18T23:54:43.728Z] Reflective method invocation Exception for class javax.swing.JLabel : Cannot invoke "java.lang.reflect.Method.invoke(Object, Object[])" because "<local12>" is null
[2023-04-18T23:54:43.728Z] Bound property found: focusTraversalPolicy
[2023-04-18T23:54:43.728Z] Bound property found: focusTraversalPolicyProvider
[2023-04-18T23:54:43.728Z] Bound property found: focusTraversalPolicySet
[2023-04-18T23:54:43.728Z] Reflective method invocation Exception for class javax.swing.JLabel : Cannot invoke "java.lang.reflect.Method.invoke(Object, Object[])" because "<local13>" is null
[2023-04-18T23:54:43.728Z] Bound property found: focusable
[2023-04-18T23:54:43.728Z] Bound property found: font
[2023-04-18T23:54:43.728Z] Bound property found: foreground
[2023-04-18T23:54:43.728Z] Bound property found: horizontalAlignment
[2023-04-18T23:54:43.728Z] Bound property found: horizontalTextPosition
[2023-04-18T23:54:43.728Z] Reflective method invocation Exception for class javax.swing.JLabel : null
[2023-04-18T23:54:43.728Z] Bound property found: icon
[2023-04-18T23:54:43.728Z] Bound property found: iconTextGap
[2023-04-18T23:54:43.728Z] Bound property found: inheritsPopupMenu
[2023-04-18T23:54:43.728Z] Bound property found: inputMap
[2023-04-18T23:54:43.728Z] Reflective method invocation Exception for class javax.swing.JLabel : Cannot invoke "java.lang.reflect.Method.invoke(Object, Object[])" because "<local13>" is null
[2023-04-18T23:54:43.728Z] Bound property found: inputVerifier
[2023-04-18T23:54:43.728Z] Bound property found: insets
[2023-04-18T23:54:43.728Z] Reflective method invocation Exception for class javax.swing.JLabel : Cannot invoke "java.lang.reflect.Method.invoke(Object, Object[])" because "<local13>" is null
[2023-04-18T23:54:43.728Z] Bound property found: labelFor
[2023-04-18T23:54:43.728Z] Bound property found: layout
[2023-04-18T23:54:43.728Z] Bound property found: maximumSize
[2023-04-18T23:54:43.728Z] Bound property found: minimumSize
[2023-04-18T23:54:43.728Z] Bound property found: name
[2023-04-18T23:54:43.728Z] Bound property found: nextFocusableComponent
[2023-04-18T23:54:43.728Z] Bound property found: opaque
[2023-04-18T23:54:43.728Z] Bound property found: preferredSize
[2023-04-18T23:54:43.728Z] Bound property found: requestFocusEnabled
[2023-04-18T23:54:43.728Z] Bound property found: text
[2023-04-18T23:54:43.728Z] Bound property found: transferHandler
[2023-04-18T23:54:43.728Z] Bound property found: validateRoot
[2023-04-18T23:54:43.729Z] Reflective method invocation Exception for class javax.swing.JLabel : Cannot invoke "java.lang.reflect.Method.invoke(Object, Object[])" because "<local13>" is null
[2023-04-18T23:54:43.729Z] Bound property found: verifyInputWhenFocusTarget
[2023-04-18T23:54:43.729Z] Bound property found: verticalAlignment
[2023-04-18T23:54:43.729Z] Bound property found: verticalTextPosition
[2023-04-18T23:54:43.729Z] Bound property found: visible
[2023-04-18T23:54:43.729Z] Bound property found: UI
[2023-04-18T23:54:43.729Z] Bound property found: actionMap
[2023-04-18T23:54:43.729Z] Bound property found: alignmentX
[2023-04-18T23:54:43.729Z] Reflective method invocation Exception for class javax.swing.JList : null
[2023-04-18T23:54:43.729Z] Bound property found: alignmentY
[2023-04-18T23:54:43.729Z] Reflective method invocation Exception for class javax.swing.JList : null
[2023-04-18T23:54:43.729Z] Bound property found: background
[2023-04-18T23:54:43.729Z] Bound property found: border
[2023-04-18T23:54:43.729Z] Bound property found: cellRenderer
[2023-04-18T23:54:43.729Z] Bound property found: component
[2023-04-18T23:54:43.729Z] Reflective method invocation Exception for class javax.swing.JList : Cannot invoke "java.lang.reflect.Method.invoke(Object, Object[])" because "<local12>" is null
[2023-04-18T23:54:43.729Z] Bound property found: componentCount
[2023-04-18T23:54:43.729Z] Reflective method invocation Exception for class javax.swing.JList : Cannot invoke "java.lang.reflect.Method.invoke(Object, Object[])" because "<local13>" is null
[2023-04-18T23:54:43.729Z] Bound property found: componentPopupMenu
[2023-04-18T23:54:43.729Z] Bound property found: components
[2023-04-18T23:54:43.729Z] Reflective method invocation Exception for class javax.swing.JList : Cannot invoke "java.lang.reflect.Method.invoke(Object, Object[])" because "<local13>" is null
[2023-04-18T23:54:43.729Z] Bound property found: containerListeners
[2023-04-18T23:54:43.729Z] Reflective method invocation Exception for class javax.swing.JList : Cannot invoke "java.lang.reflect.Method.invoke(Object, Object[])" because "<local13>" is null
[2023-04-18T23:54:43.729Z] Bound property found: doubleBuffered
[2023-04-18T23:54:43.729Z] Bound property found: dropMode
[2023-04-18T23:54:43.729Z] Reflective method invocation Exception for class javax.swing.JList : null
[2023-04-18T23:54:43.729Z] Bound property found: enabled
[2023-04-18T23:54:43.729Z] Bound property found: fixedCellHeight
[2023-04-18T23:54:43.729Z] Bound property found: fixedCellWidth
[2023-04-18T23:54:43.729Z] Bound property found: focusCycleRoot
[2023-04-18T23:54:43.729Z] Bound property found: focusTraversalKeys
[2023-04-18T23:54:43.729Z] Reflective method invocation Exception for class javax.swing.JList : Cannot invoke "java.lang.reflect.Method.invoke(Object, Object[])" because "<local12>" is null
[2023-04-18T23:54:43.729Z] Bound property found: focusTraversalPolicy
[2023-04-18T23:54:43.729Z] Bound property found: focusTraversalPolicyProvider
[2023-04-18T23:54:43.729Z] Bound property found: focusTraversalPolicySet
[2023-04-18T23:54:43.729Z] Reflective method invocation Exception for class javax.swing.JList : Cannot invoke "java.lang.reflect.Method.invoke(Object, Object[])" because "<local13>" is null
[2023-04-18T23:54:43.729Z] Bound property found: focusable
[2023-04-18T23:54:43.729Z] Bound property found: font
[2023-04-18T23:54:43.729Z] Bound property found: foreground
[2023-04-18T23:54:43.729Z] Bound property found: inheritsPopupMenu
[2023-04-18T23:54:43.729Z] Bound property found: inputMap
[2023-04-18T23:54:43.729Z] Reflective method invocation Exception for class javax.swing.JList : Cannot invoke "java.lang.reflect.Method.invoke(Object, Object[])" because "<local13>" is null
[2023-04-18T23:54:43.729Z] Bound property found: inputVerifier
[2023-04-18T23:54:43.729Z] Bound property found: insets
[2023-04-18T23:54:43.729Z] Reflective method invocation Exception for class javax.swing.JList : Cannot invoke "java.lang.reflect.Method.invoke(Object, Object[])" because "<local13>" is null
[2023-04-18T23:54:43.729Z] Bound property found: layout
[2023-04-18T23:54:43.729Z] Bound property found: layoutOrientation
[2023-04-18T23:54:43.729Z] Bound property found: listData
[2023-04-18T23:54:43.729Z] Reflective method invocation Exception for class javax.swing.JList : Cannot invoke "java.lang.reflect.Method.invoke(Object, Object[])" because "<local12>" is null
[2023-04-18T23:54:43.729Z] Bound property found: maximumSize
[2023-04-18T23:54:43.729Z] Bound property found: minimumSize
[2023-04-18T23:54:43.729Z] Bound property found: model
[2023-04-18T23:54:43.729Z] Reflective method invocation Exception for class javax.swing.JList : null
[2023-04-18T23:54:43.729Z] Bound property found: name
[2023-04-18T23:54:43.729Z] Bound property found: nextFocusableComponent
[2023-04-18T23:54:43.729Z] Bound property found: opaque
[2023-04-18T23:54:43.729Z] Bound property found: preferredSize
[2023-04-18T23:54:43.729Z] Bound property found: prototypeCellValue
[2023-04-18T23:54:43.729Z] Bound property found: requestFocusEnabled
[2023-04-18T23:54:43.729Z] Bound property found: selectedIndices
[2023-04-18T23:54:43.729Z] Reflective method invocation Exception for class javax.swing.JList : null
[2023-04-18T23:54:43.729Z] Bound property found: selectionBackground
[2023-04-18T23:54:43.729Z] Bound property found: selectionForeground
[2023-04-18T23:54:43.729Z] Bound property found: selectionInterval
[2023-04-18T23:54:43.729Z] Reflective method invocation Exception for class javax.swing.JList : Cannot invoke "java.lang.reflect.Method.invoke(Object, Object[])" because "<local12>" is null
[2023-04-18T23:54:43.729Z] Bound property found: selectionModel
[2023-04-18T23:54:43.729Z] Reflective method invocation Exception for class javax.swing.JList : null
[2023-04-18T23:54:43.729Z] Bound property found: transferHandler
[2023-04-18T23:54:43.729Z] Bound property found: validateRoot
[2023-04-18T23:54:43.729Z] Reflective method invocation Exception for class javax.swing.JList : Cannot invoke "java.lang.reflect.Method.invoke(Object, Object[])" because "<local13>" is null
[2023-04-18T23:54:43.729Z] Bound property found: valueIsAdjusting
[2023-04-18T23:54:43.729Z] Bound property found: verifyInputWhenFocusTarget
[2023-04-18T23:54:43.729Z] Bound property found: visible
[2023-04-18T23:54:43.729Z] Bound property found: visibleRowCount
[2023-04-18T23:54:43.729Z] Bound property found: UI
[2023-04-18T23:54:43.729Z] Bound property found: accelerator
[2023-04-18T23:54:43.729Z] Bound property found: action
[2023-04-18T23:54:43.729Z] Bound property found: actionCommand
[2023-04-18T23:54:43.729Z] Bound property found: actionMap
[2023-04-18T23:54:43.729Z] Bound property found: alignmentX
[2023-04-18T23:54:43.729Z] Reflective method invocation Exception for class javax.swing.JMenuItem : null
[2023-04-18T23:54:43.729Z] Bound property found: alignmentY
[2023-04-18T23:54:43.729Z] Reflective method invocation Exception for class javax.swing.JMenuItem : null
[2023-04-18T23:54:43.729Z] Bound property found: background
[2023-04-18T23:54:43.729Z] Bound property found: border
[2023-04-18T23:54:43.729Z] Bound property found: borderPainted
[2023-04-18T23:54:43.729Z] Bound property found: component
[2023-04-18T23:54:43.729Z] Reflective method invocation Exception for class javax.swing.JMenuItem : Cannot invoke "java.lang.reflect.Method.invoke(Object, Object[])" because "<local13>" is null
[2023-04-18T23:54:43.729Z] Bound property found: componentCount
[2023-04-18T23:54:43.729Z] Reflective method invocation Exception for class javax.swing.JMenuItem : Cannot invoke "java.lang.reflect.Method.invoke(Object, Object[])" because "<local13>" is null
[2023-04-18T23:54:43.729Z] Bound property found: componentPopupMenu
[2023-04-18T23:54:43.729Z] Bound property found: components
[2023-04-18T23:54:43.729Z] Reflective method invocation Exception for class javax.swing.JMenuItem : Cannot invoke "java.lang.reflect.Method.invoke(Object, Object[])" because "<local13>" is null
[2023-04-18T23:54:43.729Z] Bound property found: containerListeners
[2023-04-18T23:54:43.730Z] Reflective method invocation Exception for class javax.swing.JMenuItem : Cannot invoke "java.lang.reflect.Method.invoke(Object, Object[])" because "<local13>" is null
[2023-04-18T23:54:43.730Z] Bound property found: contentAreaFilled
[2023-04-18T23:54:43.730Z] Bound property found: disabledIcon
[2023-04-18T23:54:43.730Z] Bound property found: disabledSelectedIcon
[2023-04-18T23:54:43.730Z] Bound property found: displayedMnemonicIndex
[2023-04-18T23:54:43.730Z] Reflective method invocation Exception for class javax.swing.JMenuItem : null
[2023-04-18T23:54:43.730Z] Bound property found: doubleBuffered
[2023-04-18T23:54:43.730Z] Bound property found: enabled
[2023-04-18T23:54:43.730Z] Bound property found: focusCycleRoot
[2023-04-18T23:54:43.730Z] Bound property found: focusPainted
[2023-04-18T23:54:43.730Z] Bound property found: focusTraversalKeys
[2023-04-18T23:54:43.730Z] Reflective method invocation Exception for class javax.swing.JMenuItem : Cannot invoke "java.lang.reflect.Method.invoke(Object, Object[])" because "<local12>" is null
[2023-04-18T23:54:43.730Z] Bound property found: focusTraversalPolicy
[2023-04-18T23:54:43.730Z] Bound property found: focusTraversalPolicyProvider
[2023-04-18T23:54:43.730Z] Bound property found: focusTraversalPolicySet
[2023-04-18T23:54:43.730Z] Reflective method invocation Exception for class javax.swing.JMenuItem : Cannot invoke "java.lang.reflect.Method.invoke(Object, Object[])" because "<local13>" is null
[2023-04-18T23:54:43.730Z] Bound property found: focusable
[2023-04-18T23:54:43.730Z] Bound property found: font
[2023-04-18T23:54:43.730Z] Bound property found: foreground
[2023-04-18T23:54:43.730Z] Bound property found: hideActionText
[2023-04-18T23:54:43.730Z] Bound property found: horizontalAlignment
[2023-04-18T23:54:43.730Z] Bound property found: horizontalTextPosition
[2023-04-18T23:54:43.730Z] Reflective method invocation Exception for class javax.swing.JMenuItem : null
[2023-04-18T23:54:43.730Z] Bound property found: icon
[2023-04-18T23:54:43.730Z] Bound property found: iconTextGap
[2023-04-18T23:54:43.730Z] Bound property found: inheritsPopupMenu
[2023-04-18T23:54:43.730Z] Bound property found: inputMap
[2023-04-18T23:54:43.730Z] Reflective method invocation Exception for class javax.swing.JMenuItem : Cannot invoke "java.lang.reflect.Method.invoke(Object, Object[])" because "<local13>" is null
[2023-04-18T23:54:43.730Z] Bound property found: inputVerifier
[2023-04-18T23:54:43.730Z] Bound property found: insets
[2023-04-18T23:54:43.730Z] Reflective method invocation Exception for class javax.swing.JMenuItem : Cannot invoke "java.lang.reflect.Method.invoke(Object, Object[])" because "<local13>" is null
[2023-04-18T23:54:43.730Z] Bound property found: label
[2023-04-18T23:54:43.730Z] Bound property found: layout
[2023-04-18T23:54:43.730Z] Bound property found: margin
[2023-04-18T23:54:43.730Z] Bound property found: maximumSize
[2023-04-18T23:54:43.730Z] Bound property found: minimumSize
[2023-04-18T23:54:43.730Z] Bound property found: mnemonic
[2023-04-18T23:54:43.730Z] Bound property found: model
[2023-04-18T23:54:43.730Z] Bound property found: multiClickThreshhold
[2023-04-18T23:54:43.730Z] Reflective method invocation Exception for class javax.swing.JMenuItem : null
[2023-04-18T23:54:43.730Z] Bound property found: name
[2023-04-18T23:54:43.730Z] Bound property found: nextFocusableComponent
[2023-04-18T23:54:43.730Z] Bound property found: opaque
[2023-04-18T23:54:43.730Z] Bound property found: preferredSize
[2023-04-18T23:54:43.730Z] Bound property found: pressedIcon
[2023-04-18T23:54:43.730Z] Bound property found: requestFocusEnabled
[2023-04-18T23:54:43.730Z] Bound property found: rolloverEnabled
[2023-04-18T23:54:43.730Z] Bound property found: rolloverIcon
[2023-04-18T23:54:43.730Z] Bound property found: rolloverSelectedIcon
[2023-04-18T23:54:43.730Z] Bound property found: selected
[2023-04-18T23:54:43.730Z] Reflective method invocation Exception for class javax.swing.JMenuItem : null
[2023-04-18T23:54:43.730Z] Bound property found: selectedIcon
[2023-04-18T23:54:43.730Z] Bound property found: text
[2023-04-18T23:54:43.730Z] Bound property found: transferHandler
[2023-04-18T23:54:43.730Z] Bound property found: validateRoot
[2023-04-18T23:54:43.730Z] Reflective method invocation Exception for class javax.swing.JMenuItem : Cannot invoke "java.lang.reflect.Method.invoke(Object, Object[])" because "<local13>" is null
[2023-04-18T23:54:43.730Z] Bound property found: verifyInputWhenFocusTarget
[2023-04-18T23:54:43.730Z] Bound property found: verticalAlignment
[2023-04-18T23:54:43.730Z] Bound property found: verticalTextPosition
[2023-04-18T23:54:43.730Z] Bound property found: visible
[2023-04-18T23:54:43.730Z] Bound property found: UI
[2023-04-18T23:54:43.730Z] Bound property found: actionMap
[2023-04-18T23:54:43.730Z] Bound property found: alignmentX
[2023-04-18T23:54:43.730Z] Reflective method invocation Exception for class javax.swing.JProgressBar : null
[2023-04-18T23:54:43.730Z] Bound property found: alignmentY
[2023-04-18T23:54:43.730Z] Reflective method invocation Exception for class javax.swing.JProgressBar : null
[2023-04-18T23:54:43.730Z] Bound property found: background
[2023-04-18T23:54:43.730Z] Bound property found: border
[2023-04-18T23:54:43.730Z] Bound property found: borderPainted
[2023-04-18T23:54:43.730Z] Bound property found: component
[2023-04-18T23:54:43.730Z] Reflective method invocation Exception for class javax.swing.JProgressBar : Cannot invoke "java.lang.reflect.Method.invoke(Object, Object[])" because "<local12>" is null
[2023-04-18T23:54:43.730Z] Bound property found: componentCount
[2023-04-18T23:54:43.730Z] Reflective method invocation Exception for class javax.swing.JProgressBar : Cannot invoke "java.lang.reflect.Method.invoke(Object, Object[])" because "<local13>" is null
[2023-04-18T23:54:43.730Z] Bound property found: componentPopupMenu
[2023-04-18T23:54:43.730Z] Bound property found: components
[2023-04-18T23:54:43.730Z] Reflective method invocation Exception for class javax.swing.JProgressBar : Cannot invoke "java.lang.reflect.Method.invoke(Object, Object[])" because "<local13>" is null
[2023-04-18T23:54:43.730Z] Bound property found: containerListeners
[2023-04-18T23:54:43.730Z] Reflective method invocation Exception for class javax.swing.JProgressBar : Cannot invoke "java.lang.reflect.Method.invoke(Object, Object[])" because "<local13>" is null
[2023-04-18T23:54:43.730Z] Bound property found: doubleBuffered
[2023-04-18T23:54:43.730Z] Bound property found: enabled
[2023-04-18T23:54:43.730Z] Bound property found: focusCycleRoot
[2023-04-18T23:54:43.730Z] Bound property found: focusTraversalKeys
[2023-04-18T23:54:43.730Z] Reflective method invocation Exception for class javax.swing.JProgressBar : Cannot invoke "java.lang.reflect.Method.invoke(Object, Object[])" because "<local12>" is null
[2023-04-18T23:54:43.730Z] Bound property found: focusTraversalPolicy
[2023-04-18T23:54:43.730Z] Bound property found: focusTraversalPolicyProvider
[2023-04-18T23:54:43.730Z] Bound property found: focusTraversalPolicySet
[2023-04-18T23:54:43.730Z] Reflective method invocation Exception for class javax.swing.JProgressBar : Cannot invoke "java.lang.reflect.Method.invoke(Object, Object[])" because "<local13>" is null
[2023-04-18T23:54:43.730Z] Bound property found: focusable
[2023-04-18T23:54:43.730Z] Bound property found: font
[2023-04-18T23:54:43.730Z] Bound property found: foreground
[2023-04-18T23:54:43.730Z] Bound property found: inheritsPopupMenu
[2023-04-18T23:54:43.730Z] Bound property found: inputMap
[2023-04-18T23:54:43.730Z] Reflective method invocation Exception for class javax.swing.JProgressBar : Cannot invoke "java.lang.reflect.Method.invoke(Object, Object[])" because "<local13>" is null
[2023-04-18T23:54:43.730Z] Bound property found: inputVerifier
[2023-04-18T23:54:43.730Z] Bound property found: insets
[2023-04-18T23:54:43.730Z] Reflective method invocation Exception for class javax.swing.JProgressBar : Cannot invoke "java.lang.reflect.Method.invoke(Object, Object[])" because "<local13>" is null
[2023-04-18T23:54:43.730Z] Bound property found: layout
[2023-04-18T23:54:43.730Z] Bound property found: maximumSize
[2023-04-18T23:54:43.731Z] Bound property found: minimumSize
[2023-04-18T23:54:43.731Z] Bound property found: name
[2023-04-18T23:54:43.731Z] Bound property found: nextFocusableComponent
[2023-04-18T23:54:43.731Z] Bound property found: opaque
[2023-04-18T23:54:43.731Z] Bound property found: orientation
[2023-04-18T23:54:43.731Z] Bound property found: preferredSize
[2023-04-18T23:54:43.731Z] Bound property found: requestFocusEnabled
[2023-04-18T23:54:43.731Z] Bound property found: string
[2023-04-18T23:54:43.731Z] Bound property found: stringPainted
[2023-04-18T23:54:43.731Z] Bound property found: transferHandler
[2023-04-18T23:54:43.731Z] Bound property found: validateRoot
[2023-04-18T23:54:43.731Z] Reflective method invocation Exception for class javax.swing.JProgressBar : Cannot invoke "java.lang.reflect.Method.invoke(Object, Object[])" because "<local13>" is null
[2023-04-18T23:54:43.731Z] Bound property found: verifyInputWhenFocusTarget
[2023-04-18T23:54:43.731Z] Bound property found: visible
[2023-04-18T23:54:43.731Z] Bound property found: UI
[2023-04-18T23:54:43.731Z] Bound property found: actionMap
[2023-04-18T23:54:43.731Z] Bound property found: alignmentX
[2023-04-18T23:54:43.731Z] Reflective method invocation Exception for class javax.swing.JTextArea : null
[2023-04-18T23:54:43.731Z] Bound property found: alignmentY
[2023-04-18T23:54:43.731Z] Reflective method invocation Exception for class javax.swing.JTextArea : null
[2023-04-18T23:54:43.731Z] Bound property found: background
[2023-04-18T23:54:43.731Z] Bound property found: border
[2023-04-18T23:54:43.731Z] Bound property found: caret
[2023-04-18T23:54:43.731Z] Bound property found: caretColor
[2023-04-18T23:54:43.731Z] Bound property found: component
[2023-04-18T23:54:43.731Z] Reflective method invocation Exception for class javax.swing.JTextArea : Cannot invoke "java.lang.reflect.Method.invoke(Object, Object[])" because "<local12>" is null
[2023-04-18T23:54:43.731Z] Bound property found: componentCount
[2023-04-18T23:54:43.731Z] Reflective method invocation Exception for class javax.swing.JTextArea : Cannot invoke "java.lang.reflect.Method.invoke(Object, Object[])" because "<local13>" is null
[2023-04-18T23:54:43.731Z] Bound property found: componentOrientation
[2023-04-18T23:54:43.731Z] Reflective method invocation Exception for class javax.swing.JTextArea : Cannot invoke "java.lang.reflect.Method.invoke(Object, Object[])" because "<local12>" is null
[2023-04-18T23:54:43.731Z] Bound property found: componentPopupMenu
[2023-04-18T23:54:43.731Z] Bound property found: components
[2023-04-18T23:54:43.731Z] Reflective method invocation Exception for class javax.swing.JTextArea : Cannot invoke "java.lang.reflect.Method.invoke(Object, Object[])" because "<local13>" is null
[2023-04-18T23:54:43.731Z] Bound property found: containerListeners
[2023-04-18T23:54:43.731Z] Reflective method invocation Exception for class javax.swing.JTextArea : Cannot invoke "java.lang.reflect.Method.invoke(Object, Object[])" because "<local13>" is null
[2023-04-18T23:54:43.731Z] Bound property found: disabledTextColor
[2023-04-18T23:54:43.731Z] Bound property found: document
[2023-04-18T23:54:43.731Z] Reflective method invocation Exception for class javax.swing.JTextArea : null
[2023-04-18T23:54:43.731Z] Bound property found: doubleBuffered
[2023-04-18T23:54:43.731Z] Bound property found: dropMode
[2023-04-18T23:54:43.731Z] Reflective method invocation Exception for class javax.swing.JTextArea : null
[2023-04-18T23:54:43.731Z] Bound property found: editable
[2023-04-18T23:54:43.731Z] Bound property found: enabled
[2023-04-18T23:54:43.731Z] Bound property found: focusAccelerator
[2023-04-18T23:54:43.731Z] Reflective method invocation Exception for class javax.swing.JTextArea : null
[2023-04-18T23:54:43.731Z] Bound property found: focusCycleRoot
[2023-04-18T23:54:43.731Z] Bound property found: focusTraversalKeys
[2023-04-18T23:54:43.731Z] Reflective method invocation Exception for class javax.swing.JTextArea : Cannot invoke "java.lang.reflect.Method.invoke(Object, Object[])" because "<local12>" is null
[2023-04-18T23:54:43.731Z] Bound property found: focusTraversalPolicy
[2023-04-18T23:54:43.731Z] Bound property found: focusTraversalPolicyProvider
[2023-04-18T23:54:43.731Z] Bound property found: focusTraversalPolicySet
[2023-04-18T23:54:43.731Z] Reflective method invocation Exception for class javax.swing.JTextArea : Cannot invoke "java.lang.reflect.Method.invoke(Object, Object[])" because "<local13>" is null
[2023-04-18T23:54:43.731Z] Bound property found: focusable
[2023-04-18T23:54:43.731Z] Bound property found: font
[2023-04-18T23:54:43.731Z] Bound property found: foreground
[2023-04-18T23:54:43.731Z] Bound property found: highlighter
[2023-04-18T23:54:43.731Z] Bound property found: inheritsPopupMenu
[2023-04-18T23:54:43.731Z] Bound property found: inputMap
[2023-04-18T23:54:43.731Z] Reflective method invocation Exception for class javax.swing.JTextArea : Cannot invoke "java.lang.reflect.Method.invoke(Object, Object[])" because "<local13>" is null
[2023-04-18T23:54:43.731Z] Bound property found: inputVerifier
[2023-04-18T23:54:43.731Z] Bound property found: insets
[2023-04-18T23:54:43.731Z] Reflective method invocation Exception for class javax.swing.JTextArea : Cannot invoke "java.lang.reflect.Method.invoke(Object, Object[])" because "<local13>" is null
[2023-04-18T23:54:43.731Z] Bound property found: keymap
[2023-04-18T23:54:43.731Z] Bound property found: layout
[2023-04-18T23:54:43.731Z] Bound property found: lineEndOffset
[2023-04-18T23:54:43.731Z] Reflective method invocation Exception for class javax.swing.JTextArea : Cannot invoke "java.lang.reflect.Method.invoke(Object, Object[])" because "<local12>" is null
[2023-04-18T23:54:43.731Z] Bound property found: lineOfOffset
[2023-04-18T23:54:43.731Z] Reflective method invocation Exception for class javax.swing.JTextArea : Cannot invoke "java.lang.reflect.Method.invoke(Object, Object[])" because "<local12>" is null
[2023-04-18T23:54:43.731Z] Bound property found: lineStartOffset
[2023-04-18T23:54:43.731Z] Reflective method invocation Exception for class javax.swing.JTextArea : Cannot invoke "java.lang.reflect.Method.invoke(Object, Object[])" because "<local12>" is null
[2023-04-18T23:54:43.731Z] Bound property found: lineWrap
[2023-04-18T23:54:43.731Z] Bound property found: margin
[2023-04-18T23:54:43.731Z] Bound property found: maximumSize
[2023-04-18T23:54:43.731Z] Bound property found: minimumSize
[2023-04-18T23:54:43.731Z] Bound property found: name
[2023-04-18T23:54:43.731Z] Bound property found: navigationFilter
[2023-04-18T23:54:43.731Z] Bound property found: nextFocusableComponent
[2023-04-18T23:54:43.731Z] Bound property found: opaque
[2023-04-18T23:54:43.731Z] Bound property found: preferredSize
[2023-04-18T23:54:43.731Z] Bound property found: requestFocusEnabled
[2023-04-18T23:54:43.731Z] Bound property found: selectedTextColor
[2023-04-18T23:54:43.731Z] Bound property found: selectionColor
[2023-04-18T23:54:43.731Z] Bound property found: tabSize
[2023-04-18T23:54:43.731Z] Bound property found: transferHandler
[2023-04-18T23:54:43.731Z] Bound property found: validateRoot
[2023-04-18T23:54:43.731Z] Reflective method invocation Exception for class javax.swing.JTextArea : Cannot invoke "java.lang.reflect.Method.invoke(Object, Object[])" because "<local13>" is null
[2023-04-18T23:54:43.731Z] Bound property found: verifyInputWhenFocusTarget
[2023-04-18T23:54:43.731Z] Bound property found: visible
[2023-04-18T23:54:43.731Z] Bound property found: wrapStyleWord
[2023-04-18T23:54:43.731Z] Bound property found: UI
[2023-04-18T23:54:43.731Z] Bound property found: actionMap
[2023-04-18T23:54:43.731Z] Bound property found: alignmentX
[2023-04-18T23:54:43.731Z] Reflective method invocation Exception for class javax.swing.JTextPane : null
[2023-04-18T23:54:43.731Z] Bound property found: alignmentY
[2023-04-18T23:54:43.731Z] Reflective method invocation Exception for class javax.swing.JTextPane : null
[2023-04-18T23:54:43.731Z] Bound property found: background
[2023-04-18T23:54:43.731Z] Bound property found: border
[2023-04-18T23:54:43.732Z] Bound property found: caret
[2023-04-18T23:54:43.732Z] Bound property found: caretColor
[2023-04-18T23:54:43.732Z] Bound property found: component
[2023-04-18T23:54:43.732Z] Reflective method invocation Exception for class javax.swing.JTextPane : Cannot invoke "java.lang.reflect.Method.invoke(Object, Object[])" because "<local12>" is null
[2023-04-18T23:54:43.732Z] Bound property found: componentCount
[2023-04-18T23:54:43.732Z] Reflective method invocation Exception for class javax.swing.JTextPane : Cannot invoke "java.lang.reflect.Method.invoke(Object, Object[])" because "<local13>" is null
[2023-04-18T23:54:43.732Z] Bound property found: componentOrientation
[2023-04-18T23:54:43.732Z] Reflective method invocation Exception for class javax.swing.JTextPane : Cannot invoke "java.lang.reflect.Method.invoke(Object, Object[])" because "<local12>" is null
[2023-04-18T23:54:43.732Z] Bound property found: componentPopupMenu
[2023-04-18T23:54:43.732Z] Bound property found: components
[2023-04-18T23:54:43.732Z] Reflective method invocation Exception for class javax.swing.JTextPane : Cannot invoke "java.lang.reflect.Method.invoke(Object, Object[])" because "<local13>" is null
[2023-04-18T23:54:43.732Z] Bound property found: containerListeners
[2023-04-18T23:54:43.732Z] Reflective method invocation Exception for class javax.swing.JTextPane : Cannot invoke "java.lang.reflect.Method.invoke(Object, Object[])" because "<local13>" is null
[2023-04-18T23:54:43.732Z] Bound property found: disabledTextColor
[2023-04-18T23:54:43.732Z] Bound property found: document
[2023-04-18T23:54:43.732Z] Reflective method invocation Exception for class javax.swing.JTextPane : null
[2023-04-18T23:54:43.732Z] Bound property found: doubleBuffered
[2023-04-18T23:54:43.732Z] Bound property found: dropMode
[2023-04-18T23:54:43.732Z] Reflective method invocation Exception for class javax.swing.JTextPane : null
[2023-04-18T23:54:43.732Z] Bound property found: editable
[2023-04-18T23:54:43.732Z] Bound property found: editorKit
[2023-04-18T23:54:43.732Z] Reflective method invocation Exception for class javax.swing.JTextPane : null
[2023-04-18T23:54:43.732Z] Bound property found: enabled
[2023-04-18T23:54:43.732Z] Bound property found: focusAccelerator
[2023-04-18T23:54:43.732Z] Reflective method invocation Exception for class javax.swing.JTextPane : null
[2023-04-18T23:54:43.732Z] Bound property found: focusCycleRoot
[2023-04-18T23:54:43.732Z] Bound property found: focusTraversalKeys
[2023-04-18T23:54:43.732Z] Reflective method invocation Exception for class javax.swing.JTextPane : Cannot invoke "java.lang.reflect.Method.invoke(Object, Object[])" because "<local12>" is null
[2023-04-18T23:54:43.732Z] Bound property found: focusTraversalPolicy
[2023-04-18T23:54:43.732Z] Bound property found: focusTraversalPolicyProvider
[2023-04-18T23:54:43.732Z] Bound property found: focusTraversalPolicySet
[2023-04-18T23:54:43.732Z] Reflective method invocation Exception for class javax.swing.JTextPane : Cannot invoke "java.lang.reflect.Method.invoke(Object, Object[])" because "<local13>" is null
[2023-04-18T23:54:43.732Z] Bound property found: focusable
[2023-04-18T23:54:43.732Z] Bound property found: font
[2023-04-18T23:54:43.732Z] Bound property found: foreground
[2023-04-18T23:54:43.732Z] Bound property found: highlighter
[2023-04-18T23:54:43.732Z] Bound property found: inheritsPopupMenu
[2023-04-18T23:54:43.732Z] Bound property found: inputMap
[2023-04-18T23:54:43.732Z] Reflective method invocation Exception for class javax.swing.JTextPane : Cannot invoke "java.lang.reflect.Method.invoke(Object, Object[])" because "<local13>" is null
[2023-04-18T23:54:43.732Z] Bound property found: inputVerifier
[2023-04-18T23:54:43.732Z] Bound property found: insets
[2023-04-18T23:54:43.732Z] Reflective method invocation Exception for class javax.swing.JTextPane : Cannot invoke "java.lang.reflect.Method.invoke(Object, Object[])" because "<local13>" is null
[2023-04-18T23:54:43.732Z] Bound property found: keymap
[2023-04-18T23:54:43.732Z] Bound property found: layout
[2023-04-18T23:54:43.732Z] Bound property found: logicalStyle
[2023-04-18T23:54:43.732Z] Reflective method invocation Exception for class javax.swing.JTextPane : null
[2023-04-18T23:54:43.732Z] Bound property found: margin
[2023-04-18T23:54:43.732Z] Bound property found: maximumSize
[2023-04-18T23:54:43.732Z] Bound property found: minimumSize
[2023-04-18T23:54:43.732Z] Bound property found: name
[2023-04-18T23:54:43.732Z] Bound property found: navigationFilter
[2023-04-18T23:54:43.732Z] Bound property found: nextFocusableComponent
[2023-04-18T23:54:43.732Z] Bound property found: opaque
[2023-04-18T23:54:43.732Z] Bound property found: page
[2023-04-18T23:54:43.732Z] Reflective method invocation Exception for class javax.swing.JTextPane : null
[2023-04-18T23:54:43.732Z] Bound property found: preferredSize
[2023-04-18T23:54:43.732Z] Bound property found: requestFocusEnabled
[2023-04-18T23:54:43.732Z] Bound property found: selectedTextColor
[2023-04-18T23:54:43.732Z] Bound property found: selectionColor
[2023-04-18T23:54:43.732Z] Bound property found: styledDocument
[2023-04-18T23:54:43.732Z] Reflective method invocation Exception for class javax.swing.JTextPane : null
[2023-04-18T23:54:43.732Z] Bound property found: transferHandler
[2023-04-18T23:54:43.732Z] Bound property found: validateRoot
[2023-04-18T23:54:43.732Z] Reflective method invocation Exception for class javax.swing.JTextPane : Cannot invoke "java.lang.reflect.Method.invoke(Object, Object[])" because "<local13>" is null
[2023-04-18T23:54:43.732Z] Bound property found: verifyInputWhenFocusTarget
[2023-04-18T23:54:43.732Z] Bound property found: visible
[2023-04-18T23:54:43.732Z] Bound property found: UI
[2023-04-18T23:54:43.732Z] Bound property found: action
[2023-04-18T23:54:43.732Z] Bound property found: actionCommand
[2023-04-18T23:54:43.732Z] Reflective method invocation Exception for class javax.swing.JTextField : Cannot invoke "java.lang.reflect.Method.invoke(Object, Object[])" because "<local12>" is null
[2023-04-18T23:54:43.732Z] Bound property found: actionMap
[2023-04-18T23:54:43.732Z] Bound property found: alignmentX
[2023-04-18T23:54:43.732Z] Reflective method invocation Exception for class javax.swing.JTextField : null
[2023-04-18T23:54:43.732Z] Bound property found: alignmentY
[2023-04-18T23:54:43.732Z] Reflective method invocation Exception for class javax.swing.JTextField : null
[2023-04-18T23:54:43.732Z] Bound property found: background
[2023-04-18T23:54:43.732Z] Bound property found: border
[2023-04-18T23:54:43.732Z] Bound property found: caret
[2023-04-18T23:54:43.732Z] Bound property found: caretColor
[2023-04-18T23:54:43.732Z] Bound property found: component
[2023-04-18T23:54:43.732Z] Reflective method invocation Exception for class javax.swing.JTextField : Cannot invoke "java.lang.reflect.Method.invoke(Object, Object[])" because "<local12>" is null
[2023-04-18T23:54:43.732Z] Bound property found: componentCount
[2023-04-18T23:54:43.732Z] Reflective method invocation Exception for class javax.swing.JTextField : Cannot invoke "java.lang.reflect.Method.invoke(Object, Object[])" because "<local13>" is null
[2023-04-18T23:54:43.732Z] Bound property found: componentOrientation
[2023-04-18T23:54:43.732Z] Reflective method invocation Exception for class javax.swing.JTextField : Cannot invoke "java.lang.reflect.Method.invoke(Object, Object[])" because "<local12>" is null
[2023-04-18T23:54:43.732Z] Bound property found: componentPopupMenu
[2023-04-18T23:54:43.732Z] Bound property found: components
[2023-04-18T23:54:43.732Z] Reflective method invocation Exception for class javax.swing.JTextField : Cannot invoke "java.lang.reflect.Method.invoke(Object, Object[])" because "<local13>" is null
[2023-04-18T23:54:43.732Z] Bound property found: containerListeners
[2023-04-18T23:54:43.732Z] Reflective method invocation Exception for class javax.swing.JTextField : Cannot invoke "java.lang.reflect.Method.invoke(Object, Object[])" because "<local13>" is null
[2023-04-18T23:54:43.733Z] Bound property found: disabledTextColor
[2023-04-18T23:54:43.733Z] Bound property found: document
[2023-04-18T23:54:43.733Z] Reflective method invocation Exception for class javax.swing.JTextField : null
[2023-04-18T23:54:43.733Z] Bound property found: doubleBuffered
[2023-04-18T23:54:43.733Z] Bound property found: dropMode
[2023-04-18T23:54:43.733Z] Reflective method invocation Exception for class javax.swing.JTextField : null
[2023-04-18T23:54:43.733Z] Bound property found: editable
[2023-04-18T23:54:43.733Z] Bound property found: enabled
[2023-04-18T23:54:43.733Z] Bound property found: focusAccelerator
[2023-04-18T23:54:43.733Z] Reflective method invocation Exception for class javax.swing.JTextField : null
[2023-04-18T23:54:43.733Z] Bound property found: focusCycleRoot
[2023-04-18T23:54:43.733Z] Bound property found: focusTraversalKeys
[2023-04-18T23:54:43.733Z] Reflective method invocation Exception for class javax.swing.JTextField : Cannot invoke "java.lang.reflect.Method.invoke(Object, Object[])" because "<local12>" is null
[2023-04-18T23:54:43.733Z] Bound property found: focusTraversalPolicy
[2023-04-18T23:54:43.733Z] Bound property found: focusTraversalPolicyProvider
[2023-04-18T23:54:43.733Z] Bound property found: focusTraversalPolicySet
[2023-04-18T23:54:43.733Z] Reflective method invocation Exception for class javax.swing.JTextField : Cannot invoke "java.lang.reflect.Method.invoke(Object, Object[])" because "<local13>" is null
[2023-04-18T23:54:43.733Z] Bound property found: focusable
[2023-04-18T23:54:43.733Z] Bound property found: font
[2023-04-18T23:54:43.733Z] Bound property found: foreground
[2023-04-18T23:54:43.733Z] Bound property found: highlighter
[2023-04-18T23:54:43.733Z] Bound property found: horizontalAlignment
[2023-04-18T23:54:43.733Z] Bound property found: inheritsPopupMenu
[2023-04-18T23:54:43.733Z] Bound property found: inputMap
[2023-04-18T23:54:43.733Z] Reflective method invocation Exception for class javax.swing.JTextField : Cannot invoke "java.lang.reflect.Method.invoke(Object, Object[])" because "<local13>" is null
[2023-04-18T23:54:43.733Z] Bound property found: inputVerifier
[2023-04-18T23:54:43.733Z] Bound property found: insets
[2023-04-18T23:54:43.733Z] Reflective method invocation Exception for class javax.swing.JTextField : Cannot invoke "java.lang.reflect.Method.invoke(Object, Object[])" because "<local13>" is null
[2023-04-18T23:54:43.733Z] Bound property found: keymap
[2023-04-18T23:54:43.733Z] Bound property found: layout
[2023-04-18T23:54:43.733Z] Bound property found: margin
[2023-04-18T23:54:43.733Z] Bound property found: maximumSize
[2023-04-18T23:54:43.733Z] Bound property found: minimumSize
[2023-04-18T23:54:43.733Z] Bound property found: name
[2023-04-18T23:54:43.733Z] Bound property found: navigationFilter
[2023-04-18T23:54:43.733Z] Bound property found: nextFocusableComponent
[2023-04-18T23:54:43.733Z] Bound property found: opaque
[2023-04-18T23:54:43.733Z] Bound property found: preferredSize
[2023-04-18T23:54:43.733Z] Bound property found: requestFocusEnabled
[2023-04-18T23:54:43.733Z] Bound property found: scrollOffset
[2023-04-18T23:54:43.733Z] Bound property found: selectedTextColor
[2023-04-18T23:54:43.733Z] Bound property found: selectionColor
[2023-04-18T23:54:43.733Z] Bound property found: transferHandler
[2023-04-18T23:54:43.733Z] Bound property found: validateRoot
[2023-04-18T23:54:43.733Z] Reflective method invocation Exception for class javax.swing.JTextField : Cannot invoke "java.lang.reflect.Method.invoke(Object, Object[])" because "<local13>" is null
[2023-04-18T23:54:43.733Z] Bound property found: verifyInputWhenFocusTarget
[2023-04-18T23:54:43.733Z] Bound property found: visible
[2023-04-18T23:54:43.733Z] Bound property found: UI
[2023-04-18T23:54:43.734Z] Bound property found: actionMap
[2023-04-18T23:54:43.734Z] Bound property found: alignmentX
[2023-04-18T23:54:43.734Z] Reflective method invocation Exception for class javax.swing.JToolBar : null
[2023-04-18T23:54:43.734Z] Bound property found: alignmentY
[2023-04-18T23:54:43.734Z] Reflective method invocation Exception for class javax.swing.JToolBar : null
[2023-04-18T23:54:43.734Z] Bound property found: background
[2023-04-18T23:54:43.734Z] Bound property found: border
[2023-04-18T23:54:43.734Z] Bound property found: borderPainted
[2023-04-18T23:54:43.734Z] Bound property found: component
[2023-04-18T23:54:43.734Z] Reflective method invocation Exception for class javax.swing.JToolBar : Cannot invoke "java.lang.reflect.Method.invoke(Object, Object[])" because "<local12>" is null
[2023-04-18T23:54:43.734Z] Bound property found: componentAtIndex
[2023-04-18T23:54:43.734Z] Reflective method invocation Exception for class javax.swing.JToolBar : Cannot invoke "java.lang.reflect.Method.invoke(Object, Object[])" because "<local12>" is null
[2023-04-18T23:54:43.734Z] Bound property found: componentCount
[2023-04-18T23:54:43.734Z] Reflective method invocation Exception for class javax.swing.JToolBar : Cannot invoke "java.lang.reflect.Method.invoke(Object, Object[])" because "<local13>" is null
[2023-04-18T23:54:43.734Z] Bound property found: componentPopupMenu
[2023-04-18T23:54:43.734Z] Bound property found: components
[2023-04-18T23:54:43.734Z] Reflective method invocation Exception for class javax.swing.JToolBar : Cannot invoke "java.lang.reflect.Method.invoke(Object, Object[])" because "<local13>" is null
[2023-04-18T23:54:43.734Z] Bound property found: containerListeners
[2023-04-18T23:54:43.734Z] Reflective method invocation Exception for class javax.swing.JToolBar : Cannot invoke "java.lang.reflect.Method.invoke(Object, Object[])" because "<local13>" is null
[2023-04-18T23:54:43.734Z] Bound property found: doubleBuffered
[2023-04-18T23:54:43.734Z] Bound property found: enabled
[2023-04-18T23:54:43.734Z] Bound property found: floatable
[2023-04-18T23:54:43.734Z] Bound property found: focusCycleRoot
[2023-04-18T23:54:43.734Z] Bound property found: focusTraversalKeys
[2023-04-18T23:54:43.734Z] Reflective method invocation Exception for class javax.swing.JToolBar : Cannot invoke "java.lang.reflect.Method.invoke(Object, Object[])" because "<local12>" is null
[2023-04-18T23:54:43.734Z] Bound property found: focusTraversalPolicy
[2023-04-18T23:54:43.734Z] Bound property found: focusTraversalPolicyProvider
[2023-04-18T23:54:43.734Z] Bound property found: focusTraversalPolicySet
[2023-04-18T23:54:43.734Z] Reflective method invocation Exception for class javax.swing.JToolBar : Cannot invoke "java.lang.reflect.Method.invoke(Object, Object[])" because "<local13>" is null
[2023-04-18T23:54:43.734Z] Bound property found: focusable
[2023-04-18T23:54:43.734Z] Bound property found: font
[2023-04-18T23:54:43.734Z] Bound property found: foreground
[2023-04-18T23:54:43.734Z] Bound property found: inheritsPopupMenu
[2023-04-18T23:54:43.734Z] Bound property found: inputMap
[2023-04-18T23:54:43.734Z] Reflective method invocation Exception for class javax.swing.JToolBar : Cannot invoke "java.lang.reflect.Method.invoke(Object, Object[])" because "<local13>" is null
[2023-04-18T23:54:43.734Z] Bound property found: inputVerifier
[2023-04-18T23:54:43.734Z] Bound property found: insets
[2023-04-18T23:54:43.734Z] Reflective method invocation Exception for class javax.swing.JToolBar : Cannot invoke "java.lang.reflect.Method.invoke(Object, Object[])" because "<local13>" is null
[2023-04-18T23:54:43.734Z] Bound property found: layout
[2023-04-18T23:54:43.734Z] Bound property found: margin
[2023-04-18T23:54:43.734Z] Bound property found: maximumSize
[2023-04-18T23:54:43.734Z] Bound property found: minimumSize
[2023-04-18T23:54:43.734Z] Bound property found: name
[2023-04-18T23:54:43.734Z] Bound property found: nextFocusableComponent
[2023-04-18T23:54:43.734Z] Bound property found: opaque
[2023-04-18T23:54:43.734Z] Bound property found: orientation
[2023-04-18T23:54:43.734Z] Bound property found: preferredSize
[2023-04-18T23:54:43.734Z] Bound property found: requestFocusEnabled
[2023-04-18T23:54:43.734Z] Bound property found: rollover
[2023-04-18T23:54:43.734Z] Bound property found: transferHandler
[2023-04-18T23:54:43.734Z] Bound property found: validateRoot
[2023-04-18T23:54:43.734Z] Reflective method invocation Exception for class javax.swing.JToolBar : Cannot invoke "java.lang.reflect.Method.invoke(Object, Object[])" because "<local13>" is null
[2023-04-18T23:54:43.734Z] Bound property found: verifyInputWhenFocusTarget
[2023-04-18T23:54:43.734Z] Bound property found: visible
[2023-04-18T23:54:43.734Z] Bound property found: UI
[2023-04-18T23:54:43.734Z] Bound property found: actionMap
[2023-04-18T23:54:43.734Z] Bound property found: alignmentX
[2023-04-18T23:54:43.734Z] Reflective method invocation Exception for class javax.swing.JTabbedPane : null
[2023-04-18T23:54:43.734Z] Bound property found: alignmentY
[2023-04-18T23:54:43.734Z] Reflective method invocation Exception for class javax.swing.JTabbedPane : null
[2023-04-18T23:54:43.734Z] Bound property found: background
[2023-04-18T23:54:43.734Z] Bound property found: backgroundAt
[2023-04-18T23:54:43.734Z] Reflective method invocation Exception for class javax.swing.JTabbedPane : Cannot invoke "java.lang.reflect.Method.invoke(Object, Object[])" because "<local12>" is null
[2023-04-18T23:54:43.734Z] Bound property found: border
[2023-04-18T23:54:43.734Z] Bound property found: boundsAt
[2023-04-18T23:54:43.734Z] Reflective method invocation Exception for class javax.swing.JTabbedPane : Cannot invoke "java.lang.reflect.Method.invoke(Object, Object[])" because "<local12>" is null
[2023-04-18T23:54:43.734Z] Bound property found: component
[2023-04-18T23:54:43.734Z] Reflective method invocation Exception for class javax.swing.JTabbedPane : Cannot invoke "java.lang.reflect.Method.invoke(Object, Object[])" because "<local12>" is null
[2023-04-18T23:54:43.734Z] Bound property found: componentAt
[2023-04-18T23:54:43.734Z] Reflective method invocation Exception for class javax.swing.JTabbedPane : Cannot invoke "java.lang.reflect.Method.invoke(Object, Object[])" because "<local12>" is null
[2023-04-18T23:54:43.734Z] Bound property found: componentCount
[2023-04-18T23:54:43.734Z] Reflective method invocation Exception for class javax.swing.JTabbedPane : Cannot invoke "java.lang.reflect.Method.invoke(Object, Object[])" because "<local13>" is null
[2023-04-18T23:54:43.734Z] Bound property found: componentPopupMenu
[2023-04-18T23:54:43.734Z] Bound property found: components
[2023-04-18T23:54:43.734Z] Reflective method invocation Exception for class javax.swing.JTabbedPane : Cannot invoke "java.lang.reflect.Method.invoke(Object, Object[])" because "<local13>" is null
[2023-04-18T23:54:43.734Z] Bound property found: containerListeners
[2023-04-18T23:54:43.734Z] Reflective method invocation Exception for class javax.swing.JTabbedPane : Cannot invoke "java.lang.reflect.Method.invoke(Object, Object[])" because "<local13>" is null
[2023-04-18T23:54:43.734Z] Bound property found: disabledIconAt
[2023-04-18T23:54:43.734Z] Reflective method invocation Exception for class javax.swing.JTabbedPane : Cannot invoke "java.lang.reflect.Method.invoke(Object, Object[])" because "<local12>" is null
[2023-04-18T23:54:43.734Z] Bound property found: displayedMnemonicIndexAt
[2023-04-18T23:54:43.734Z] Reflective method invocation Exception for class javax.swing.JTabbedPane : Cannot invoke "java.lang.reflect.Method.invoke(Object, Object[])" because "<local12>" is null
[2023-04-18T23:54:43.734Z] Bound property found: doubleBuffered
[2023-04-18T23:54:43.734Z] Bound property found: enabled
[2023-04-18T23:54:43.734Z] Bound property found: enabledAt
[2023-04-18T23:54:43.734Z] Reflective method invocation Exception for class javax.swing.JTabbedPane : Cannot invoke "java.lang.reflect.Method.invoke(Object, Object[])" because "<local12>" is null
[2023-04-18T23:54:43.734Z] Bound property found: focusCycleRoot
[2023-04-18T23:54:43.734Z] Bound property found: focusTraversalKeys
[2023-04-18T23:54:43.735Z] Reflective method invocation Exception for class javax.swing.JTabbedPane : Cannot invoke "java.lang.reflect.Method.invoke(Object, Object[])" because "<local12>" is null
[2023-04-18T23:54:43.735Z] Bound property found: focusTraversalPolicy
[2023-04-18T23:54:43.735Z] Bound property found: focusTraversalPolicyProvider
[2023-04-18T23:54:43.735Z] Bound property found: focusTraversalPolicySet
[2023-04-18T23:54:43.735Z] Reflective method invocation Exception for class javax.swing.JTabbedPane : Cannot invoke "java.lang.reflect.Method.invoke(Object, Object[])" because "<local13>" is null
[2023-04-18T23:54:43.735Z] Bound property found: focusable
[2023-04-18T23:54:43.735Z] Bound property found: font
[2023-04-18T23:54:43.735Z] Bound property found: foreground
[2023-04-18T23:54:43.735Z] Bound property found: foregroundAt
[2023-04-18T23:54:43.735Z] Reflective method invocation Exception for class javax.swing.JTabbedPane : Cannot invoke "java.lang.reflect.Method.invoke(Object, Object[])" because "<local12>" is null
[2023-04-18T23:54:43.735Z] Bound property found: iconAt
[2023-04-18T23:54:43.735Z] Reflective method invocation Exception for class javax.swing.JTabbedPane : Cannot invoke "java.lang.reflect.Method.invoke(Object, Object[])" because "<local12>" is null
[2023-04-18T23:54:43.735Z] Bound property found: inheritsPopupMenu
[2023-04-18T23:54:43.735Z] Bound property found: inputMap
[2023-04-18T23:54:43.735Z] Reflective method invocation Exception for class javax.swing.JTabbedPane : Cannot invoke "java.lang.reflect.Method.invoke(Object, Object[])" because "<local13>" is null
[2023-04-18T23:54:43.735Z] Bound property found: inputVerifier
[2023-04-18T23:54:43.735Z] Bound property found: insets
[2023-04-18T23:54:43.735Z] Reflective method invocation Exception for class javax.swing.JTabbedPane : Cannot invoke "java.lang.reflect.Method.invoke(Object, Object[])" because "<local13>" is null
[2023-04-18T23:54:43.735Z] Bound property found: layout
[2023-04-18T23:54:43.735Z] Bound property found: maximumSize
[2023-04-18T23:54:43.735Z] Bound property found: minimumSize
[2023-04-18T23:54:43.735Z] Bound property found: mnemonicAt
[2023-04-18T23:54:43.735Z] Reflective method invocation Exception for class javax.swing.JTabbedPane : Cannot invoke "java.lang.reflect.Method.invoke(Object, Object[])" because "<local12>" is null
[2023-04-18T23:54:43.735Z] Bound property found: model
[2023-04-18T23:54:43.735Z] Bound property found: name
[2023-04-18T23:54:43.735Z] Bound property found: nextFocusableComponent
[2023-04-18T23:54:43.735Z] Bound property found: opaque
[2023-04-18T23:54:43.735Z] Bound property found: preferredSize
[2023-04-18T23:54:43.735Z] Bound property found: requestFocusEnabled
[2023-04-18T23:54:43.735Z] Bound property found: tabComponentAt
[2023-04-18T23:54:43.735Z] Reflective method invocation Exception for class javax.swing.JTabbedPane : Cannot invoke "java.lang.reflect.Method.invoke(Object, Object[])" because "<local12>" is null
[2023-04-18T23:54:43.735Z] Bound property found: tabLayoutPolicy
[2023-04-18T23:54:43.735Z] Bound property found: tabPlacement
[2023-04-18T23:54:43.735Z] Bound property found: titleAt
[2023-04-18T23:54:43.735Z] Reflective method invocation Exception for class javax.swing.JTabbedPane : Cannot invoke "java.lang.reflect.Method.invoke(Object, Object[])" because "<local12>" is null
[2023-04-18T23:54:43.735Z] Bound property found: toolTipTextAt
[2023-04-18T23:54:43.735Z] Reflective method invocation Exception for class javax.swing.JTabbedPane : Cannot invoke "java.lang.reflect.Method.invoke(Object, Object[])" because "<local12>" is null
[2023-04-18T23:54:43.735Z] Bound property found: transferHandler
[2023-04-18T23:54:43.735Z] Bound property found: validateRoot
[2023-04-18T23:54:43.735Z] Reflective method invocation Exception for class javax.swing.JTabbedPane : Cannot invoke "java.lang.reflect.Method.invoke(Object, Object[])" because "<local13>" is null
[2023-04-18T23:54:43.735Z] Bound property found: verifyInputWhenFocusTarget
[2023-04-18T23:54:43.735Z] Bound property found: visible
[2023-04-18T23:54:43.735Z] STDERR:
[2023-04-18T23:54:43.735Z] java.lang.InternalError: java.lang.reflect.InvocationTargetException
[2023-04-18T23:54:43.735Z] at java.desktop/sun.font.FontManagerFactory$1.run(FontManagerFactory.java:87)
[2023-04-18T23:54:43.735Z] at java.base/java.security.AccessController.doPrivileged(AccessController.java:318)
[2023-04-18T23:54:43.735Z] at java.desktop/sun.font.FontManagerFactory.getInstance(FontManagerFactory.java:75)
[2023-04-18T23:54:43.735Z] at java.desktop/sun.font.SunFontManager.getInstance(SunFontManager.java:248)
[2023-04-18T23:54:43.735Z] at java.desktop/sun.font.FontDesignMetrics.getMetrics(FontDesignMetrics.java:266)
[2023-04-18T23:54:43.735Z] at java.desktop/sun.swing.SwingUtilities2.getFontMetrics(SwingUtilities2.java:1242)
[2023-04-18T23:54:43.735Z] at java.desktop/javax.swing.JComponent.getFontMetrics(JComponent.java:1691)
[2023-04-18T23:54:43.735Z] at java.desktop/javax.swing.plaf.basic.BasicLabelUI.getPreferredSize(BasicLabelUI.java:251)
[2023-04-18T23:54:43.735Z] at java.desktop/javax.swing.JComponent.getPreferredSize(JComponent.java:1725)
[2023-04-18T23:54:43.735Z] at java.desktop/javax.swing.tree.DefaultTreeCellRenderer.getPreferredSize(DefaultTreeCellRenderer.java:636)
[2023-04-18T23:54:43.735Z] at java.desktop/javax.swing.plaf.basic.BasicTreeUI$NodeDimensionsHandler.getNodeDimensions(BasicTreeUI.java:3231)
[2023-04-18T23:54:43.735Z] at java.desktop/javax.swing.tree.AbstractLayoutCache.getNodeDimensions(AbstractLayoutCache.java:497)
[2023-04-18T23:54:43.735Z] at java.desktop/javax.swing.tree.VariableHeightLayoutCache$TreeStateNode.updatePreferredSize(VariableHeightLayoutCache.java:1344)
[2023-04-18T23:54:43.735Z] at java.desktop/javax.swing.tree.VariableHeightLayoutCache.rebuild(VariableHeightLayoutCache.java:723)
[2023-04-18T23:54:43.735Z] at java.desktop/javax.swing.tree.VariableHeightLayoutCache.setModel(VariableHeightLayoutCache.java:111)
[2023-04-18T23:54:43.735Z] at java.desktop/javax.swing.plaf.basic.BasicTreeUI.setModel(BasicTreeUI.java:506)
[2023-04-18T23:54:43.735Z] at java.desktop/javax.swing.plaf.basic.BasicTreeUI$Handler.propertyChange(BasicTreeUI.java:3903)
[2023-04-18T23:54:43.735Z] at java.desktop/java.beans.PropertyChangeSupport.fire(PropertyChangeSupport.java:343)
[2023-04-18T23:54:43.735Z] at java.desktop/java.beans.PropertyChangeSupport.firePropertyChange(PropertyChangeSupport.java:335)
[2023-04-18T23:54:43.735Z] at java.desktop/java.beans.PropertyChangeSupport.firePropertyChange(PropertyChangeSupport.java:268)
[2023-04-18T23:54:43.735Z] at java.desktop/java.awt.Component.firePropertyChange(Component.java:8722)
[2023-04-18T23:54:43.735Z] at java.desktop/javax.swing.JTree.setModel(JTree.java:945)
[2023-04-18T23:54:43.735Z] at java.desktop/javax.swing.JTree.<init>(JTree.java:731)
[2023-04-18T23:54:43.735Z] at java.desktop/javax.swing.JTree.<init>(JTree.java:628)
[2023-04-18T23:54:43.735Z] at java.base/jdk.internal.reflect.NativeConstructorAccessorImpl.newInstance0(Native Method)
[2023-04-18T23:54:43.735Z] at java.base/jdk.internal.reflect.NativeConstructorAccessorImpl.newInstance(NativeConstructorAccessorImpl.java:77)
[2023-04-18T23:54:43.735Z] at java.base/jdk.internal.reflect.DelegatingConstructorAccessorImpl.newInstance(DelegatingConstructorAccessorImpl.java:45)
[2023-04-18T23:54:43.735Z] at java.base/java.lang.reflect.Constructor.newInstanceWithCaller(Constructor.java:499)
[2023-04-18T23:54:43.735Z] at java.base/java.lang.reflect.ReflectAccess.newInstance(ReflectAccess.java:128)
[2023-04-18T23:54:43.735Z] at java.base/jdk.internal.reflect.ReflectionFactory.newInstance(ReflectionFactory.java:347)
[2023-04-18T23:54:43.735Z] at java.base/java.lang.Class.newInstance(Class.java:645)
[2023-04-18T23:54:43.736Z] at java.desktop/java.beans.Beans.instantiate(Beans.java:249)
[2023-04-18T23:54:43.736Z] at java.desktop/java.beans.Beans.instantiate(Beans.java:84)
[2023-04-18T23:54:43.736Z] at Test4682386.testSwingProperties(Test4682386.java:116)
[2023-04-18T23:54:43.736Z] at Test4682386.main(Test4682386.java:91)
[2023-04-18T23:54:43.736Z] at java.base/jdk.internal.reflect.NativeMethodAccessorImpl.invoke0(Native Method)
[2023-04-18T23:54:43.736Z] at java.base/jdk.internal.reflect.NativeMethodAccessorImpl.invoke(NativeMethodAccessorImpl.java:77)
[2023-04-18T23:54:43.736Z] at java.base/jdk.internal.reflect.DelegatingMethodAccessorImpl.invoke(DelegatingMethodAccessorImpl.java:43)
[2023-04-18T23:54:43.736Z] at java.base/java.lang.reflect.Method.invoke(Method.java:568)
[2023-04-18T23:54:43.736Z] at com.sun.javatest.regtest.agent.MainWrapper$MainThread.run(MainWrapper.java:127)
[2023-04-18T23:54:43.736Z] at java.base/java.lang.Thread.run(Thread.java:833)
[2023-04-18T23:54:43.736Z] Caused by: java.lang.reflect.InvocationTargetException
[2023-04-18T23:54:43.736Z] at java.base/jdk.internal.reflect.NativeConstructorAccessorImpl.newInstance0(Native Method)
[2023-04-18T23:54:43.736Z] at java.base/jdk.internal.reflect.NativeConstructorAccessorImpl.newInstance(NativeConstructorAccessorImpl.java:77)
[2023-04-18T23:54:43.736Z] at java.base/jdk.internal.reflect.DelegatingConstructorAccessorImpl.newInstance(DelegatingConstructorAccessorImpl.java:45)
[2023-04-18T23:54:43.736Z] at java.base/java.lang.reflect.Constructor.newInstanceWithCaller(Constructor.java:499)
[2023-04-18T23:54:43.736Z] at java.base/java.lang.reflect.Constructor.newInstance(Constructor.java:480)
[2023-04-18T23:54:43.736Z] at java.desktop/sun.font.FontManagerFactory$1.run(FontManagerFactory.java:85)
[2023-04-18T23:54:43.736Z] ... 40 more
[2023-04-18T23:54:43.736Z] Caused by: java.lang.NullPointerException: Cannot load from short array because "sun.awt.FontConfiguration.head" is null
[2023-04-18T23:54:43.736Z] at java.desktop/sun.awt.FontConfiguration.getVersion(FontConfiguration.java:1264)
[2023-04-18T23:54:43.736Z] at java.desktop/sun.awt.FontConfiguration.readFontConfigFile(FontConfiguration.java:224)
[2023-04-18T23:54:43.736Z] at java.desktop/sun.awt.FontConfiguration.init(FontConfiguration.java:106)
[2023-04-18T23:54:43.736Z] at java.desktop/sun.awt.X11FontManager.createFontConfiguration(X11FontManager.java:706)
[2023-04-18T23:54:43.736Z] at java.desktop/sun.font.SunFontManager$2.run(SunFontManager.java:358)
[2023-04-18T23:54:43.736Z] at java.desktop/sun.font.SunFontManager$2.run(SunFontManager.java:315)
[2023-04-18T23:54:43.736Z] at java.base/java.security.AccessController.doPrivileged(AccessController.java:318)
[2023-04-18T23:54:43.736Z] at java.desktop/sun.font.SunFontManager.<init>(SunFontManager.java:315)
[2023-04-18T23:54:43.736Z] at java.desktop/sun.awt.FcFontManager.<init>(FcFontManager.java:35)
[2023-04-18T23:54:43.736Z] at java.desktop/sun.awt.X11FontManager.<init>(X11FontManager.java:56)
[2023-04-18T23:54:43.736Z] ... 46 more
[2023-04-18T23:54:43.736Z]
[2023-04-18T23:54:43.736Z] JavaTest Message: Test threw exception: java.lang.InternalError: java.lang.reflect.InvocationTargetException
[2023-04-18T23:54:43.736Z] JavaTest Message: shutting down test
[2023-04-18T23:54:43.736Z]
[2023-04-18T23:54:43.736Z] STATUS:Failed.`main' threw exception: java.lang.InternalError: java.lang.reflect.InvocationTargetException
[2023-04-18T23:54:43.736Z] rerun:
[2023-04-18T23:54:43.736Z] cd /home/jenkins/workspace/Test_openjdk17_hs_extended.openjdk_x86-64_alpine-linux_testList_2/aqa-tests/TKG/output_16818616629195/jdk_beans_1/work/java/beans/PropertyChangeSupport/Test4682386 && \
[2023-04-18T23:54:43.736Z] DISPLAY=:0 \
[2023-04-18T23:54:43.736Z] HOME=/home/jenkins \
[2023-04-18T23:54:43.736Z] PATH=/bin:/usr/bin:/usr/sbin \
[2023-04-18T23:54:43.736Z] CLASSPATH=/home/jenkins/workspace/Test_openjdk17_hs_extended.openjdk_x86-64_alpine-linux_testList_2/aqa-tests/TKG/output_16818616629195/jdk_beans_1/work/classes/java/beans/PropertyChangeSupport/Test4682386.d:/home/jenkins/workspace/Test_openjdk17_hs_extended.openjdk_x86-64_alpine-linux_testList_2/aqa-tests/openjdk/openjdk-jdk/test/jdk/java/beans/PropertyChangeSupport:/home/jenkins/workspace/Test_openjdk17_hs_extended.openjdk_x86-64_alpine-linux_testList_2/jvmtest/openjdk/jtreg/lib/javatest.jar:/home/jenkins/workspace/Test_openjdk17_hs_extended.openjdk_x86-64_alpine-linux_testList_2/jvmtest/openjdk/jtreg/lib/jtreg.jar \
[2023-04-18T23:54:43.736Z] /home/jenkins/workspace/Test_openjdk17_hs_extended.openjdk_x86-64_alpine-linux_testList_2/openjdkbinary/j2sdk-image/bin/java \
[2023-04-18T23:54:43.736Z] -Dtest.vm.opts='-ea -esa -Xmx512m -XX:-UseCompressedOops -Djava.awt.headless=true' \
[2023-04-18T23:54:43.736Z] -Dtest.tool.vm.opts='-J-ea -J-esa -J-Xmx512m -J-XX:-UseCompressedOops -J-Djava.awt.headless=true' \
[2023-04-18T23:54:43.736Z] -Dtest.compiler.opts= \
[2023-04-18T23:54:43.736Z] -Dtest.java.opts= \
[2023-04-18T23:54:43.736Z] -Dtest.jdk=/home/jenkins/workspace/Test_openjdk17_hs_extended.openjdk_x86-64_alpine-linux_testList_2/openjdkbinary/j2sdk-image \
[2023-04-18T23:54:43.736Z] -Dcompile.jdk=/home/jenkins/workspace/Test_openjdk17_hs_extended.openjdk_x86-64_alpine-linux_testList_2/openjdkbinary/j2sdk-image \
[2023-04-18T23:54:43.736Z] -Dtest.timeout.factor=8.0 \
[2023-04-18T23:54:43.736Z] -Dtest.nativepath=/home/jenkins/workspace/Test_openjdk17_hs_extended.openjdk_x86-64_alpine-linux_testList_2/openjdkbinary/openjdk-test-image/jdk/jtreg/native \
[2023-04-18T23:54:43.736Z] -Dtest.root=/home/jenkins/workspace/Test_openjdk17_hs_extended.openjdk_x86-64_alpine-linux_testList_2/aqa-tests/openjdk/openjdk-jdk/test/jdk \
[2023-04-18T23:54:43.736Z] -Dtest.name=java/beans/PropertyChangeSupport/Test4682386.java \
[2023-04-18T23:54:43.736Z] -Dtest.file=/home/jenkins/workspace/Test_openjdk17_hs_extended.openjdk_x86-64_alpine-linux_testList_2/aqa-tests/openjdk/openjdk-jdk/test/jdk/java/beans/PropertyChangeSupport/Test4682386.java \
[2023-04-18T23:54:43.736Z] -Dtest.src=/home/jenkins/workspace/Test_openjdk17_hs_extended.openjdk_x86-64_alpine-linux_testList_2/aqa-tests/openjdk/openjdk-jdk/test/jdk/java/beans/PropertyChangeSupport \
[2023-04-18T23:54:43.736Z] -Dtest.src.path=/home/jenkins/workspace/Test_openjdk17_hs_extended.openjdk_x86-64_alpine-linux_testList_2/aqa-tests/openjdk/openjdk-jdk/test/jdk/java/beans/PropertyChangeSupport \
[2023-04-18T23:54:43.736Z] -Dtest.classes=/home/jenkins/workspace/Test_openjdk17_hs_extended.openjdk_x86-64_alpine-linux_testList_2/aqa-tests/TKG/output_16818616629195/jdk_beans_1/work/classes/java/beans/PropertyChangeSupport/Test4682386.d \
[2023-04-18T23:54:43.736Z] -Dtest.class.path=/home/jenkins/workspace/Test_openjdk17_hs_extended.openjdk_x86-64_alpine-linux_testList_2/aqa-tests/TKG/output_16818616629195/jdk_beans_1/work/classes/java/beans/PropertyChangeSupport/Test4682386.d \
[2023-04-18T23:54:43.736Z] -Dtest.modules=java.desktop \
[2023-04-18T23:54:43.736Z] --add-modules java.desktop \
[2023-04-18T23:54:43.736Z] -ea \
[2023-04-18T23:54:43.736Z] -esa \
[2023-04-18T23:54:43.736Z] -Xmx512m \
[2023-04-18T23:54:43.736Z] -XX:-UseCompressedOops \
[2023-04-18T23:54:43.736Z] -Djava.awt.headless=true \
[2023-04-18T23:54:43.737Z] -Djava.library.path=/home/jenkins/workspace/Test_openjdk17_hs_extended.openjdk_x86-64_alpine-linux_testList_2/openjdkbinary/openjdk-test-image/jdk/jtreg/native \
[2023-04-18T23:54:43.737Z] com.sun.javatest.regtest.agent.MainWrapper /home/jenkins/workspace/Test_openjdk17_hs_extended.openjdk_x86-64_alpine-linux_testList_2/aqa-tests/TKG/output_16818616629195/jdk_beans_1/work/java/beans/PropertyChangeSupport/Test4682386.d/main.0.jta
[2023-04-18T23:54:43.737Z]
[2023-04-18T23:54:43.737Z] TEST RESULT: Failed. Execution failed: `main' threw exception: java.lang.InternalError: java.lang.reflect.InvocationTargetException
[2023-04-18T23:54:43.737Z] --------------------------------------------------
[2023-04-18T23:58:53.628Z] TEST: java/beans/XMLEncoder/javax_swing_DefaultCellEditor.java
[2023-04-18T23:58:53.628Z] TEST JDK: /home/jenkins/workspace/Test_openjdk17_hs_extended.openjdk_x86-64_alpine-linux_testList_2/openjdkbinary/j2sdk-image
[2023-04-18T23:58:53.629Z]
[2023-04-18T23:58:53.629Z] ACTION: build -- Passed. Build successful
[2023-04-18T23:58:53.629Z] REASON: Named class compiled on demand
[2023-04-18T23:58:53.629Z] TIME: 0.694 seconds
[2023-04-18T23:58:53.629Z] messages:
[2023-04-18T23:58:53.629Z] command: build javax_swing_DefaultCellEditor
[2023-04-18T23:58:53.629Z] reason: Named class compiled on demand
[2023-04-18T23:58:53.629Z] Test directory:
[2023-04-18T23:58:53.629Z] compile: javax_swing_DefaultCellEditor
[2023-04-18T23:58:53.629Z] elapsed time (seconds): 0.694
[2023-04-18T23:58:53.629Z]
[2023-04-18T23:58:53.629Z] ACTION: compile -- Passed. Compilation successful
[2023-04-18T23:58:53.629Z] REASON: .class file out of date or does not exist
[2023-04-18T23:58:53.629Z] TIME: 0.694 seconds
[2023-04-18T23:58:53.629Z] messages:
[2023-04-18T23:58:53.629Z] command: compile /home/jenkins/workspace/Test_openjdk17_hs_extended.openjdk_x86-64_alpine-linux_testList_2/aqa-tests/openjdk/openjdk-jdk/test/jdk/java/beans/XMLEncoder/javax_swing_DefaultCellEditor.java
[2023-04-18T23:58:53.629Z] reason: .class file out of date or does not exist
[2023-04-18T23:58:53.629Z] Additional options from @modules: --add-modules java.desktop
[2023-04-18T23:58:53.629Z] Mode: othervm
[2023-04-18T23:58:53.629Z] elapsed time (seconds): 0.694
[2023-04-18T23:58:53.629Z] configuration:
[2023-04-18T23:58:53.629Z] javac compilation environment
[2023-04-18T23:58:53.629Z] add modules: java.desktop
[2023-04-18T23:58:53.629Z] source path: /home/jenkins/workspace/Test_openjdk17_hs_extended.openjdk_x86-64_alpine-linux_testList_2/aqa-tests/openjdk/openjdk-jdk/test/jdk/java/beans/XMLEncoder
[2023-04-18T23:58:53.629Z] class path: /home/jenkins/workspace/Test_openjdk17_hs_extended.openjdk_x86-64_alpine-linux_testList_2/aqa-tests/openjdk/openjdk-jdk/test/jdk/java/beans/XMLEncoder
[2023-04-18T23:58:53.629Z] /home/jenkins/workspace/Test_openjdk17_hs_extended.openjdk_x86-64_alpine-linux_testList_2/aqa-tests/TKG/output_16818616629195/jdk_beans_1/work/classes/java/beans/XMLEncoder/javax_swing_DefaultCellEditor.d
[2023-04-18T23:58:53.629Z]
[2023-04-18T23:58:53.629Z] rerun:
[2023-04-18T23:58:53.629Z] cd /home/jenkins/workspace/Test_openjdk17_hs_extended.openjdk_x86-64_alpine-linux_testList_2/aqa-tests/TKG/output_16818616629195/jdk_beans_1/work/java/beans/XMLEncoder/javax_swing_DefaultCellEditor && \
[2023-04-18T23:58:53.629Z] DISPLAY=:0 \
[2023-04-18T23:58:53.629Z] HOME=/home/jenkins \
[2023-04-18T23:58:53.629Z] PATH=/bin:/usr/bin:/usr/sbin \
[2023-04-18T23:58:53.629Z] /home/jenkins/workspace/Test_openjdk17_hs_extended.openjdk_x86-64_alpine-linux_testList_2/openjdkbinary/j2sdk-image/bin/javac \
[2023-04-18T23:58:53.629Z] -J-ea \
[2023-04-18T23:58:53.629Z] -J-esa \
[2023-04-18T23:58:53.629Z] -J-Xmx512m \
[2023-04-18T23:58:53.629Z] -J-XX:-UseCompressedOops \
[2023-04-18T23:58:53.629Z] -J-Djava.awt.headless=true \
[2023-04-18T23:58:53.629Z] -J-Dtest.vm.opts='-ea -esa -Xmx512m -XX:-UseCompressedOops -Djava.awt.headless=true' \
[2023-04-18T23:58:53.629Z] -J-Dtest.tool.vm.opts='-J-ea -J-esa -J-Xmx512m -J-XX:-UseCompressedOops -J-Djava.awt.headless=true' \
[2023-04-18T23:58:53.629Z] -J-Dtest.compiler.opts= \
[2023-04-18T23:58:53.629Z] -J-Dtest.java.opts= \
[2023-04-18T23:58:53.629Z] -J-Dtest.jdk=/home/jenkins/workspace/Test_openjdk17_hs_extended.openjdk_x86-64_alpine-linux_testList_2/openjdkbinary/j2sdk-image \
[2023-04-18T23:58:53.629Z] -J-Dcompile.jdk=/home/jenkins/workspace/Test_openjdk17_hs_extended.openjdk_x86-64_alpine-linux_testList_2/openjdkbinary/j2sdk-image \
[2023-04-18T23:58:53.629Z] -J-Dtest.timeout.factor=8.0 \
[2023-04-18T23:58:53.629Z] -J-Dtest.nativepath=/home/jenkins/workspace/Test_openjdk17_hs_extended.openjdk_x86-64_alpine-linux_testList_2/openjdkbinary/openjdk-test-image/jdk/jtreg/native \
[2023-04-18T23:58:53.629Z] -J-Dtest.root=/home/jenkins/workspace/Test_openjdk17_hs_extended.openjdk_x86-64_alpine-linux_testList_2/aqa-tests/openjdk/openjdk-jdk/test/jdk \
[2023-04-18T23:58:53.629Z] -J-Dtest.name=java/beans/XMLEncoder/javax_swing_DefaultCellEditor.java \
[2023-04-18T23:58:53.629Z] -J-Dtest.file=/home/jenkins/workspace/Test_openjdk17_hs_extended.openjdk_x86-64_alpine-linux_testList_2/aqa-tests/openjdk/openjdk-jdk/test/jdk/java/beans/XMLEncoder/javax_swing_DefaultCellEditor.java \
[2023-04-18T23:58:53.629Z] -J-Dtest.src=/home/jenkins/workspace/Test_openjdk17_hs_extended.openjdk_x86-64_alpine-linux_testList_2/aqa-tests/openjdk/openjdk-jdk/test/jdk/java/beans/XMLEncoder \
[2023-04-18T23:58:53.629Z] -J-Dtest.src.path=/home/jenkins/workspace/Test_openjdk17_hs_extended.openjdk_x86-64_alpine-linux_testList_2/aqa-tests/openjdk/openjdk-jdk/test/jdk/java/beans/XMLEncoder \
[2023-04-18T23:58:53.629Z] -J-Dtest.classes=/home/jenkins/workspace/Test_openjdk17_hs_extended.openjdk_x86-64_alpine-linux_testList_2/aqa-tests/TKG/output_16818616629195/jdk_beans_1/work/classes/java/beans/XMLEncoder/javax_swing_DefaultCellEditor.d \
[2023-04-18T23:58:53.629Z] -J-Dtest.class.path=/home/jenkins/workspace/Test_openjdk17_hs_extended.openjdk_x86-64_alpine-linux_testList_2/aqa-tests/TKG/output_16818616629195/jdk_beans_1/work/classes/java/beans/XMLEncoder/javax_swing_DefaultCellEditor.d \
[2023-04-18T23:58:53.629Z] -J-Dtest.modules=java.desktop \
[2023-04-18T23:58:53.629Z] --add-modules java.desktop \
[2023-04-18T23:58:53.629Z] -d /home/jenkins/workspace/Test_openjdk17_hs_extended.openjdk_x86-64_alpine-linux_testList_2/aqa-tests/TKG/output_16818616629195/jdk_beans_1/work/classes/java/beans/XMLEncoder/javax_swing_DefaultCellEditor.d \
[2023-04-18T23:58:53.629Z] -sourcepath /home/jenkins/workspace/Test_openjdk17_hs_extended.openjdk_x86-64_alpine-linux_testList_2/aqa-tests/openjdk/openjdk-jdk/test/jdk/java/beans/XMLEncoder \
[2023-04-18T23:58:53.629Z] -classpath /home/jenkins/workspace/Test_openjdk17_hs_extended.openjdk_x86-64_alpine-linux_testList_2/aqa-tests/openjdk/openjdk-jdk/test/jdk/java/beans/XMLEncoder:/home/jenkins/workspace/Test_openjdk17_hs_extended.openjdk_x86-64_alpine-linux_testList_2/aqa-tests/TKG/output_16818616629195/jdk_beans_1/work/classes/java/beans/XMLEncoder/javax_swing_DefaultCellEditor.d /home/jenkins/workspace/Test_openjdk17_hs_extended.openjdk_x86-64_alpine-linux_testList_2/aqa-tests/openjdk/openjdk-jdk/test/jdk/java/beans/XMLEncoder/javax_swing_DefaultCellEditor.java
[2023-04-18T23:58:53.629Z] STDOUT:
[2023-04-18T23:58:53.629Z] STDERR:
[2023-04-18T23:58:53.629Z] /home/jenkins/workspace/Test_openjdk17_hs_extended.openjdk_x86-64_alpine-linux_testList_2/aqa-tests/openjdk/openjdk-jdk/test/jdk/java/beans/XMLEncoder/AbstractTest.java:118: warning: [removal] SecurityManager in java.lang has been deprecated and marked for removal
[2023-04-18T23:58:53.629Z] System.setSecurityManager(new SecurityManager());
[2023-04-18T23:58:53.629Z] ^
[2023-04-18T23:58:53.629Z] /home/jenkins/workspace/Test_openjdk17_hs_extended.openjdk_x86-64_alpine-linux_testList_2/aqa-tests/openjdk/openjdk-jdk/test/jdk/java/beans/XMLEncoder/AbstractTest.java:118: warning: [removal] setSecurityManager(SecurityManager) in System has been deprecated and marked for removal
[2023-04-18T23:58:53.629Z] System.setSecurityManager(new SecurityManager());
[2023-04-18T23:58:53.629Z] ^
[2023-04-18T23:58:53.629Z] Note: Some input files use unchecked or unsafe operations.
[2023-04-18T23:58:53.629Z] Note: Recompile with -Xlint:unchecked for details.
[2023-04-18T23:58:53.629Z] 2 warnings
[2023-04-18T23:58:53.629Z]
[2023-04-18T23:58:53.629Z] ACTION: main -- Failed. Execution failed: `main' threw exception: java.lang.InternalError: java.lang.reflect.InvocationTargetException
[2023-04-18T23:58:53.630Z] REASON: User specified action: run main/othervm -Djava.security.manager=allow javax_swing_DefaultCellEditor
[2023-04-18T23:58:53.630Z] TIME: 0.233 seconds
[2023-04-18T23:58:53.630Z] messages:
[2023-04-18T23:58:53.630Z] command: main -Djava.security.manager=allow javax_swing_DefaultCellEditor
[2023-04-18T23:58:53.630Z] reason: User specified action: run main/othervm -Djava.security.manager=allow javax_swing_DefaultCellEditor
[2023-04-18T23:58:53.630Z] Mode: othervm [/othervm specified]
[2023-04-18T23:58:53.630Z] Additional options from @modules: --add-modules java.desktop
[2023-04-18T23:58:53.630Z] elapsed time (seconds): 0.233
[2023-04-18T23:58:53.630Z] configuration:
[2023-04-18T23:58:53.630Z] Boot Layer
[2023-04-18T23:58:53.630Z] add modules: java.desktop
[2023-04-18T23:58:53.630Z]
[2023-04-18T23:58:53.630Z] STDOUT:
[2023-04-18T23:58:53.630Z] STDERR:
[2023-04-18T23:58:53.630Z] java.lang.InternalError: java.lang.reflect.InvocationTargetException
[2023-04-18T23:58:53.630Z] at java.desktop/sun.font.FontManagerFactory$1.run(FontManagerFactory.java:87)
[2023-04-18T23:58:53.630Z] at java.base/java.security.AccessController.doPrivileged(AccessController.java:318)
[2023-04-18T23:58:53.630Z] at java.desktop/sun.font.FontManagerFactory.getInstance(FontManagerFactory.java:75)
[2023-04-18T23:58:53.630Z] at java.desktop/sun.font.SunFontManager.getInstance(SunFontManager.java:248)
[2023-04-18T23:58:53.630Z] at java.desktop/sun.font.FontDesignMetrics.getMetrics(FontDesignMetrics.java:266)
[2023-04-18T23:58:53.630Z] at java.desktop/sun.swing.SwingUtilities2.getFontMetrics(SwingUtilities2.java:1242)
[2023-04-18T23:58:53.630Z] at java.desktop/javax.swing.JComponent.getFontMetrics(JComponent.java:1691)
[2023-04-18T23:58:53.630Z] at java.desktop/javax.swing.text.PlainView.calculateLongestLine(PlainView.java:783)
[2023-04-18T23:58:53.630Z] at java.desktop/javax.swing.text.PlainView.updateMetrics(PlainView.java:332)
[2023-04-18T23:58:53.630Z] at java.desktop/javax.swing.text.PlainView.updateDamage(PlainView.java:670)
[2023-04-18T23:58:53.630Z] at java.desktop/javax.swing.text.PlainView.insertUpdate(PlainView.java:591)
[2023-04-18T23:58:53.630Z] at java.desktop/javax.swing.text.FieldView.insertUpdate(FieldView.java:294)
[2023-04-18T23:58:53.630Z] at java.desktop/javax.swing.plaf.basic.BasicTextUI$RootView.insertUpdate(BasicTextUI.java:1714)
[2023-04-18T23:58:53.630Z] at java.desktop/javax.swing.plaf.basic.BasicTextUI$UpdateHandler.insertUpdate(BasicTextUI.java:1981)
[2023-04-18T23:58:53.630Z] at java.desktop/javax.swing.text.AbstractDocument.fireInsertUpdate(AbstractDocument.java:226)
[2023-04-18T23:58:53.630Z] at java.desktop/javax.swing.text.AbstractDocument.handleInsertString(AbstractDocument.java:780)
[2023-04-18T23:58:53.630Z] at java.desktop/javax.swing.text.AbstractDocument.insertString(AbstractDocument.java:739)
[2023-04-18T23:58:53.630Z] at java.desktop/javax.swing.text.PlainDocument.insertString(PlainDocument.java:131)
[2023-04-18T23:58:53.630Z] at java.desktop/javax.swing.text.AbstractDocument.replace(AbstractDocument.java:698)
[2023-04-18T23:58:53.630Z] at java.desktop/javax.swing.text.JTextComponent.setText(JTextComponent.java:1729)
[2023-04-18T23:58:53.630Z] at java.desktop/javax.swing.JTextField.<init>(JTextField.java:259)
[2023-04-18T23:58:53.630Z] at java.desktop/javax.swing.JTextField.<init>(JTextField.java:199)
[2023-04-18T23:58:53.630Z] at javax_swing_DefaultCellEditor.getObject(javax_swing_DefaultCellEditor.java:43)
[2023-04-18T23:58:53.630Z] at javax_swing_DefaultCellEditor.getObject(javax_swing_DefaultCellEditor.java:37)
[2023-04-18T23:58:53.630Z] at AbstractTest.test(AbstractTest.java:100)
[2023-04-18T23:58:53.630Z] at javax_swing_DefaultCellEditor.main(javax_swing_DefaultCellEditor.java:39)
[2023-04-18T23:58:53.630Z] at java.base/jdk.internal.reflect.NativeMethodAccessorImpl.invoke0(Native Method)
[2023-04-18T23:58:53.630Z] at java.base/jdk.internal.reflect.NativeMethodAccessorImpl.invoke(NativeMethodAccessorImpl.java:77)
[2023-04-18T23:58:53.630Z] at java.base/jdk.internal.reflect.DelegatingMethodAccessorImpl.invoke(DelegatingMethodAccessorImpl.java:43)
[2023-04-18T23:58:53.630Z] at java.base/java.lang.reflect.Method.invoke(Method.java:568)
[2023-04-18T23:58:53.630Z] at com.sun.javatest.regtest.agent.MainWrapper$MainThread.run(MainWrapper.java:127)
[2023-04-18T23:58:53.630Z] at java.base/java.lang.Thread.run(Thread.java:833)
[2023-04-18T23:58:53.630Z] Caused by: java.lang.reflect.InvocationTargetException
[2023-04-18T23:58:53.630Z] at java.base/jdk.internal.reflect.NativeConstructorAccessorImpl.newInstance0(Native Method)
[2023-04-18T23:58:53.630Z] at java.base/jdk.internal.reflect.NativeConstructorAccessorImpl.newInstance(NativeConstructorAccessorImpl.java:77)
[2023-04-18T23:58:53.630Z] at java.base/jdk.internal.reflect.DelegatingConstructorAccessorImpl.newInstance(DelegatingConstructorAccessorImpl.java:45)
[2023-04-18T23:58:53.630Z] at java.base/java.lang.reflect.Constructor.newInstanceWithCaller(Constructor.java:499)
[2023-04-18T23:58:53.630Z] at java.base/java.lang.reflect.Constructor.newInstance(Constructor.java:480)
[2023-04-18T23:58:53.630Z] at java.desktop/sun.font.FontManagerFactory$1.run(FontManagerFactory.java:85)
[2023-04-18T23:58:53.630Z] ... 31 more
[2023-04-18T23:58:53.630Z] Caused by: java.lang.NullPointerException: Cannot load from short array because "sun.awt.FontConfiguration.head" is null
[2023-04-18T23:58:53.630Z] at java.desktop/sun.awt.FontConfiguration.getVersion(FontConfiguration.java:1264)
[2023-04-18T23:58:53.630Z] at java.desktop/sun.awt.FontConfiguration.readFontConfigFile(FontConfiguration.java:224)
[2023-04-18T23:58:53.630Z] at java.desktop/sun.awt.FontConfiguration.init(FontConfiguration.java:106)
[2023-04-18T23:58:53.630Z] at java.desktop/sun.awt.X11FontManager.createFontConfiguration(X11FontManager.java:706)
[2023-04-18T23:58:53.630Z] at java.desktop/sun.font.SunFontManager$2.run(SunFontManager.java:358)
[2023-04-18T23:58:53.630Z] at java.desktop/sun.font.SunFontManager$2.run(SunFontManager.java:315)
[2023-04-18T23:58:53.630Z] at java.base/java.security.AccessController.doPrivileged(AccessController.java:318)
[2023-04-18T23:58:53.630Z] at java.desktop/sun.font.SunFontManager.<init>(SunFontManager.java:315)
[2023-04-18T23:58:53.630Z] at java.desktop/sun.awt.FcFontManager.<init>(FcFontManager.java:35)
[2023-04-18T23:58:53.630Z] at java.desktop/sun.awt.X11FontManager.<init>(X11FontManager.java:56)
[2023-04-18T23:58:53.630Z] ... 37 more
[2023-04-18T23:58:53.630Z]
[2023-04-18T23:58:53.630Z] JavaTest Message: Test threw exception: java.lang.InternalError: java.lang.reflect.InvocationTargetException
[2023-04-18T23:58:53.630Z] JavaTest Message: shutting down test
[2023-04-18T23:58:53.630Z]
[2023-04-18T23:58:53.630Z] STATUS:Failed.`main' threw exception: java.lang.InternalError: java.lang.reflect.InvocationTargetException
[2023-04-18T23:58:53.630Z] rerun:
[2023-04-18T23:58:53.630Z] cd /home/jenkins/workspace/Test_openjdk17_hs_extended.openjdk_x86-64_alpine-linux_testList_2/aqa-tests/TKG/output_16818616629195/jdk_beans_1/work/java/beans/XMLEncoder/javax_swing_DefaultCellEditor && \
[2023-04-18T23:58:53.630Z] DISPLAY=:0 \
[2023-04-18T23:58:53.630Z] HOME=/home/jenkins \
[2023-04-18T23:58:53.630Z] PATH=/bin:/usr/bin:/usr/sbin \
[2023-04-18T23:58:53.630Z] CLASSPATH=/home/jenkins/workspace/Test_openjdk17_hs_extended.openjdk_x86-64_alpine-linux_testList_2/aqa-tests/TKG/output_16818616629195/jdk_beans_1/work/classes/java/beans/XMLEncoder/javax_swing_DefaultCellEditor.d:/home/jenkins/workspace/Test_openjdk17_hs_extended.openjdk_x86-64_alpine-linux_testList_2/aqa-tests/openjdk/openjdk-jdk/test/jdk/java/beans/XMLEncoder:/home/jenkins/workspace/Test_openjdk17_hs_extended.openjdk_x86-64_alpine-linux_testList_2/jvmtest/openjdk/jtreg/lib/javatest.jar:/home/jenkins/workspace/Test_openjdk17_hs_extended.openjdk_x86-64_alpine-linux_testList_2/jvmtest/openjdk/jtreg/lib/jtreg.jar \
[2023-04-18T23:58:53.630Z] /home/jenkins/workspace/Test_openjdk17_hs_extended.openjdk_x86-64_alpine-linux_testList_2/openjdkbinary/j2sdk-image/bin/java \
[2023-04-18T23:58:53.631Z] -Dtest.vm.opts='-ea -esa -Xmx512m -XX:-UseCompressedOops -Djava.awt.headless=true' \
[2023-04-18T23:58:53.631Z] -Dtest.tool.vm.opts='-J-ea -J-esa -J-Xmx512m -J-XX:-UseCompressedOops -J-Djava.awt.headless=true' \
[2023-04-18T23:58:53.631Z] -Dtest.compiler.opts= \
[2023-04-18T23:58:53.631Z] -Dtest.java.opts= \
[2023-04-18T23:58:53.631Z] -Dtest.jdk=/home/jenkins/workspace/Test_openjdk17_hs_extended.openjdk_x86-64_alpine-linux_testList_2/openjdkbinary/j2sdk-image \
[2023-04-18T23:58:53.631Z] -Dcompile.jdk=/home/jenkins/workspace/Test_openjdk17_hs_extended.openjdk_x86-64_alpine-linux_testList_2/openjdkbinary/j2sdk-image \
[2023-04-18T23:58:53.631Z] -Dtest.timeout.factor=8.0 \
[2023-04-18T23:58:53.631Z] -Dtest.nativepath=/home/jenkins/workspace/Test_openjdk17_hs_extended.openjdk_x86-64_alpine-linux_testList_2/openjdkbinary/openjdk-test-image/jdk/jtreg/native \
[2023-04-18T23:58:53.631Z] -Dtest.root=/home/jenkins/workspace/Test_openjdk17_hs_extended.openjdk_x86-64_alpine-linux_testList_2/aqa-tests/openjdk/openjdk-jdk/test/jdk \
[2023-04-18T23:58:53.631Z] -Dtest.name=java/beans/XMLEncoder/javax_swing_DefaultCellEditor.java \
[2023-04-18T23:58:53.631Z] -Dtest.file=/home/jenkins/workspace/Test_openjdk17_hs_extended.openjdk_x86-64_alpine-linux_testList_2/aqa-tests/openjdk/openjdk-jdk/test/jdk/java/beans/XMLEncoder/javax_swing_DefaultCellEditor.java \
[2023-04-18T23:58:53.631Z] -Dtest.src=/home/jenkins/workspace/Test_openjdk17_hs_extended.openjdk_x86-64_alpine-linux_testList_2/aqa-tests/openjdk/openjdk-jdk/test/jdk/java/beans/XMLEncoder \
[2023-04-18T23:58:53.631Z] -Dtest.src.path=/home/jenkins/workspace/Test_openjdk17_hs_extended.openjdk_x86-64_alpine-linux_testList_2/aqa-tests/openjdk/openjdk-jdk/test/jdk/java/beans/XMLEncoder \
[2023-04-18T23:58:53.631Z] -Dtest.classes=/home/jenkins/workspace/Test_openjdk17_hs_extended.openjdk_x86-64_alpine-linux_testList_2/aqa-tests/TKG/output_16818616629195/jdk_beans_1/work/classes/java/beans/XMLEncoder/javax_swing_DefaultCellEditor.d \
[2023-04-18T23:58:53.631Z] -Dtest.class.path=/home/jenkins/workspace/Test_openjdk17_hs_extended.openjdk_x86-64_alpine-linux_testList_2/aqa-tests/TKG/output_16818616629195/jdk_beans_1/work/classes/java/beans/XMLEncoder/javax_swing_DefaultCellEditor.d \
[2023-04-18T23:58:53.631Z] -Dtest.modules=java.desktop \
[2023-04-18T23:58:53.631Z] --add-modules java.desktop \
[2023-04-18T23:58:53.631Z] -ea \
[2023-04-18T23:58:53.631Z] -esa \
[2023-04-18T23:58:53.631Z] -Xmx512m \
[2023-04-18T23:58:53.631Z] -XX:-UseCompressedOops \
[2023-04-18T23:58:53.631Z] -Djava.awt.headless=true \
[2023-04-18T23:58:53.631Z] -Djava.library.path=/home/jenkins/workspace/Test_openjdk17_hs_extended.openjdk_x86-64_alpine-linux_testList_2/openjdkbinary/openjdk-test-image/jdk/jtreg/native \
[2023-04-18T23:58:53.631Z] -Djava.security.manager=allow \
[2023-04-18T23:58:53.631Z] com.sun.javatest.regtest.agent.MainWrapper /home/jenkins/workspace/Test_openjdk17_hs_extended.openjdk_x86-64_alpine-linux_testList_2/aqa-tests/TKG/output_16818616629195/jdk_beans_1/work/java/beans/XMLEncoder/javax_swing_DefaultCellEditor.d/main.0.jta
[2023-04-18T23:58:53.631Z]
[2023-04-18T23:58:53.631Z] TEST RESULT: Failed. Execution failed: `main' threw exception: java.lang.InternalError: java.lang.reflect.InvocationTargetException
[2023-04-18T23:58:53.631Z] --------------------------------------------------
[2023-04-18T23:58:53.631Z] TEST: java/beans/XMLEncoder/javax_swing_JTree.java
[2023-04-18T23:58:53.631Z] TEST JDK: /home/jenkins/workspace/Test_openjdk17_hs_extended.openjdk_x86-64_alpine-linux_testList_2/openjdkbinary/j2sdk-image
[2023-04-18T23:58:53.631Z]
[2023-04-18T23:58:53.631Z] ACTION: build -- Passed. Build successful
[2023-04-18T23:58:53.631Z] REASON: Named class compiled on demand
[2023-04-18T23:58:53.631Z] TIME: 0.873 seconds
[2023-04-18T23:58:53.631Z] messages:
[2023-04-18T23:58:53.631Z] command: build javax_swing_JTree
[2023-04-18T23:58:53.631Z] reason: Named class compiled on demand
[2023-04-18T23:58:53.631Z] Test directory:
[2023-04-18T23:58:53.631Z] compile: javax_swing_JTree
[2023-04-18T23:58:53.631Z] elapsed time (seconds): 0.873
[2023-04-18T23:58:53.631Z]
[2023-04-18T23:58:53.631Z] ACTION: compile -- Passed. Compilation successful
[2023-04-18T23:58:53.631Z] REASON: .class file out of date or does not exist
[2023-04-18T23:58:53.631Z] TIME: 0.873 seconds
[2023-04-18T23:58:53.631Z] messages:
[2023-04-18T23:58:53.631Z] command: compile /home/jenkins/workspace/Test_openjdk17_hs_extended.openjdk_x86-64_alpine-linux_testList_2/aqa-tests/openjdk/openjdk-jdk/test/jdk/java/beans/XMLEncoder/javax_swing_JTree.java
[2023-04-18T23:58:53.631Z] reason: .class file out of date or does not exist
[2023-04-18T23:58:53.631Z] Additional options from @modules: --add-modules java.desktop
[2023-04-18T23:58:53.631Z] Mode: othervm
[2023-04-18T23:58:53.631Z] elapsed time (seconds): 0.873
[2023-04-18T23:58:53.631Z] configuration:
[2023-04-18T23:58:53.631Z] javac compilation environment
[2023-04-18T23:58:53.631Z] add modules: java.desktop
[2023-04-18T23:58:53.631Z] source path: /home/jenkins/workspace/Test_openjdk17_hs_extended.openjdk_x86-64_alpine-linux_testList_2/aqa-tests/openjdk/openjdk-jdk/test/jdk/java/beans/XMLEncoder
[2023-04-18T23:58:53.631Z] class path: /home/jenkins/workspace/Test_openjdk17_hs_extended.openjdk_x86-64_alpine-linux_testList_2/aqa-tests/openjdk/openjdk-jdk/test/jdk/java/beans/XMLEncoder
[2023-04-18T23:58:53.631Z] /home/jenkins/workspace/Test_openjdk17_hs_extended.openjdk_x86-64_alpine-linux_testList_2/aqa-tests/TKG/output_16818616629195/jdk_beans_1/work/classes/java/beans/XMLEncoder/javax_swing_JTree.d
[2023-04-18T23:58:53.631Z]
[2023-04-18T23:58:53.631Z] rerun:
[2023-04-18T23:58:53.631Z] cd /home/jenkins/workspace/Test_openjdk17_hs_extended.openjdk_x86-64_alpine-linux_testList_2/aqa-tests/TKG/output_16818616629195/jdk_beans_1/work/java/beans/XMLEncoder/javax_swing_JTree && \
[2023-04-18T23:58:53.631Z] DISPLAY=:0 \
[2023-04-18T23:58:53.631Z] HOME=/home/jenkins \
[2023-04-18T23:58:53.631Z] PATH=/bin:/usr/bin:/usr/sbin \
[2023-04-18T23:58:53.631Z] /home/jenkins/workspace/Test_openjdk17_hs_extended.openjdk_x86-64_alpine-linux_testList_2/openjdkbinary/j2sdk-image/bin/javac \
[2023-04-18T23:58:53.631Z] -J-ea \
[2023-04-18T23:58:53.631Z] -J-esa \
[2023-04-18T23:58:53.631Z] -J-Xmx512m \
[2023-04-18T23:58:53.631Z] -J-XX:-UseCompressedOops \
[2023-04-18T23:58:53.631Z] -J-Djava.awt.headless=true \
[2023-04-18T23:58:53.631Z] -J-Dtest.vm.opts='-ea -esa -Xmx512m -XX:-UseCompressedOops -Djava.awt.headless=true' \
[2023-04-18T23:58:53.631Z] -J-Dtest.tool.vm.opts='-J-ea -J-esa -J-Xmx512m -J-XX:-UseCompressedOops -J-Djava.awt.headless=true' \
[2023-04-18T23:58:53.631Z] -J-Dtest.compiler.opts= \
[2023-04-18T23:58:53.631Z] -J-Dtest.java.opts= \
[2023-04-18T23:58:53.631Z] -J-Dtest.jdk=/home/jenkins/workspace/Test_openjdk17_hs_extended.openjdk_x86-64_alpine-linux_testList_2/openjdkbinary/j2sdk-image \
[2023-04-18T23:58:53.632Z] -J-Dcompile.jdk=/home/jenkins/workspace/Test_openjdk17_hs_extended.openjdk_x86-64_alpine-linux_testList_2/openjdkbinary/j2sdk-image \
[2023-04-18T23:58:53.632Z] -J-Dtest.timeout.factor=8.0 \
[2023-04-18T23:58:53.632Z] -J-Dtest.nativepath=/home/jenkins/workspace/Test_openjdk17_hs_extended.openjdk_x86-64_alpine-linux_testList_2/openjdkbinary/openjdk-test-image/jdk/jtreg/native \
[2023-04-18T23:58:53.632Z] -J-Dtest.root=/home/jenkins/workspace/Test_openjdk17_hs_extended.openjdk_x86-64_alpine-linux_testList_2/aqa-tests/openjdk/openjdk-jdk/test/jdk \
[2023-04-18T23:58:53.632Z] -J-Dtest.name=java/beans/XMLEncoder/javax_swing_JTree.java \
[2023-04-18T23:58:53.632Z] -J-Dtest.file=/home/jenkins/workspace/Test_openjdk17_hs_extended.openjdk_x86-64_alpine-linux_testList_2/aqa-tests/openjdk/openjdk-jdk/test/jdk/java/beans/XMLEncoder/javax_swing_JTree.java \
[2023-04-18T23:58:53.632Z] -J-Dtest.src=/home/jenkins/workspace/Test_openjdk17_hs_extended.openjdk_x86-64_alpine-linux_testList_2/aqa-tests/openjdk/openjdk-jdk/test/jdk/java/beans/XMLEncoder \
[2023-04-18T23:58:53.632Z] -J-Dtest.src.path=/home/jenkins/workspace/Test_openjdk17_hs_extended.openjdk_x86-64_alpine-linux_testList_2/aqa-tests/openjdk/openjdk-jdk/test/jdk/java/beans/XMLEncoder \
[2023-04-18T23:58:53.632Z] -J-Dtest.classes=/home/jenkins/workspace/Test_openjdk17_hs_extended.openjdk_x86-64_alpine-linux_testList_2/aqa-tests/TKG/output_16818616629195/jdk_beans_1/work/classes/java/beans/XMLEncoder/javax_swing_JTree.d \
[2023-04-18T23:58:53.632Z] -J-Dtest.class.path=/home/jenkins/workspace/Test_openjdk17_hs_extended.openjdk_x86-64_alpine-linux_testList_2/aqa-tests/TKG/output_16818616629195/jdk_beans_1/work/classes/java/beans/XMLEncoder/javax_swing_JTree.d \
[2023-04-18T23:58:53.632Z] -J-Dtest.modules=java.desktop \
[2023-04-18T23:58:53.632Z] --add-modules java.desktop \
[2023-04-18T23:58:53.632Z] -d /home/jenkins/workspace/Test_openjdk17_hs_extended.openjdk_x86-64_alpine-linux_testList_2/aqa-tests/TKG/output_16818616629195/jdk_beans_1/work/classes/java/beans/XMLEncoder/javax_swing_JTree.d \
[2023-04-18T23:58:53.632Z] -sourcepath /home/jenkins/workspace/Test_openjdk17_hs_extended.openjdk_x86-64_alpine-linux_testList_2/aqa-tests/openjdk/openjdk-jdk/test/jdk/java/beans/XMLEncoder \
[2023-04-18T23:58:53.632Z] -classpath /home/jenkins/workspace/Test_openjdk17_hs_extended.openjdk_x86-64_alpine-linux_testList_2/aqa-tests/openjdk/openjdk-jdk/test/jdk/java/beans/XMLEncoder:/home/jenkins/workspace/Test_openjdk17_hs_extended.openjdk_x86-64_alpine-linux_testList_2/aqa-tests/TKG/output_16818616629195/jdk_beans_1/work/classes/java/beans/XMLEncoder/javax_swing_JTree.d /home/jenkins/workspace/Test_openjdk17_hs_extended.openjdk_x86-64_alpine-linux_testList_2/aqa-tests/openjdk/openjdk-jdk/test/jdk/java/beans/XMLEncoder/javax_swing_JTree.java
[2023-04-18T23:58:53.632Z] STDOUT:
[2023-04-18T23:58:53.632Z] STDERR:
[2023-04-18T23:58:53.632Z] /home/jenkins/workspace/Test_openjdk17_hs_extended.openjdk_x86-64_alpine-linux_testList_2/aqa-tests/openjdk/openjdk-jdk/test/jdk/java/beans/XMLEncoder/AbstractTest.java:118: warning: [removal] SecurityManager in java.lang has been deprecated and marked for removal
[2023-04-18T23:58:53.632Z] System.setSecurityManager(new SecurityManager());
[2023-04-18T23:58:53.632Z] ^
[2023-04-18T23:58:53.632Z] /home/jenkins/workspace/Test_openjdk17_hs_extended.openjdk_x86-64_alpine-linux_testList_2/aqa-tests/openjdk/openjdk-jdk/test/jdk/java/beans/XMLEncoder/AbstractTest.java:118: warning: [removal] setSecurityManager(SecurityManager) in System has been deprecated and marked for removal
[2023-04-18T23:58:53.632Z] System.setSecurityManager(new SecurityManager());
[2023-04-18T23:58:53.632Z] ^
[2023-04-18T23:58:53.632Z] Note: Some input files use unchecked or unsafe operations.
[2023-04-18T23:58:53.632Z] Note: Recompile with -Xlint:unchecked for details.
[2023-04-18T23:58:53.632Z] 2 warnings
[2023-04-18T23:58:53.632Z]
[2023-04-18T23:58:53.632Z] ACTION: main -- Failed. Execution failed: `main' threw exception: java.lang.InternalError: java.lang.reflect.InvocationTargetException
[2023-04-18T23:58:53.632Z] REASON: User specified action: run main/othervm -Djava.security.manager=allow javax_swing_JTree
[2023-04-18T23:58:53.632Z] TIME: 0.359 seconds
[2023-04-18T23:58:53.632Z] messages:
[2023-04-18T23:58:53.632Z] command: main -Djava.security.manager=allow javax_swing_JTree
[2023-04-18T23:58:53.632Z] reason: User specified action: run main/othervm -Djava.security.manager=allow javax_swing_JTree
[2023-04-18T23:58:53.632Z] Mode: othervm [/othervm specified]
[2023-04-18T23:58:53.632Z] Additional options from @modules: --add-modules java.desktop
[2023-04-18T23:58:53.632Z] elapsed time (seconds): 0.359
[2023-04-18T23:58:53.632Z] configuration:
[2023-04-18T23:58:53.632Z] Boot Layer
[2023-04-18T23:58:53.632Z] add modules: java.desktop
[2023-04-18T23:58:53.632Z]
[2023-04-18T23:58:53.632Z] STDOUT:
[2023-04-18T23:58:53.632Z] Test object
[2023-04-18T23:58:53.632Z] <?xml version="1.0" encoding="UTF-8"?>
[2023-04-18T23:58:53.632Z] <java version="17.0.7" class="java.beans.XMLDecoder">
[2023-04-18T23:58:53.632Z] <object class="javax.swing.JTree" id="JTree0">
[2023-04-18T23:58:53.632Z] <object class="javax_swing_JTree$MyModel"/>
[2023-04-18T23:58:53.632Z] <void id="DefaultTreeSelectionModel0" property="selectionModel">
[2023-04-18T23:58:53.632Z] <void id="TreePathArray0" property="selectionPaths"/>
[2023-04-18T23:58:53.632Z] <void property="selectionPaths">
[2023-04-18T23:58:53.632Z] <object idref="TreePathArray0"/>
[2023-04-18T23:58:53.632Z] </void>
[2023-04-18T23:58:53.632Z] </void>
[2023-04-18T23:58:53.632Z] <void id="intArray0" property="selectionRows"/>
[2023-04-18T23:58:53.632Z] <void property="selectionRows">
[2023-04-18T23:58:53.632Z] <object idref="intArray0"/>
[2023-04-18T23:58:53.632Z] </void>
[2023-04-18T23:58:53.632Z] </object>
[2023-04-18T23:58:53.632Z] </java>
[2023-04-18T23:58:53.632Z] Test object creating
[2023-04-18T23:58:53.632Z] <?xml version="1.0" encoding="UTF-8"?>
[2023-04-18T23:58:53.632Z] <java version="17.0.7" class="java.beans.XMLDecoder">
[2023-04-18T23:58:53.632Z] <object class="Bean">
[2023-04-18T23:58:53.632Z] <void property="value">
[2023-04-18T23:58:53.632Z] <object class="javax.swing.JTree" id="JTree0">
[2023-04-18T23:58:53.632Z] <object class="javax_swing_JTree$MyModel"/>
[2023-04-18T23:58:53.633Z] <void id="DefaultTreeSelectionModel0" property="selectionModel">
[2023-04-18T23:58:53.633Z] <void id="TreePathArray0" property="selectionPaths"/>
[2023-04-18T23:58:53.633Z] <void property="selectionPaths">
[2023-04-18T23:58:53.633Z] <object idref="TreePathArray0"/>
[2023-04-18T23:58:53.633Z] </void>
[2023-04-18T23:58:53.633Z] </void>
[2023-04-18T23:58:53.633Z] <void id="intArray0" property="selectionRows"/>
[2023-04-18T23:58:53.633Z] <void property="selectionRows">
[2023-04-18T23:58:53.633Z] <object idref="intArray0"/>
[2023-04-18T23:58:53.633Z] </void>
[2023-04-18T23:58:53.633Z] </object>
[2023-04-18T23:58:53.633Z] </void>
[2023-04-18T23:58:53.633Z] </object>
[2023-04-18T23:58:53.633Z] </java>
[2023-04-18T23:58:53.633Z] STDERR:
[2023-04-18T23:58:53.633Z] java.lang.InternalError: java.lang.reflect.InvocationTargetException
[2023-04-18T23:58:53.633Z] at java.desktop/sun.font.FontManagerFactory$1.run(FontManagerFactory.java:87)
[2023-04-18T23:58:53.633Z] at java.base/java.security.AccessController.doPrivileged(AccessController.java:318)
[2023-04-18T23:58:53.633Z] at java.desktop/sun.font.FontManagerFactory.getInstance(FontManagerFactory.java:75)
[2023-04-18T23:58:53.633Z] at java.desktop/sun.font.SunFontManager.getInstance(SunFontManager.java:248)
[2023-04-18T23:58:53.633Z] at java.desktop/sun.font.FontDesignMetrics.getMetrics(FontDesignMetrics.java:266)
[2023-04-18T23:58:53.633Z] at java.desktop/sun.swing.SwingUtilities2.getFontMetrics(SwingUtilities2.java:1242)
[2023-04-18T23:58:53.633Z] at java.desktop/javax.swing.JComponent.getFontMetrics(JComponent.java:1691)
[2023-04-18T23:58:53.633Z] at java.desktop/javax.swing.plaf.basic.BasicLabelUI.getPreferredSize(BasicLabelUI.java:251)
[2023-04-18T23:58:53.633Z] at java.desktop/javax.swing.JComponent.getPreferredSize(JComponent.java:1725)
[2023-04-18T23:58:53.633Z] at java.desktop/javax.swing.tree.DefaultTreeCellRenderer.getPreferredSize(DefaultTreeCellRenderer.java:636)
[2023-04-18T23:58:53.633Z] at java.desktop/javax.swing.plaf.basic.BasicTreeUI$NodeDimensionsHandler.getNodeDimensions(BasicTreeUI.java:3231)
[2023-04-18T23:58:53.633Z] at java.desktop/javax.swing.tree.AbstractLayoutCache.getNodeDimensions(AbstractLayoutCache.java:497)
[2023-04-18T23:58:53.633Z] at java.desktop/javax.swing.tree.VariableHeightLayoutCache$TreeStateNode.updatePreferredSize(VariableHeightLayoutCache.java:1344)
[2023-04-18T23:58:53.633Z] at java.desktop/javax.swing.tree.VariableHeightLayoutCache.rebuild(VariableHeightLayoutCache.java:723)
[2023-04-18T23:58:53.633Z] at java.desktop/javax.swing.tree.VariableHeightLayoutCache.setModel(VariableHeightLayoutCache.java:111)
[2023-04-18T23:58:53.633Z] at java.desktop/javax.swing.plaf.basic.BasicTreeUI.setModel(BasicTreeUI.java:506)
[2023-04-18T23:58:53.633Z] at java.desktop/javax.swing.plaf.basic.BasicTreeUI$Handler.propertyChange(BasicTreeUI.java:3903)
[2023-04-18T23:58:53.633Z] at java.desktop/java.beans.PropertyChangeSupport.fire(PropertyChangeSupport.java:343)
[2023-04-18T23:58:53.633Z] at java.desktop/java.beans.PropertyChangeSupport.firePropertyChange(PropertyChangeSupport.java:335)
[2023-04-18T23:58:53.633Z] at java.desktop/java.beans.PropertyChangeSupport.firePropertyChange(PropertyChangeSupport.java:268)
[2023-04-18T23:58:53.633Z] at java.desktop/java.awt.Component.firePropertyChange(Component.java:8722)
[2023-04-18T23:58:53.633Z] at java.desktop/javax.swing.JTree.setModel(JTree.java:945)
[2023-04-18T23:58:53.633Z] at java.desktop/javax.swing.JTree.<init>(JTree.java:731)
[2023-04-18T23:58:53.633Z] at java.desktop/javax.swing.JTree.<init>(JTree.java:628)
[2023-04-18T23:58:53.633Z] at javax_swing_JTree.getAnotherObject(javax_swing_JTree.java:47)
[2023-04-18T23:58:53.633Z] at javax_swing_JTree.getAnotherObject(javax_swing_JTree.java:37)
[2023-04-18T23:58:53.633Z] at AbstractTest.test(AbstractTest.java:109)
[2023-04-18T23:58:53.633Z] at javax_swing_JTree.main(javax_swing_JTree.java:39)
[2023-04-18T23:58:53.633Z] at java.base/jdk.internal.reflect.NativeMethodAccessorImpl.invoke0(Native Method)
[2023-04-18T23:58:53.633Z] at java.base/jdk.internal.reflect.NativeMethodAccessorImpl.invoke(NativeMethodAccessorImpl.java:77)
[2023-04-18T23:58:53.633Z] at java.base/jdk.internal.reflect.DelegatingMethodAccessorImpl.invoke(DelegatingMethodAccessorImpl.java:43)
[2023-04-18T23:58:53.633Z] at java.base/java.lang.reflect.Method.invoke(Method.java:568)
[2023-04-18T23:58:53.633Z] at com.sun.javatest.regtest.agent.MainWrapper$MainThread.run(MainWrapper.java:127)
[2023-04-18T23:58:53.633Z] at java.base/java.lang.Thread.run(Thread.java:833)
[2023-04-18T23:58:53.633Z] Caused by: java.lang.reflect.InvocationTargetException
[2023-04-18T23:58:53.633Z] at java.base/jdk.internal.reflect.NativeConstructorAccessorImpl.newInstance0(Native Method)
[2023-04-18T23:58:53.633Z] at java.base/jdk.internal.reflect.NativeConstructorAccessorImpl.newInstance(NativeConstructorAccessorImpl.java:77)
[2023-04-18T23:58:53.633Z] at java.base/jdk.internal.reflect.DelegatingConstructorAccessorImpl.newInstance(DelegatingConstructorAccessorImpl.java:45)
[2023-04-18T23:58:53.633Z] at java.base/java.lang.reflect.Constructor.newInstanceWithCaller(Constructor.java:499)
[2023-04-18T23:58:53.633Z] at java.base/java.lang.reflect.Constructor.newInstance(Constructor.java:480)
[2023-04-18T23:58:53.633Z] at java.desktop/sun.font.FontManagerFactory$1.run(FontManagerFactory.java:85)
[2023-04-18T23:58:53.633Z] ... 33 more
[2023-04-18T23:58:53.633Z] Caused by: java.lang.NullPointerException: Cannot load from short array because "sun.awt.FontConfiguration.head" is null
[2023-04-18T23:58:53.633Z] at java.desktop/sun.awt.FontConfiguration.getVersion(FontConfiguration.java:1264)
[2023-04-18T23:58:53.633Z] at java.desktop/sun.awt.FontConfiguration.readFontConfigFile(FontConfiguration.java:224)
[2023-04-18T23:58:53.633Z] at java.desktop/sun.awt.FontConfiguration.init(FontConfiguration.java:106)
[2023-04-18T23:58:53.633Z] at java.desktop/sun.awt.X11FontManager.createFontConfiguration(X11FontManager.java:706)
[2023-04-18T23:58:53.633Z] at java.desktop/sun.font.SunFontManager$2.run(SunFontManager.java:358)
[2023-04-18T23:58:53.633Z] at java.desktop/sun.font.SunFontManager$2.run(SunFontManager.java:315)
[2023-04-18T23:58:53.633Z] at java.base/java.security.AccessController.doPrivileged(AccessController.java:318)
[2023-04-18T23:58:53.633Z] at java.desktop/sun.font.SunFontManager.<init>(SunFontManager.java:315)
[2023-04-18T23:58:53.633Z] at java.desktop/sun.awt.FcFontManager.<init>(FcFontManager.java:35)
[2023-04-18T23:58:53.633Z] at java.desktop/sun.awt.X11FontManager.<init>(X11FontManager.java:56)
[2023-04-18T23:58:53.633Z] ... 39 more
[2023-04-18T23:58:53.633Z]
[2023-04-18T23:58:53.633Z] JavaTest Message: Test threw exception: java.lang.InternalError: java.lang.reflect.InvocationTargetException
[2023-04-18T23:58:53.633Z] JavaTest Message: shutting down test
[2023-04-18T23:58:53.633Z]
[2023-04-18T23:58:53.633Z] STATUS:Failed.`main' threw exception: java.lang.InternalError: java.lang.reflect.InvocationTargetException
[2023-04-18T23:58:53.633Z] rerun:
[2023-04-18T23:58:53.633Z] cd /home/jenkins/workspace/Test_openjdk17_hs_extended.openjdk_x86-64_alpine-linux_testList_2/aqa-tests/TKG/output_16818616629195/jdk_beans_1/work/java/beans/XMLEncoder/javax_swing_JTree && \
[2023-04-18T23:58:53.633Z] DISPLAY=:0 \
[2023-04-18T23:58:53.633Z] HOME=/home/jenkins \
[2023-04-18T23:58:53.633Z] PATH=/bin:/usr/bin:/usr/sbin \
[2023-04-18T23:58:53.633Z] CLASSPATH=/home/jenkins/workspace/Test_openjdk17_hs_extended.openjdk_x86-64_alpine-linux_testList_2/aqa-tests/TKG/output_16818616629195/jdk_beans_1/work/classes/java/beans/XMLEncoder/javax_swing_JTree.d:/home/jenkins/workspace/Test_openjdk17_hs_extended.openjdk_x86-64_alpine-linux_testList_2/aqa-tests/openjdk/openjdk-jdk/test/jdk/java/beans/XMLEncoder:/home/jenkins/workspace/Test_openjdk17_hs_extended.openjdk_x86-64_alpine-linux_testList_2/jvmtest/openjdk/jtreg/lib/javatest.jar:/home/jenkins/workspace/Test_openjdk17_hs_extended.openjdk_x86-64_alpine-linux_testList_2/jvmtest/openjdk/jtreg/lib/jtreg.jar \
[2023-04-18T23:58:53.633Z] /home/jenkins/workspace/Test_openjdk17_hs_extended.openjdk_x86-64_alpine-linux_testList_2/openjdkbinary/j2sdk-image/bin/java \
[2023-04-18T23:58:53.633Z] -Dtest.vm.opts='-ea -esa -Xmx512m -XX:-UseCompressedOops -Djava.awt.headless=true' \
[2023-04-18T23:58:53.633Z] -Dtest.tool.vm.opts='-J-ea -J-esa -J-Xmx512m -J-XX:-UseCompressedOops -J-Djava.awt.headless=true' \
[2023-04-18T23:58:53.633Z] -Dtest.compiler.opts= \
[2023-04-18T23:58:53.633Z] -Dtest.java.opts= \
[2023-04-18T23:58:53.634Z] -Dtest.jdk=/home/jenkins/workspace/Test_openjdk17_hs_extended.openjdk_x86-64_alpine-linux_testList_2/openjdkbinary/j2sdk-image \
[2023-04-18T23:58:53.634Z] -Dcompile.jdk=/home/jenkins/workspace/Test_openjdk17_hs_extended.openjdk_x86-64_alpine-linux_testList_2/openjdkbinary/j2sdk-image \
[2023-04-18T23:58:53.634Z] -Dtest.timeout.factor=8.0 \
[2023-04-18T23:58:53.634Z] -Dtest.nativepath=/home/jenkins/workspace/Test_openjdk17_hs_extended.openjdk_x86-64_alpine-linux_testList_2/openjdkbinary/openjdk-test-image/jdk/jtreg/native \
[2023-04-18T23:58:53.634Z] -Dtest.root=/home/jenkins/workspace/Test_openjdk17_hs_extended.openjdk_x86-64_alpine-linux_testList_2/aqa-tests/openjdk/openjdk-jdk/test/jdk \
[2023-04-18T23:58:53.634Z] -Dtest.name=java/beans/XMLEncoder/javax_swing_JTree.java \
[2023-04-18T23:58:53.634Z] -Dtest.file=/home/jenkins/workspace/Test_openjdk17_hs_extended.openjdk_x86-64_alpine-linux_testList_2/aqa-tests/openjdk/openjdk-jdk/test/jdk/java/beans/XMLEncoder/javax_swing_JTree.java \
[2023-04-18T23:58:53.634Z] -Dtest.src=/home/jenkins/workspace/Test_openjdk17_hs_extended.openjdk_x86-64_alpine-linux_testList_2/aqa-tests/openjdk/openjdk-jdk/test/jdk/java/beans/XMLEncoder \
[2023-04-18T23:58:53.634Z] -Dtest.src.path=/home/jenkins/workspace/Test_openjdk17_hs_extended.openjdk_x86-64_alpine-linux_testList_2/aqa-tests/openjdk/openjdk-jdk/test/jdk/java/beans/XMLEncoder \
[2023-04-18T23:58:53.634Z] -Dtest.classes=/home/jenkins/workspace/Test_openjdk17_hs_extended.openjdk_x86-64_alpine-linux_testList_2/aqa-tests/TKG/output_16818616629195/jdk_beans_1/work/classes/java/beans/XMLEncoder/javax_swing_JTree.d \
[2023-04-18T23:58:53.634Z] -Dtest.class.path=/home/jenkins/workspace/Test_openjdk17_hs_extended.openjdk_x86-64_alpine-linux_testList_2/aqa-tests/TKG/output_16818616629195/jdk_beans_1/work/classes/java/beans/XMLEncoder/javax_swing_JTree.d \
[2023-04-18T23:58:53.634Z] -Dtest.modules=java.desktop \
[2023-04-18T23:58:53.634Z] --add-modules java.desktop \
[2023-04-18T23:58:53.634Z] -ea \
[2023-04-18T23:58:53.634Z] -esa \
[2023-04-18T23:58:53.634Z] -Xmx512m \
[2023-04-18T23:58:53.634Z] -XX:-UseCompressedOops \
[2023-04-18T23:58:53.634Z] -Djava.awt.headless=true \
[2023-04-18T23:58:53.634Z] -Djava.library.path=/home/jenkins/workspace/Test_openjdk17_hs_extended.openjdk_x86-64_alpine-linux_testList_2/openjdkbinary/openjdk-test-image/jdk/jtreg/native \
[2023-04-18T23:58:53.634Z] -Djava.security.manager=allow \
[2023-04-18T23:58:53.634Z] com.sun.javatest.regtest.agent.MainWrapper /home/jenkins/workspace/Test_openjdk17_hs_extended.openjdk_x86-64_alpine-linux_testList_2/aqa-tests/TKG/output_16818616629195/jdk_beans_1/work/java/beans/XMLEncoder/javax_swing_JTree.d/main.0.jta
[2023-04-18T23:58:53.634Z]
[2023-04-18T23:58:53.634Z] TEST RESULT: Failed. Execution failed: `main' threw exception: java.lang.InternalError: java.lang.reflect.InvocationTargetException
[2023-04-18T23:58:53.634Z] --------------------------------------------------
[2023-04-18T23:59:34.119Z] TEST: java/beans/XMLEncoder/Test4631471.java
[2023-04-18T23:59:34.119Z] TEST JDK: /home/jenkins/workspace/Test_openjdk17_hs_extended.openjdk_x86-64_alpine-linux_testList_2/openjdkbinary/j2sdk-image
[2023-04-18T23:59:34.119Z]
[2023-04-18T23:59:34.119Z] ACTION: build -- Passed. Build successful
[2023-04-18T23:59:34.119Z] REASON: Named class compiled on demand
[2023-04-18T23:59:34.119Z] TIME: 0.88 seconds
[2023-04-18T23:59:34.119Z] messages:
[2023-04-18T23:59:34.119Z] command: build Test4631471
[2023-04-18T23:59:34.120Z] reason: Named class compiled on demand
[2023-04-18T23:59:34.120Z] Test directory:
[2023-04-18T23:59:34.120Z] compile: Test4631471
[2023-04-18T23:59:34.120Z] elapsed time (seconds): 0.88
[2023-04-18T23:59:34.120Z]
[2023-04-18T23:59:34.120Z] ACTION: compile -- Passed. Compilation successful
[2023-04-18T23:59:34.120Z] REASON: .class file out of date or does not exist
[2023-04-18T23:59:34.120Z] TIME: 0.879 seconds
[2023-04-18T23:59:34.120Z] messages:
[2023-04-18T23:59:34.120Z] command: compile /home/jenkins/workspace/Test_openjdk17_hs_extended.openjdk_x86-64_alpine-linux_testList_2/aqa-tests/openjdk/openjdk-jdk/test/jdk/java/beans/XMLEncoder/Test4631471.java
[2023-04-18T23:59:34.120Z] reason: .class file out of date or does not exist
[2023-04-18T23:59:34.120Z] Additional options from @modules: --add-modules java.desktop
[2023-04-18T23:59:34.120Z] Mode: othervm
[2023-04-18T23:59:34.120Z] elapsed time (seconds): 0.879
[2023-04-18T23:59:34.120Z] configuration:
[2023-04-18T23:59:34.120Z] javac compilation environment
[2023-04-18T23:59:34.120Z] add modules: java.desktop
[2023-04-18T23:59:34.120Z] source path: /home/jenkins/workspace/Test_openjdk17_hs_extended.openjdk_x86-64_alpine-linux_testList_2/aqa-tests/openjdk/openjdk-jdk/test/jdk/java/beans/XMLEncoder
[2023-04-18T23:59:34.120Z] class path: /home/jenkins/workspace/Test_openjdk17_hs_extended.openjdk_x86-64_alpine-linux_testList_2/aqa-tests/openjdk/openjdk-jdk/test/jdk/java/beans/XMLEncoder
[2023-04-18T23:59:34.120Z] /home/jenkins/workspace/Test_openjdk17_hs_extended.openjdk_x86-64_alpine-linux_testList_2/aqa-tests/TKG/output_16818616629195/jdk_beans_1/work/classes/java/beans/XMLEncoder/Test4631471.d
[2023-04-18T23:59:34.120Z]
[2023-04-18T23:59:34.120Z] rerun:
[2023-04-18T23:59:34.120Z] cd /home/jenkins/workspace/Test_openjdk17_hs_extended.openjdk_x86-64_alpine-linux_testList_2/aqa-tests/TKG/output_16818616629195/jdk_beans_1/work/java/beans/XMLEncoder/Test4631471 && \
[2023-04-18T23:59:34.120Z] DISPLAY=:0 \
[2023-04-18T23:59:34.120Z] HOME=/home/jenkins \
[2023-04-18T23:59:34.120Z] PATH=/bin:/usr/bin:/usr/sbin \
[2023-04-18T23:59:34.120Z] /home/jenkins/workspace/Test_openjdk17_hs_extended.openjdk_x86-64_alpine-linux_testList_2/openjdkbinary/j2sdk-image/bin/javac \
[2023-04-18T23:59:34.120Z] -J-ea \
[2023-04-18T23:59:34.120Z] -J-esa \
[2023-04-18T23:59:34.120Z] -J-Xmx512m \
[2023-04-18T23:59:34.120Z] -J-XX:-UseCompressedOops \
[2023-04-18T23:59:34.120Z] -J-Djava.awt.headless=true \
[2023-04-18T23:59:34.120Z] -J-Dtest.vm.opts='-ea -esa -Xmx512m -XX:-UseCompressedOops -Djava.awt.headless=true' \
[2023-04-18T23:59:34.120Z] -J-Dtest.tool.vm.opts='-J-ea -J-esa -J-Xmx512m -J-XX:-UseCompressedOops -J-Djava.awt.headless=true' \
[2023-04-18T23:59:34.120Z] -J-Dtest.compiler.opts= \
[2023-04-18T23:59:34.120Z] -J-Dtest.java.opts= \
[2023-04-18T23:59:34.120Z] -J-Dtest.jdk=/home/jenkins/workspace/Test_openjdk17_hs_extended.openjdk_x86-64_alpine-linux_testList_2/openjdkbinary/j2sdk-image \
[2023-04-18T23:59:34.120Z] -J-Dcompile.jdk=/home/jenkins/workspace/Test_openjdk17_hs_extended.openjdk_x86-64_alpine-linux_testList_2/openjdkbinary/j2sdk-image \
[2023-04-18T23:59:34.120Z] -J-Dtest.timeout.factor=8.0 \
[2023-04-18T23:59:34.120Z] -J-Dtest.nativepath=/home/jenkins/workspace/Test_openjdk17_hs_extended.openjdk_x86-64_alpine-linux_testList_2/openjdkbinary/openjdk-test-image/jdk/jtreg/native \
[2023-04-18T23:59:34.120Z] -J-Dtest.root=/home/jenkins/workspace/Test_openjdk17_hs_extended.openjdk_x86-64_alpine-linux_testList_2/aqa-tests/openjdk/openjdk-jdk/test/jdk \
[2023-04-18T23:59:34.120Z] -J-Dtest.name=java/beans/XMLEncoder/Test4631471.java \
[2023-04-18T23:59:34.120Z] -J-Dtest.file=/home/jenkins/workspace/Test_openjdk17_hs_extended.openjdk_x86-64_alpine-linux_testList_2/aqa-tests/openjdk/openjdk-jdk/test/jdk/java/beans/XMLEncoder/Test4631471.java \
[2023-04-18T23:59:34.120Z] -J-Dtest.src=/home/jenkins/workspace/Test_openjdk17_hs_extended.openjdk_x86-64_alpine-linux_testList_2/aqa-tests/openjdk/openjdk-jdk/test/jdk/java/beans/XMLEncoder \
[2023-04-18T23:59:34.120Z] -J-Dtest.src.path=/home/jenkins/workspace/Test_openjdk17_hs_extended.openjdk_x86-64_alpine-linux_testList_2/aqa-tests/openjdk/openjdk-jdk/test/jdk/java/beans/XMLEncoder \
[2023-04-18T23:59:34.120Z] -J-Dtest.classes=/home/jenkins/workspace/Test_openjdk17_hs_extended.openjdk_x86-64_alpine-linux_testList_2/aqa-tests/TKG/output_16818616629195/jdk_beans_1/work/classes/java/beans/XMLEncoder/Test4631471.d \
[2023-04-18T23:59:34.120Z] -J-Dtest.class.path=/home/jenkins/workspace/Test_openjdk17_hs_extended.openjdk_x86-64_alpine-linux_testList_2/aqa-tests/TKG/output_16818616629195/jdk_beans_1/work/classes/java/beans/XMLEncoder/Test4631471.d \
[2023-04-18T23:59:34.120Z] -J-Dtest.modules=java.desktop \
[2023-04-18T23:59:34.120Z] --add-modules java.desktop \
[2023-04-18T23:59:34.121Z] -d /home/jenkins/workspace/Test_openjdk17_hs_extended.openjdk_x86-64_alpine-linux_testList_2/aqa-tests/TKG/output_16818616629195/jdk_beans_1/work/classes/java/beans/XMLEncoder/Test4631471.d \
[2023-04-18T23:59:34.121Z] -sourcepath /home/jenkins/workspace/Test_openjdk17_hs_extended.openjdk_x86-64_alpine-linux_testList_2/aqa-tests/openjdk/openjdk-jdk/test/jdk/java/beans/XMLEncoder \
[2023-04-18T23:59:34.121Z] -classpath /home/jenkins/workspace/Test_openjdk17_hs_extended.openjdk_x86-64_alpine-linux_testList_2/aqa-tests/openjdk/openjdk-jdk/test/jdk/java/beans/XMLEncoder:/home/jenkins/workspace/Test_openjdk17_hs_extended.openjdk_x86-64_alpine-linux_testList_2/aqa-tests/TKG/output_16818616629195/jdk_beans_1/work/classes/java/beans/XMLEncoder/Test4631471.d /home/jenkins/workspace/Test_openjdk17_hs_extended.openjdk_x86-64_alpine-linux_testList_2/aqa-tests/openjdk/openjdk-jdk/test/jdk/java/beans/XMLEncoder/Test4631471.java
[2023-04-18T23:59:34.121Z] STDOUT:
[2023-04-18T23:59:34.121Z] STDERR:
[2023-04-18T23:59:34.121Z] /home/jenkins/workspace/Test_openjdk17_hs_extended.openjdk_x86-64_alpine-linux_testList_2/aqa-tests/openjdk/openjdk-jdk/test/jdk/java/beans/XMLEncoder/AbstractTest.java:118: warning: [removal] SecurityManager in java.lang has been deprecated and marked for removal
[2023-04-18T23:59:34.121Z] System.setSecurityManager(new SecurityManager());
[2023-04-18T23:59:34.121Z] ^
[2023-04-18T23:59:34.121Z] /home/jenkins/workspace/Test_openjdk17_hs_extended.openjdk_x86-64_alpine-linux_testList_2/aqa-tests/openjdk/openjdk-jdk/test/jdk/java/beans/XMLEncoder/AbstractTest.java:118: warning: [removal] setSecurityManager(SecurityManager) in System has been deprecated and marked for removal
[2023-04-18T23:59:34.121Z] System.setSecurityManager(new SecurityManager());
[2023-04-18T23:59:34.121Z] ^
[2023-04-18T23:59:34.121Z] /home/jenkins/workspace/Test_openjdk17_hs_extended.openjdk_x86-64_alpine-linux_testList_2/aqa-tests/openjdk/openjdk-jdk/test/jdk/java/beans/XMLEncoder/Test4631471.java:41: warning: [removal] SecurityManager in java.lang has been deprecated and marked for removal
[2023-04-18T23:59:34.121Z] System.setSecurityManager(new SecurityManager());
[2023-04-18T23:59:34.121Z] ^
[2023-04-18T23:59:34.121Z] /home/jenkins/workspace/Test_openjdk17_hs_extended.openjdk_x86-64_alpine-linux_testList_2/aqa-tests/openjdk/openjdk-jdk/test/jdk/java/beans/XMLEncoder/Test4631471.java:41: warning: [removal] setSecurityManager(SecurityManager) in System has been deprecated and marked for removal
[2023-04-18T23:59:34.121Z] System.setSecurityManager(new SecurityManager());
[2023-04-18T23:59:34.121Z] ^
[2023-04-18T23:59:34.121Z] Note: Some input files use unchecked or unsafe operations.
[2023-04-18T23:59:34.121Z] Note: Recompile with -Xlint:unchecked for details.
[2023-04-18T23:59:34.121Z] 4 warnings
[2023-04-18T23:59:34.121Z]
[2023-04-18T23:59:34.121Z] ACTION: main -- Failed. Execution failed: `main' threw exception: java.lang.InternalError: java.lang.reflect.InvocationTargetException
[2023-04-18T23:59:34.121Z] REASON: User specified action: run main/othervm -Djava.security.manager=allow Test4631471
[2023-04-18T23:59:34.121Z] TIME: 0.363 seconds
[2023-04-18T23:59:34.121Z] messages:
[2023-04-18T23:59:34.121Z] command: main -Djava.security.manager=allow Test4631471
[2023-04-18T23:59:34.121Z] reason: User specified action: run main/othervm -Djava.security.manager=allow Test4631471
[2023-04-18T23:59:34.121Z] Mode: othervm [/othervm specified]
[2023-04-18T23:59:34.121Z] Additional options from @modules: --add-modules java.desktop
[2023-04-18T23:59:34.121Z] elapsed time (seconds): 0.363
[2023-04-18T23:59:34.121Z] configuration:
[2023-04-18T23:59:34.121Z] Boot Layer
[2023-04-18T23:59:34.121Z] add modules: java.desktop
[2023-04-18T23:59:34.121Z]
[2023-04-18T23:59:34.121Z] STDOUT:
[2023-04-18T23:59:34.121Z] Test object
[2023-04-18T23:59:34.121Z] <?xml version="1.0" encoding="UTF-8"?>
[2023-04-18T23:59:34.121Z] <java version="17.0.7" class="java.beans.XMLDecoder">
[2023-04-18T23:59:34.121Z] <object class="javax.swing.tree.DefaultMutableTreeNode">
[2023-04-18T23:59:34.121Z] <void property="userObject">
[2023-04-18T23:59:34.121Z] <string>root</string>
[2023-04-18T23:59:34.121Z] </void>
[2023-04-18T23:59:34.121Z] <void method="add">
[2023-04-18T23:59:34.121Z] <object class="javax.swing.tree.DefaultMutableTreeNode">
[2023-04-18T23:59:34.121Z] <void property="userObject">
[2023-04-18T23:59:34.121Z] <string>first</string>
[2023-04-18T23:59:34.121Z] </void>
[2023-04-18T23:59:34.121Z] <void method="add">
[2023-04-18T23:59:34.121Z] <object class="javax.swing.tree.DefaultMutableTreeNode">
[2023-04-18T23:59:34.121Z] <void property="userObject">
[2023-04-18T23:59:34.121Z] <string>1.1</string>
[2023-04-18T23:59:34.121Z] </void>
[2023-04-18T23:59:34.121Z] </object>
[2023-04-18T23:59:34.121Z] </void>
[2023-04-18T23:59:34.121Z] <void method="add">
[2023-04-18T23:59:34.121Z] <object class="javax.swing.tree.DefaultMutableTreeNode">
[2023-04-18T23:59:34.121Z] <void property="userObject">
[2023-04-18T23:59:34.121Z] <string>1.2</string>
[2023-04-18T23:59:34.121Z] </void>
[2023-04-18T23:59:34.121Z] </object>
[2023-04-18T23:59:34.121Z] </void>
[2023-04-18T23:59:34.121Z] <void method="add">
[2023-04-18T23:59:34.121Z] <object class="javax.swing.tree.DefaultMutableTreeNode">
[2023-04-18T23:59:34.121Z] <void property="userObject">
[2023-04-18T23:59:34.121Z] <string>1.3</string>
[2023-04-18T23:59:34.121Z] </void>
[2023-04-18T23:59:34.121Z] </object>
[2023-04-18T23:59:34.121Z] </void>
[2023-04-18T23:59:34.121Z] </object>
[2023-04-18T23:59:34.121Z] </void>
[2023-04-18T23:59:34.121Z] <void method="add">
[2023-04-18T23:59:34.121Z] <object class="javax.swing.tree.DefaultMutableTreeNode">
[2023-04-18T23:59:34.121Z] <void property="userObject">
[2023-04-18T23:59:34.121Z] <string>second</string>
[2023-04-18T23:59:34.121Z] </void>
[2023-04-18T23:59:34.121Z] <void method="add">
[2023-04-18T23:59:34.121Z] <object class="javax.swing.tree.DefaultMutableTreeNode">
[2023-04-18T23:59:34.121Z] <void property="userObject">
[2023-04-18T23:59:34.121Z] <string>2.1</string>
[2023-04-18T23:59:34.121Z] </void>
[2023-04-18T23:59:34.121Z] </object>
[2023-04-18T23:59:34.121Z] </void>
[2023-04-18T23:59:34.121Z] <void method="add">
[2023-04-18T23:59:34.121Z] <object class="javax.swing.tree.DefaultMutableTreeNode">
[2023-04-18T23:59:34.121Z] <void property="userObject">
[2023-04-18T23:59:34.121Z] <string>2.2</string>
[2023-04-18T23:59:34.121Z] </void>
[2023-04-18T23:59:34.121Z] </object>
[2023-04-18T23:59:34.121Z] </void>
[2023-04-18T23:59:34.122Z] <void method="add">
[2023-04-18T23:59:34.122Z] <object class="javax.swing.tree.DefaultMutableTreeNode">
[2023-04-18T23:59:34.122Z] <void property="userObject">
[2023-04-18T23:59:34.122Z] <string>2.3</string>
[2023-04-18T23:59:34.122Z] </void>
[2023-04-18T23:59:34.122Z] </object>
[2023-04-18T23:59:34.122Z] </void>
[2023-04-18T23:59:34.122Z] </object>
[2023-04-18T23:59:34.122Z] </void>
[2023-04-18T23:59:34.122Z] <void method="add">
[2023-04-18T23:59:34.122Z] <object class="javax.swing.tree.DefaultMutableTreeNode">
[2023-04-18T23:59:34.122Z] <void property="userObject">
[2023-04-18T23:59:34.122Z] <string>third</string>
[2023-04-18T23:59:34.122Z] </void>
[2023-04-18T23:59:34.122Z] <void method="add">
[2023-04-18T23:59:34.122Z] <object class="javax.swing.tree.DefaultMutableTreeNode">
[2023-04-18T23:59:34.122Z] <void property="userObject">
[2023-04-18T23:59:34.122Z] <string>3.1</string>
[2023-04-18T23:59:34.122Z] </void>
[2023-04-18T23:59:34.122Z] </object>
[2023-04-18T23:59:34.122Z] </void>
[2023-04-18T23:59:34.122Z] <void method="add">
[2023-04-18T23:59:34.122Z] <object class="javax.swing.tree.DefaultMutableTreeNode">
[2023-04-18T23:59:34.122Z] <void property="userObject">
[2023-04-18T23:59:34.122Z] <string>3.2</string>
[2023-04-18T23:59:34.122Z] </void>
[2023-04-18T23:59:34.122Z] </object>
[2023-04-18T23:59:34.122Z] </void>
[2023-04-18T23:59:34.122Z] <void method="add">
[2023-04-18T23:59:34.122Z] <object class="javax.swing.tree.DefaultMutableTreeNode">
[2023-04-18T23:59:34.122Z] <void property="userObject">
[2023-04-18T23:59:34.122Z] <string>3.3</string>
[2023-04-18T23:59:34.122Z] </void>
[2023-04-18T23:59:34.122Z] </object>
[2023-04-18T23:59:34.122Z] </void>
[2023-04-18T23:59:34.122Z] </object>
[2023-04-18T23:59:34.122Z] </void>
[2023-04-18T23:59:34.122Z] </object>
[2023-04-18T23:59:34.122Z] </java>
[2023-04-18T23:59:34.122Z] Test object creating
[2023-04-18T23:59:34.122Z] <?xml version="1.0" encoding="UTF-8"?>
[2023-04-18T23:59:34.122Z] <java version="17.0.7" class="java.beans.XMLDecoder">
[2023-04-18T23:59:34.122Z] <object class="Bean">
[2023-04-18T23:59:34.122Z] <void property="value">
[2023-04-18T23:59:34.122Z] <object class="javax.swing.tree.DefaultMutableTreeNode">
[2023-04-18T23:59:34.122Z] <void property="userObject">
[2023-04-18T23:59:34.122Z] <string>root</string>
[2023-04-18T23:59:34.122Z] </void>
[2023-04-18T23:59:34.122Z] <void method="add">
[2023-04-18T23:59:34.122Z] <object class="javax.swing.tree.DefaultMutableTreeNode">
[2023-04-18T23:59:34.122Z] <void property="userObject">
[2023-04-18T23:59:34.122Z] <string>first</string>
[2023-04-18T23:59:34.122Z] </void>
[2023-04-18T23:59:34.122Z] <void method="add">
[2023-04-18T23:59:34.122Z] <object class="javax.swing.tree.DefaultMutableTreeNode">
[2023-04-18T23:59:34.122Z] <void property="userObject">
[2023-04-18T23:59:34.122Z] <string>1.1</string>
[2023-04-18T23:59:34.122Z] </void>
[2023-04-18T23:59:34.122Z] </object>
[2023-04-18T23:59:34.122Z] </void>
[2023-04-18T23:59:34.122Z] <void method="add">
[2023-04-18T23:59:34.122Z] <object class="javax.swing.tree.DefaultMutableTreeNode">
[2023-04-18T23:59:34.122Z] <void property="userObject">
[2023-04-18T23:59:34.122Z] <string>1.2</string>
[2023-04-18T23:59:34.122Z] </void>
[2023-04-18T23:59:34.122Z] </object>
[2023-04-18T23:59:34.122Z] </void>
[2023-04-18T23:59:34.122Z] <void method="add">
[2023-04-18T23:59:34.122Z] <object class="javax.swing.tree.DefaultMutableTreeNode">
[2023-04-18T23:59:34.122Z] <void property="userObject">
[2023-04-18T23:59:34.122Z] <string>1.3</string>
[2023-04-18T23:59:34.122Z] </void>
[2023-04-18T23:59:34.122Z] </object>
[2023-04-18T23:59:34.122Z] </void>
[2023-04-18T23:59:34.122Z] </object>
[2023-04-18T23:59:34.122Z] </void>
[2023-04-18T23:59:34.122Z] <void method="add">
[2023-04-18T23:59:34.122Z] <object class="javax.swing.tree.DefaultMutableTreeNode">
[2023-04-18T23:59:34.122Z] <void property="userObject">
[2023-04-18T23:59:34.122Z] <string>second</string>
[2023-04-18T23:59:34.122Z] </void>
[2023-04-18T23:59:34.122Z] <void method="add">
[2023-04-18T23:59:34.122Z] <object class="javax.swing.tree.DefaultMutableTreeNode">
[2023-04-18T23:59:34.122Z] <void property="userObject">
[2023-04-18T23:59:34.122Z] <string>2.1</string>
[2023-04-18T23:59:34.122Z] </void>
[2023-04-18T23:59:34.122Z] </object>
[2023-04-18T23:59:34.122Z] </void>
[2023-04-18T23:59:34.122Z] <void method="add">
[2023-04-18T23:59:34.122Z] <object class="javax.swing.tree.DefaultMutableTreeNode">
[2023-04-18T23:59:34.122Z] <void property="userObject">
[2023-04-18T23:59:34.122Z] <string>2.2</string>
[2023-04-18T23:59:34.122Z] </void>
[2023-04-18T23:59:34.122Z] </object>
[2023-04-18T23:59:34.122Z] </void>
[2023-04-18T23:59:34.122Z] <void method="add">
[2023-04-18T23:59:34.122Z] <object class="javax.swing.tree.DefaultMutableTreeNode">
[2023-04-18T23:59:34.122Z] <void property="userObject">
[2023-04-18T23:59:34.122Z] <string>2.3</string>
[2023-04-18T23:59:34.122Z] </void>
[2023-04-18T23:59:34.122Z] </object>
[2023-04-18T23:59:34.122Z] </void>
[2023-04-18T23:59:34.122Z] </object>
[2023-04-18T23:59:34.122Z] </void>
[2023-04-18T23:59:34.122Z] <void method="add">
[2023-04-18T23:59:34.122Z] <object class="javax.swing.tree.DefaultMutableTreeNode">
[2023-04-18T23:59:34.122Z] <void property="userObject">
[2023-04-18T23:59:34.122Z] <string>third</string>
[2023-04-18T23:59:34.122Z] </void>
[2023-04-18T23:59:34.122Z] <void method="add">
[2023-04-18T23:59:34.122Z] <object class="javax.swing.tree.DefaultMutableTreeNode">
[2023-04-18T23:59:34.122Z] <void property="userObject">
[2023-04-18T23:59:34.122Z] <string>3.1</string>
[2023-04-18T23:59:34.122Z] </void>
[2023-04-18T23:59:34.122Z] </object>
[2023-04-18T23:59:34.122Z] </void>
[2023-04-18T23:59:34.122Z] <void method="add">
[2023-04-18T23:59:34.122Z] <object class="javax.swing.tree.DefaultMutableTreeNode">
[2023-04-18T23:59:34.122Z] <void property="userObject">
[2023-04-18T23:59:34.122Z] <string>3.2</string>
[2023-04-18T23:59:34.122Z] </void>
[2023-04-18T23:59:34.122Z] </object>
[2023-04-18T23:59:34.122Z] </void>
[2023-04-18T23:59:34.122Z] <void method="add">
[2023-04-18T23:59:34.122Z] <object class="javax.swing.tree.DefaultMutableTreeNode">
[2023-04-18T23:59:34.122Z] <void property="userObject">
[2023-04-18T23:59:34.122Z] <string>3.3</string>
[2023-04-18T23:59:34.122Z] </void>
[2023-04-18T23:59:34.122Z] </object>
[2023-04-18T23:59:34.122Z] </void>
[2023-04-18T23:59:34.122Z] </object>
[2023-04-18T23:59:34.122Z] </void>
[2023-04-18T23:59:34.123Z] </object>
[2023-04-18T23:59:34.123Z] </void>
[2023-04-18T23:59:34.123Z] </object>
[2023-04-18T23:59:34.123Z] </java>
[2023-04-18T23:59:34.123Z] STDERR:
[2023-04-18T23:59:34.123Z] java.lang.InternalError: java.lang.reflect.InvocationTargetException
[2023-04-18T23:59:34.123Z] at java.desktop/sun.font.FontManagerFactory$1.run(FontManagerFactory.java:87)
[2023-04-18T23:59:34.123Z] at java.base/java.security.AccessController.doPrivileged(AccessController.java:318)
[2023-04-18T23:59:34.123Z] at java.desktop/sun.font.FontManagerFactory.getInstance(FontManagerFactory.java:75)
[2023-04-18T23:59:34.123Z] at java.desktop/sun.font.SunFontManager.getInstance(SunFontManager.java:248)
[2023-04-18T23:59:34.123Z] at java.desktop/sun.font.FontDesignMetrics.getMetrics(FontDesignMetrics.java:266)
[2023-04-18T23:59:34.123Z] at java.desktop/sun.swing.SwingUtilities2.getFontMetrics(SwingUtilities2.java:1242)
[2023-04-18T23:59:34.123Z] at java.desktop/javax.swing.JComponent.getFontMetrics(JComponent.java:1691)
[2023-04-18T23:59:34.123Z] at java.desktop/javax.swing.plaf.basic.BasicLabelUI.getPreferredSize(BasicLabelUI.java:251)
[2023-04-18T23:59:34.123Z] at java.desktop/javax.swing.JComponent.getPreferredSize(JComponent.java:1725)
[2023-04-18T23:59:34.123Z] at java.desktop/javax.swing.tree.DefaultTreeCellRenderer.getPreferredSize(DefaultTreeCellRenderer.java:636)
[2023-04-18T23:59:34.123Z] at java.desktop/javax.swing.plaf.basic.BasicTreeUI$NodeDimensionsHandler.getNodeDimensions(BasicTreeUI.java:3231)
[2023-04-18T23:59:34.123Z] at java.desktop/javax.swing.tree.AbstractLayoutCache.getNodeDimensions(AbstractLayoutCache.java:497)
[2023-04-18T23:59:34.123Z] at java.desktop/javax.swing.tree.VariableHeightLayoutCache$TreeStateNode.updatePreferredSize(VariableHeightLayoutCache.java:1344)
[2023-04-18T23:59:34.123Z] at java.desktop/javax.swing.tree.VariableHeightLayoutCache.rebuild(VariableHeightLayoutCache.java:723)
[2023-04-18T23:59:34.123Z] at java.desktop/javax.swing.tree.VariableHeightLayoutCache.setModel(VariableHeightLayoutCache.java:111)
[2023-04-18T23:59:34.123Z] at java.desktop/javax.swing.plaf.basic.BasicTreeUI.setModel(BasicTreeUI.java:506)
[2023-04-18T23:59:34.123Z] at java.desktop/javax.swing.plaf.basic.BasicTreeUI$Handler.propertyChange(BasicTreeUI.java:3903)
[2023-04-18T23:59:34.123Z] at java.desktop/java.beans.PropertyChangeSupport.fire(PropertyChangeSupport.java:343)
[2023-04-18T23:59:34.123Z] at java.desktop/java.beans.PropertyChangeSupport.firePropertyChange(PropertyChangeSupport.java:335)
[2023-04-18T23:59:34.123Z] at java.desktop/java.beans.PropertyChangeSupport.firePropertyChange(PropertyChangeSupport.java:268)
[2023-04-18T23:59:34.123Z] at java.desktop/java.awt.Component.firePropertyChange(Component.java:8722)
[2023-04-18T23:59:34.123Z] at java.desktop/javax.swing.JTree.setModel(JTree.java:945)
[2023-04-18T23:59:34.123Z] at java.desktop/javax.swing.JTree.<init>(JTree.java:731)
[2023-04-18T23:59:34.123Z] at java.desktop/javax.swing.JTree.<init>(JTree.java:707)
[2023-04-18T23:59:34.123Z] at java.desktop/javax.swing.JTree.<init>(JTree.java:691)
[2023-04-18T23:59:34.123Z] at Test4631471.getTree(Test4631471.java:107)
[2023-04-18T23:59:34.123Z] at Test4631471.getModel(Test4631471.java:111)
[2023-04-18T23:59:34.123Z] at Test4631471$2.getObject(Test4631471.java:56)
[2023-04-18T23:59:34.123Z] at AbstractTest.test(AbstractTest.java:100)
[2023-04-18T23:59:34.123Z] at Test4631471.main(Test4631471.java:58)
[2023-04-18T23:59:34.123Z] at Test4631471.main(Test4631471.java:40)
[2023-04-18T23:59:34.123Z] at java.base/jdk.internal.reflect.NativeMethodAccessorImpl.invoke0(Native Method)
[2023-04-18T23:59:34.123Z] at java.base/jdk.internal.reflect.NativeMethodAccessorImpl.invoke(NativeMethodAccessorImpl.java:77)
[2023-04-18T23:59:34.123Z] at java.base/jdk.internal.reflect.DelegatingMethodAccessorImpl.invoke(DelegatingMethodAccessorImpl.java:43)
[2023-04-18T23:59:34.123Z] at java.base/java.lang.reflect.Method.invoke(Method.java:568)
[2023-04-18T23:59:34.123Z] at com.sun.javatest.regtest.agent.MainWrapper$MainThread.run(MainWrapper.java:127)
[2023-04-18T23:59:34.123Z] at java.base/java.lang.Thread.run(Thread.java:833)
[2023-04-18T23:59:34.123Z] Caused by: java.lang.reflect.InvocationTargetException
[2023-04-18T23:59:34.123Z] at java.base/jdk.internal.reflect.NativeConstructorAccessorImpl.newInstance0(Native Method)
[2023-04-18T23:59:34.123Z] at java.base/jdk.internal.reflect.NativeConstructorAccessorImpl.newInstance(NativeConstructorAccessorImpl.java:77)
[2023-04-18T23:59:34.123Z] at java.base/jdk.internal.reflect.DelegatingConstructorAccessorImpl.newInstance(DelegatingConstructorAccessorImpl.java:45)
[2023-04-18T23:59:34.123Z] at java.base/java.lang.reflect.Constructor.newInstanceWithCaller(Constructor.java:499)
[2023-04-18T23:59:34.123Z] at java.base/java.lang.reflect.Constructor.newInstance(Constructor.java:480)
[2023-04-18T23:59:34.123Z] at java.desktop/sun.font.FontManagerFactory$1.run(FontManagerFactory.java:85)
[2023-04-18T23:59:34.123Z] ... 36 more
[2023-04-18T23:59:34.123Z] Caused by: java.lang.NullPointerException: Cannot load from short array because "sun.awt.FontConfiguration.head" is null
[2023-04-18T23:59:34.123Z] at java.desktop/sun.awt.FontConfiguration.getVersion(FontConfiguration.java:1264)
[2023-04-18T23:59:34.123Z] at java.desktop/sun.awt.FontConfiguration.readFontConfigFile(FontConfiguration.java:224)
[2023-04-18T23:59:34.123Z] at java.desktop/sun.awt.FontConfiguration.init(FontConfiguration.java:106)
[2023-04-18T23:59:34.123Z] at java.desktop/sun.awt.X11FontManager.createFontConfiguration(X11FontManager.java:706)
[2023-04-18T23:59:34.123Z] at java.desktop/sun.font.SunFontManager$2.run(SunFontManager.java:358)
[2023-04-18T23:59:34.123Z] at java.desktop/sun.font.SunFontManager$2.run(SunFontManager.java:315)
[2023-04-18T23:59:34.123Z] at java.base/java.security.AccessController.doPrivileged(AccessController.java:318)
[2023-04-18T23:59:34.123Z] at java.desktop/sun.font.SunFontManager.<init>(SunFontManager.java:315)
[2023-04-18T23:59:34.123Z] at java.desktop/sun.awt.FcFontManager.<init>(FcFontManager.java:35)
[2023-04-18T23:59:34.123Z] at java.desktop/sun.awt.X11FontManager.<init>(X11FontManager.java:56)
[2023-04-18T23:59:34.123Z] ... 42 more
[2023-04-18T23:59:34.123Z]
[2023-04-18T23:59:34.123Z] JavaTest Message: Test threw exception: java.lang.InternalError: java.lang.reflect.InvocationTargetException
[2023-04-18T23:59:34.123Z] JavaTest Message: shutting down test
[2023-04-18T23:59:34.123Z]
[2023-04-18T23:59:34.123Z] STATUS:Failed.`main' threw exception: java.lang.InternalError: java.lang.reflect.InvocationTargetException
[2023-04-18T23:59:34.123Z] rerun:
[2023-04-18T23:59:34.123Z] cd /home/jenkins/workspace/Test_openjdk17_hs_extended.openjdk_x86-64_alpine-linux_testList_2/aqa-tests/TKG/output_16818616629195/jdk_beans_1/work/java/beans/XMLEncoder/Test4631471 && \
[2023-04-18T23:59:34.123Z] DISPLAY=:0 \
[2023-04-18T23:59:34.123Z] HOME=/home/jenkins \
[2023-04-18T23:59:34.123Z] PATH=/bin:/usr/bin:/usr/sbin \
[2023-04-18T23:59:34.123Z] CLASSPATH=/home/jenkins/workspace/Test_openjdk17_hs_extended.openjdk_x86-64_alpine-linux_testList_2/aqa-tests/TKG/output_16818616629195/jdk_beans_1/work/classes/java/beans/XMLEncoder/Test4631471.d:/home/jenkins/workspace/Test_openjdk17_hs_extended.openjdk_x86-64_alpine-linux_testList_2/aqa-tests/openjdk/openjdk-jdk/test/jdk/java/beans/XMLEncoder:/home/jenkins/workspace/Test_openjdk17_hs_extended.openjdk_x86-64_alpine-linux_testList_2/jvmtest/openjdk/jtreg/lib/javatest.jar:/home/jenkins/workspace/Test_openjdk17_hs_extended.openjdk_x86-64_alpine-linux_testList_2/jvmtest/openjdk/jtreg/lib/jtreg.jar \
[2023-04-18T23:59:34.123Z] /home/jenkins/workspace/Test_openjdk17_hs_extended.openjdk_x86-64_alpine-linux_testList_2/openjdkbinary/j2sdk-image/bin/java \
[2023-04-18T23:59:34.123Z] -Dtest.vm.opts='-ea -esa -Xmx512m -XX:-UseCompressedOops -Djava.awt.headless=true' \
[2023-04-18T23:59:34.124Z] -Dtest.tool.vm.opts='-J-ea -J-esa -J-Xmx512m -J-XX:-UseCompressedOops -J-Djava.awt.headless=true' \
[2023-04-18T23:59:34.124Z] -Dtest.compiler.opts= \
[2023-04-18T23:59:34.124Z] -Dtest.java.opts= \
[2023-04-18T23:59:34.124Z] -Dtest.jdk=/home/jenkins/workspace/Test_openjdk17_hs_extended.openjdk_x86-64_alpine-linux_testList_2/openjdkbinary/j2sdk-image \
[2023-04-18T23:59:34.124Z] -Dcompile.jdk=/home/jenkins/workspace/Test_openjdk17_hs_extended.openjdk_x86-64_alpine-linux_testList_2/openjdkbinary/j2sdk-image \
[2023-04-18T23:59:34.124Z] -Dtest.timeout.factor=8.0 \
[2023-04-18T23:59:34.124Z] -Dtest.nativepath=/home/jenkins/workspace/Test_openjdk17_hs_extended.openjdk_x86-64_alpine-linux_testList_2/openjdkbinary/openjdk-test-image/jdk/jtreg/native \
[2023-04-18T23:59:34.124Z] -Dtest.root=/home/jenkins/workspace/Test_openjdk17_hs_extended.openjdk_x86-64_alpine-linux_testList_2/aqa-tests/openjdk/openjdk-jdk/test/jdk \
[2023-04-18T23:59:34.124Z] -Dtest.name=java/beans/XMLEncoder/Test4631471.java \
[2023-04-18T23:59:34.124Z] -Dtest.file=/home/jenkins/workspace/Test_openjdk17_hs_extended.openjdk_x86-64_alpine-linux_testList_2/aqa-tests/openjdk/openjdk-jdk/test/jdk/java/beans/XMLEncoder/Test4631471.java \
[2023-04-18T23:59:34.124Z] -Dtest.src=/home/jenkins/workspace/Test_openjdk17_hs_extended.openjdk_x86-64_alpine-linux_testList_2/aqa-tests/openjdk/openjdk-jdk/test/jdk/java/beans/XMLEncoder \
[2023-04-18T23:59:34.124Z] -Dtest.src.path=/home/jenkins/workspace/Test_openjdk17_hs_extended.openjdk_x86-64_alpine-linux_testList_2/aqa-tests/openjdk/openjdk-jdk/test/jdk/java/beans/XMLEncoder \
[2023-04-18T23:59:34.124Z] -Dtest.classes=/home/jenkins/workspace/Test_openjdk17_hs_extended.openjdk_x86-64_alpine-linux_testList_2/aqa-tests/TKG/output_16818616629195/jdk_beans_1/work/classes/java/beans/XMLEncoder/Test4631471.d \
[2023-04-18T23:59:34.124Z] -Dtest.class.path=/home/jenkins/workspace/Test_openjdk17_hs_extended.openjdk_x86-64_alpine-linux_testList_2/aqa-tests/TKG/output_16818616629195/jdk_beans_1/work/classes/java/beans/XMLEncoder/Test4631471.d \
[2023-04-18T23:59:34.124Z] -Dtest.modules=java.desktop \
[2023-04-18T23:59:34.124Z] --add-modules java.desktop \
[2023-04-18T23:59:34.124Z] -ea \
[2023-04-18T23:59:34.124Z] -esa \
[2023-04-18T23:59:34.124Z] -Xmx512m \
[2023-04-18T23:59:34.124Z] -XX:-UseCompressedOops \
[2023-04-18T23:59:34.124Z] -Djava.awt.headless=true \
[2023-04-18T23:59:34.124Z] -Djava.library.path=/home/jenkins/workspace/Test_openjdk17_hs_extended.openjdk_x86-64_alpine-linux_testList_2/openjdkbinary/openjdk-test-image/jdk/jtreg/native \
[2023-04-18T23:59:34.124Z] -Djava.security.manager=allow \
[2023-04-18T23:59:34.124Z] com.sun.javatest.regtest.agent.MainWrapper /home/jenkins/workspace/Test_openjdk17_hs_extended.openjdk_x86-64_alpine-linux_testList_2/aqa-tests/TKG/output_16818616629195/jdk_beans_1/work/java/beans/XMLEncoder/Test4631471.d/main.0.jta
[2023-04-18T23:59:34.124Z]
[2023-04-18T23:59:34.124Z] TEST RESULT: Failed. Execution failed: `main' threw exception: java.lang.InternalError: java.lang.reflect.InvocationTargetException
[2023-04-18T23:59:34.124Z] --------------------------------------------------
[2023-04-18T23:59:36.489Z] TEST: java/beans/XMLEncoder/Test4903007.java
[2023-04-18T23:59:36.489Z] TEST JDK: /home/jenkins/workspace/Test_openjdk17_hs_extended.openjdk_x86-64_alpine-linux_testList_2/openjdkbinary/j2sdk-image
[2023-04-18T23:59:36.489Z]
[2023-04-18T23:59:36.489Z] ACTION: build -- Passed. Build successful
[2023-04-18T23:59:36.489Z] REASON: Named class compiled on demand
[2023-04-18T23:59:36.489Z] TIME: 0.832 seconds
[2023-04-18T23:59:36.489Z] messages:
[2023-04-18T23:59:36.489Z] command: build Test4903007
[2023-04-18T23:59:36.489Z] reason: Named class compiled on demand
[2023-04-18T23:59:36.489Z] Test directory:
[2023-04-18T23:59:36.489Z] compile: Test4903007
[2023-04-18T23:59:36.489Z] elapsed time (seconds): 0.832
[2023-04-18T23:59:36.489Z]
[2023-04-18T23:59:36.489Z] ACTION: compile -- Passed. Compilation successful
[2023-04-18T23:59:36.489Z] REASON: .class file out of date or does not exist
[2023-04-18T23:59:36.489Z] TIME: 0.832 seconds
[2023-04-18T23:59:36.489Z] messages:
[2023-04-18T23:59:36.489Z] command: compile /home/jenkins/workspace/Test_openjdk17_hs_extended.openjdk_x86-64_alpine-linux_testList_2/aqa-tests/openjdk/openjdk-jdk/test/jdk/java/beans/XMLEncoder/Test4903007.java
[2023-04-18T23:59:36.489Z] reason: .class file out of date or does not exist
[2023-04-18T23:59:36.489Z] Additional options from @modules: --add-modules java.desktop
[2023-04-18T23:59:36.489Z] Mode: othervm
[2023-04-18T23:59:36.489Z] elapsed time (seconds): 0.832
[2023-04-18T23:59:36.489Z] configuration:
[2023-04-18T23:59:36.489Z] javac compilation environment
[2023-04-18T23:59:36.489Z] add modules: java.desktop
[2023-04-18T23:59:36.489Z] source path: /home/jenkins/workspace/Test_openjdk17_hs_extended.openjdk_x86-64_alpine-linux_testList_2/aqa-tests/openjdk/openjdk-jdk/test/jdk/java/beans/XMLEncoder
[2023-04-18T23:59:36.489Z] class path: /home/jenkins/workspace/Test_openjdk17_hs_extended.openjdk_x86-64_alpine-linux_testList_2/aqa-tests/openjdk/openjdk-jdk/test/jdk/java/beans/XMLEncoder
[2023-04-18T23:59:36.489Z] /home/jenkins/workspace/Test_openjdk17_hs_extended.openjdk_x86-64_alpine-linux_testList_2/aqa-tests/TKG/output_16818616629195/jdk_beans_1/work/classes/java/beans/XMLEncoder/Test4903007.d
[2023-04-18T23:59:36.489Z]
[2023-04-18T23:59:36.489Z] rerun:
[2023-04-18T23:59:36.489Z] cd /home/jenkins/workspace/Test_openjdk17_hs_extended.openjdk_x86-64_alpine-linux_testList_2/aqa-tests/TKG/output_16818616629195/jdk_beans_1/work/java/beans/XMLEncoder/Test4903007 && \
[2023-04-18T23:59:36.489Z] DISPLAY=:0 \
[2023-04-18T23:59:36.489Z] HOME=/home/jenkins \
[2023-04-18T23:59:36.489Z] PATH=/bin:/usr/bin:/usr/sbin \
[2023-04-18T23:59:36.489Z] /home/jenkins/workspace/Test_openjdk17_hs_extended.openjdk_x86-64_alpine-linux_testList_2/openjdkbinary/j2sdk-image/bin/javac \
[2023-04-18T23:59:36.489Z] -J-ea \
[2023-04-18T23:59:36.489Z] -J-esa \
[2023-04-18T23:59:36.489Z] -J-Xmx512m \
[2023-04-18T23:59:36.489Z] -J-XX:-UseCompressedOops \
[2023-04-18T23:59:36.489Z] -J-Djava.awt.headless=true \
[2023-04-18T23:59:36.489Z] -J-Dtest.vm.opts='-ea -esa -Xmx512m -XX:-UseCompressedOops -Djava.awt.headless=true' \
[2023-04-18T23:59:36.489Z] -J-Dtest.tool.vm.opts='-J-ea -J-esa -J-Xmx512m -J-XX:-UseCompressedOops -J-Djava.awt.headless=true' \
[2023-04-18T23:59:36.489Z] -J-Dtest.compiler.opts= \
[2023-04-18T23:59:36.489Z] -J-Dtest.java.opts= \
[2023-04-18T23:59:36.489Z] -J-Dtest.jdk=/home/jenkins/workspace/Test_openjdk17_hs_extended.openjdk_x86-64_alpine-linux_testList_2/openjdkbinary/j2sdk-image \
[2023-04-18T23:59:36.489Z] -J-Dcompile.jdk=/home/jenkins/workspace/Test_openjdk17_hs_extended.openjdk_x86-64_alpine-linux_testList_2/openjdkbinary/j2sdk-image \
[2023-04-18T23:59:36.489Z] -J-Dtest.timeout.factor=8.0 \
[2023-04-18T23:59:36.489Z] -J-Dtest.nativepath=/home/jenkins/workspace/Test_openjdk17_hs_extended.openjdk_x86-64_alpine-linux_testList_2/openjdkbinary/openjdk-test-image/jdk/jtreg/native \
[2023-04-18T23:59:36.489Z] -J-Dtest.root=/home/jenkins/workspace/Test_openjdk17_hs_extended.openjdk_x86-64_alpine-linux_testList_2/aqa-tests/openjdk/openjdk-jdk/test/jdk \
[2023-04-18T23:59:36.489Z] -J-Dtest.name=java/beans/XMLEncoder/Test4903007.java \
[2023-04-18T23:59:36.489Z] -J-Dtest.file=/home/jenkins/workspace/Test_openjdk17_hs_extended.openjdk_x86-64_alpine-linux_testList_2/aqa-tests/openjdk/openjdk-jdk/test/jdk/java/beans/XMLEncoder/Test4903007.java \
[2023-04-18T23:59:36.489Z] -J-Dtest.src=/home/jenkins/workspace/Test_openjdk17_hs_extended.openjdk_x86-64_alpine-linux_testList_2/aqa-tests/openjdk/openjdk-jdk/test/jdk/java/beans/XMLEncoder \
[2023-04-18T23:59:36.489Z] -J-Dtest.src.path=/home/jenkins/workspace/Test_openjdk17_hs_extended.openjdk_x86-64_alpine-linux_testList_2/aqa-tests/openjdk/openjdk-jdk/test/jdk/java/beans/XMLEncoder \
[2023-04-18T23:59:36.489Z] -J-Dtest.classes=/home/jenkins/workspace/Test_openjdk17_hs_extended.openjdk_x86-64_alpine-linux_testList_2/aqa-tests/TKG/output_16818616629195/jdk_beans_1/work/classes/java/beans/XMLEncoder/Test4903007.d \
[2023-04-18T23:59:36.489Z] -J-Dtest.class.path=/home/jenkins/workspace/Test_openjdk17_hs_extended.openjdk_x86-64_alpine-linux_testList_2/aqa-tests/TKG/output_16818616629195/jdk_beans_1/work/classes/java/beans/XMLEncoder/Test4903007.d \
[2023-04-18T23:59:36.489Z] -J-Dtest.modules=java.desktop \
[2023-04-18T23:59:36.489Z] --add-modules java.desktop \
[2023-04-18T23:59:36.489Z] -d /home/jenkins/workspace/Test_openjdk17_hs_extended.openjdk_x86-64_alpine-linux_testList_2/aqa-tests/TKG/output_16818616629195/jdk_beans_1/work/classes/java/beans/XMLEncoder/Test4903007.d \
[2023-04-18T23:59:36.489Z] -sourcepath /home/jenkins/workspace/Test_openjdk17_hs_extended.openjdk_x86-64_alpine-linux_testList_2/aqa-tests/openjdk/openjdk-jdk/test/jdk/java/beans/XMLEncoder \
[2023-04-18T23:59:36.490Z] -classpath /home/jenkins/workspace/Test_openjdk17_hs_extended.openjdk_x86-64_alpine-linux_testList_2/aqa-tests/openjdk/openjdk-jdk/test/jdk/java/beans/XMLEncoder:/home/jenkins/workspace/Test_openjdk17_hs_extended.openjdk_x86-64_alpine-linux_testList_2/aqa-tests/TKG/output_16818616629195/jdk_beans_1/work/classes/java/beans/XMLEncoder/Test4903007.d /home/jenkins/workspace/Test_openjdk17_hs_extended.openjdk_x86-64_alpine-linux_testList_2/aqa-tests/openjdk/openjdk-jdk/test/jdk/java/beans/XMLEncoder/Test4903007.java
[2023-04-18T23:59:36.490Z] STDOUT:
[2023-04-18T23:59:36.490Z] STDERR:
[2023-04-18T23:59:36.490Z] /home/jenkins/workspace/Test_openjdk17_hs_extended.openjdk_x86-64_alpine-linux_testList_2/aqa-tests/openjdk/openjdk-jdk/test/jdk/java/beans/XMLEncoder/AbstractTest.java:118: warning: [removal] SecurityManager in java.lang has been deprecated and marked for removal
[2023-04-18T23:59:36.490Z] System.setSecurityManager(new SecurityManager());
[2023-04-18T23:59:36.490Z] ^
[2023-04-18T23:59:36.490Z] /home/jenkins/workspace/Test_openjdk17_hs_extended.openjdk_x86-64_alpine-linux_testList_2/aqa-tests/openjdk/openjdk-jdk/test/jdk/java/beans/XMLEncoder/AbstractTest.java:118: warning: [removal] setSecurityManager(SecurityManager) in System has been deprecated and marked for removal
[2023-04-18T23:59:36.490Z] System.setSecurityManager(new SecurityManager());
[2023-04-18T23:59:36.490Z] ^
[2023-04-18T23:59:36.490Z] Note: Some input files use unchecked or unsafe operations.
[2023-04-18T23:59:36.490Z] Note: Recompile with -Xlint:unchecked for details.
[2023-04-18T23:59:36.490Z] 2 warnings
[2023-04-18T23:59:36.490Z]
[2023-04-18T23:59:36.490Z] ACTION: main -- Failed. Execution failed: `main' threw exception: java.lang.Error: unexpected exception
[2023-04-18T23:59:36.490Z] REASON: User specified action: run main/othervm -Djava.security.manager=allow Test4903007
[2023-04-18T23:59:36.490Z] TIME: 0.396 seconds
[2023-04-18T23:59:36.490Z] messages:
[2023-04-18T23:59:36.490Z] command: main -Djava.security.manager=allow Test4903007
[2023-04-18T23:59:36.490Z] reason: User specified action: run main/othervm -Djava.security.manager=allow Test4903007
[2023-04-18T23:59:36.490Z] Mode: othervm [/othervm specified]
[2023-04-18T23:59:36.490Z] Additional options from @modules: --add-modules java.desktop
[2023-04-18T23:59:36.490Z] elapsed time (seconds): 0.396
[2023-04-18T23:59:36.490Z] configuration:
[2023-04-18T23:59:36.490Z] Boot Layer
[2023-04-18T23:59:36.490Z] add modules: java.desktop
[2023-04-18T23:59:36.490Z]
[2023-04-18T23:59:36.490Z] STDOUT:
[2023-04-18T23:59:36.490Z] Test object
[2023-04-18T23:59:36.490Z] STDERR:
[2023-04-18T23:59:36.490Z] java.lang.Error: unexpected exception
[2023-04-18T23:59:36.490Z] at AbstractTest.exceptionThrown(AbstractTest.java:39)
[2023-04-18T23:59:36.490Z] at java.desktop/java.beans.DefaultPersistenceDelegate.initBean(DefaultPersistenceDelegate.java:261)
[2023-04-18T23:59:36.490Z] at java.desktop/java.beans.DefaultPersistenceDelegate.initialize(DefaultPersistenceDelegate.java:406)
[2023-04-18T23:59:36.490Z] at java.desktop/java.beans.PersistenceDelegate.writeObject(PersistenceDelegate.java:123)
[2023-04-18T23:59:36.490Z] at java.desktop/java.beans.Encoder.writeObject(Encoder.java:79)
[2023-04-18T23:59:36.490Z] at java.desktop/java.beans.XMLEncoder.writeObject(XMLEncoder.java:326)
[2023-04-18T23:59:36.490Z] at java.desktop/java.beans.Encoder.writeExpression(Encoder.java:335)
[2023-04-18T23:59:36.490Z] at java.desktop/java.beans.XMLEncoder.writeExpression(XMLEncoder.java:454)
[2023-04-18T23:59:36.490Z] at java.desktop/java.beans.PersistenceDelegate.writeObject(PersistenceDelegate.java:120)
[2023-04-18T23:59:36.490Z] at java.desktop/java.beans.Encoder.writeObject(Encoder.java:79)
[2023-04-18T23:59:36.490Z] at java.desktop/java.beans.XMLEncoder.writeObject(XMLEncoder.java:326)
[2023-04-18T23:59:36.490Z] at java.desktop/java.beans.Encoder.writeObject1(Encoder.java:263)
[2023-04-18T23:59:36.490Z] at java.desktop/java.beans.Encoder.cloneStatement(Encoder.java:276)
[2023-04-18T23:59:36.490Z] at java.desktop/java.beans.Encoder.writeStatement(Encoder.java:306)
[2023-04-18T23:59:36.490Z] at java.desktop/java.beans.XMLEncoder.writeStatement(XMLEncoder.java:399)
[2023-04-18T23:59:36.490Z] at java.desktop/java.beans.DefaultPersistenceDelegate.invokeStatement(DefaultPersistenceDelegate.java:219)
[2023-04-18T23:59:36.490Z] at java.desktop/java.beans.MetaData$java_awt_Container_PersistenceDelegate.initialize(MetaData.java:880)
[2023-04-18T23:59:36.490Z] at java.desktop/java.beans.PersistenceDelegate.initialize(PersistenceDelegate.java:219)
[2023-04-18T23:59:36.490Z] at java.desktop/java.beans.DefaultPersistenceDelegate.initialize(DefaultPersistenceDelegate.java:404)
[2023-04-18T23:59:36.490Z] at java.desktop/java.beans.PersistenceDelegate.initialize(PersistenceDelegate.java:219)
[2023-04-18T23:59:36.490Z] at java.desktop/java.beans.DefaultPersistenceDelegate.initialize(DefaultPersistenceDelegate.java:404)
[2023-04-18T23:59:36.490Z] at java.desktop/java.beans.PersistenceDelegate.writeObject(PersistenceDelegate.java:123)
[2023-04-18T23:59:36.490Z] at java.desktop/java.beans.Encoder.writeObject(Encoder.java:79)
[2023-04-18T23:59:36.490Z] at java.desktop/java.beans.XMLEncoder.writeObject(XMLEncoder.java:326)
[2023-04-18T23:59:36.490Z] at java.desktop/java.beans.Encoder.writeExpression(Encoder.java:335)
[2023-04-18T23:59:36.490Z] at java.desktop/java.beans.XMLEncoder.writeExpression(XMLEncoder.java:454)
[2023-04-18T23:59:36.490Z] at java.desktop/java.beans.PersistenceDelegate.writeObject(PersistenceDelegate.java:120)
[2023-04-18T23:59:36.490Z] at java.desktop/java.beans.Encoder.writeObject(Encoder.java:79)
[2023-04-18T23:59:36.490Z] at java.desktop/java.beans.XMLEncoder.writeObject(XMLEncoder.java:326)
[2023-04-18T23:59:36.490Z] at java.desktop/java.beans.Encoder.writeObject1(Encoder.java:263)
[2023-04-18T23:59:36.490Z] at java.desktop/java.beans.Encoder.cloneStatement(Encoder.java:276)
[2023-04-18T23:59:36.490Z] at java.desktop/java.beans.Encoder.writeStatement(Encoder.java:306)
[2023-04-18T23:59:36.490Z] at java.desktop/java.beans.XMLEncoder.writeStatement(XMLEncoder.java:399)
[2023-04-18T23:59:36.490Z] at java.desktop/java.beans.XMLEncoder.writeObject(XMLEncoder.java:329)
[2023-04-18T23:59:36.490Z] at AbstractTest.writeObject(AbstractTest.java:141)
[2023-04-18T23:59:36.490Z] at AbstractTest.testObject(AbstractTest.java:131)
[2023-04-18T23:59:36.490Z] at AbstractTest.test(AbstractTest.java:103)
[2023-04-18T23:59:36.490Z] at Test4903007.main(Test4903007.java:40)
[2023-04-18T23:59:36.490Z] at java.base/jdk.internal.reflect.NativeMethodAccessorImpl.invoke0(Native Method)
[2023-04-18T23:59:36.490Z] at java.base/jdk.internal.reflect.NativeMethodAccessorImpl.invoke(NativeMethodAccessorImpl.java:77)
[2023-04-18T23:59:36.490Z] at java.base/jdk.internal.reflect.DelegatingMethodAccessorImpl.invoke(DelegatingMethodAccessorImpl.java:43)
[2023-04-18T23:59:36.490Z] at java.base/java.lang.reflect.Method.invoke(Method.java:568)
[2023-04-18T23:59:36.490Z] at com.sun.javatest.regtest.agent.MainWrapper$MainThread.run(MainWrapper.java:127)
[2023-04-18T23:59:36.490Z] at java.base/java.lang.Thread.run(Thread.java:833)
[2023-04-18T23:59:36.490Z] Caused by: java.lang.reflect.InvocationTargetException
[2023-04-18T23:59:36.490Z] at java.base/jdk.internal.reflect.GeneratedMethodAccessor4.invoke(Unknown Source)
[2023-04-18T23:59:36.490Z] at java.base/jdk.internal.reflect.DelegatingMethodAccessorImpl.invoke(DelegatingMethodAccessorImpl.java:43)
[2023-04-18T23:59:36.490Z] at java.base/java.lang.reflect.Method.invoke(Method.java:568)
[2023-04-18T23:59:36.490Z] at sun.reflect.misc.Trampoline.invoke(MethodUtil.java:72)
[2023-04-18T23:59:36.490Z] at jdk.internal.reflect.GeneratedMethodAccessor1.invoke(Unknown Source)
[2023-04-18T23:59:36.490Z] at java.base/jdk.internal.reflect.DelegatingMethodAccessorImpl.invoke(DelegatingMethodAccessorImpl.java:43)
[2023-04-18T23:59:36.490Z] at java.base/java.lang.reflect.Method.invoke(Method.java:568)
[2023-04-18T23:59:36.490Z] at java.base/sun.reflect.misc.MethodUtil.invoke(MethodUtil.java:262)
[2023-04-18T23:59:36.490Z] at java.desktop/java.beans.Statement.invokeInternal(Statement.java:306)
[2023-04-18T23:59:36.490Z] at java.desktop/java.beans.Statement$2.run(Statement.java:189)
[2023-04-18T23:59:36.490Z] at java.base/java.security.AccessController.doPrivileged(AccessController.java:712)
[2023-04-18T23:59:36.490Z] at java.desktop/java.beans.Statement.invoke(Statement.java:186)
[2023-04-18T23:59:36.490Z] at java.desktop/java.beans.Expression.getValue(Expression.java:155)
[2023-04-18T23:59:36.490Z] at java.desktop/java.beans.DefaultPersistenceDelegate.doProperty(DefaultPersistenceDelegate.java:194)
[2023-04-18T23:59:36.490Z] at java.desktop/java.beans.DefaultPersistenceDelegate.initBean(DefaultPersistenceDelegate.java:258)
[2023-04-18T23:59:36.490Z] ... 42 more
[2023-04-18T23:59:36.490Z] Caused by: java.lang.InternalError: java.lang.reflect.InvocationTargetException
[2023-04-18T23:59:36.491Z] at java.desktop/sun.font.FontManagerFactory$1.run(FontManagerFactory.java:87)
[2023-04-18T23:59:36.491Z] at java.base/java.security.AccessController.doPrivileged(AccessController.java:318)
[2023-04-18T23:59:36.491Z] at java.desktop/sun.font.FontManagerFactory.getInstance(FontManagerFactory.java:75)
[2023-04-18T23:59:36.491Z] at java.desktop/sun.font.SunFontManager.getInstance(SunFontManager.java:248)
[2023-04-18T23:59:36.491Z] at java.desktop/sun.font.FontDesignMetrics.getMetrics(FontDesignMetrics.java:266)
[2023-04-18T23:59:36.491Z] at java.desktop/sun.swing.SwingUtilities2.getFontMetrics(SwingUtilities2.java:1242)
[2023-04-18T23:59:36.491Z] at java.desktop/javax.swing.JComponent.getFontMetrics(JComponent.java:1691)
[2023-04-18T23:59:36.491Z] at java.desktop/javax.swing.plaf.basic.BasicGraphicsUtils.getPreferredButtonSize(BasicGraphicsUtils.java:356)
[2023-04-18T23:59:36.491Z] at java.desktop/javax.swing.plaf.basic.BasicButtonUI.getPreferredSize(BasicButtonUI.java:523)
[2023-04-18T23:59:36.491Z] at java.desktop/javax.swing.plaf.basic.BasicButtonUI.getMinimumSize(BasicButtonUI.java:513)
[2023-04-18T23:59:36.491Z] at java.desktop/javax.swing.JComponent.getMinimumSize(JComponent.java:1805)
[2023-04-18T23:59:36.491Z] at java.desktop/javax.swing.BoxLayout.checkRequests(BoxLayout.java:475)
[2023-04-18T23:59:36.491Z] at java.desktop/javax.swing.BoxLayout.getLayoutAlignmentX(BoxLayout.java:366)
[2023-04-18T23:59:36.491Z] at java.desktop/java.awt.Container.getAlignmentX(Container.java:1949)
[2023-04-18T23:59:36.491Z] at java.desktop/javax.swing.JComponent.getAlignmentX(JComponent.java:1963)
[2023-04-18T23:59:36.491Z] ... 57 more
[2023-04-18T23:59:36.491Z] Caused by: java.lang.reflect.InvocationTargetException
[2023-04-18T23:59:36.491Z] at java.base/jdk.internal.reflect.NativeConstructorAccessorImpl.newInstance0(Native Method)
[2023-04-18T23:59:36.491Z] at java.base/jdk.internal.reflect.NativeConstructorAccessorImpl.newInstance(NativeConstructorAccessorImpl.java:77)
[2023-04-18T23:59:36.491Z] at java.base/jdk.internal.reflect.DelegatingConstructorAccessorImpl.newInstance(DelegatingConstructorAccessorImpl.java:45)
[2023-04-18T23:59:36.491Z] at java.base/java.lang.reflect.Constructor.newInstanceWithCaller(Constructor.java:499)
[2023-04-18T23:59:36.491Z] at java.base/java.lang.reflect.Constructor.newInstance(Constructor.java:480)
[2023-04-18T23:59:36.491Z] at java.desktop/sun.font.FontManagerFactory$1.run(FontManagerFactory.java:85)
[2023-04-18T23:59:36.491Z] ... 71 more
[2023-04-18T23:59:36.491Z] Caused by: java.lang.NullPointerException: Cannot load from short array because "sun.awt.FontConfiguration.head" is null
[2023-04-18T23:59:36.491Z] at java.desktop/sun.awt.FontConfiguration.getVersion(FontConfiguration.java:1264)
[2023-04-18T23:59:36.491Z] at java.desktop/sun.awt.FontConfiguration.readFontConfigFile(FontConfiguration.java:224)
[2023-04-18T23:59:36.491Z] at java.desktop/sun.awt.FontConfiguration.init(FontConfiguration.java:106)
[2023-04-18T23:59:36.491Z] at java.desktop/sun.awt.X11FontManager.createFontConfiguration(X11FontManager.java:706)
[2023-04-18T23:59:36.491Z] at java.desktop/sun.font.SunFontManager$2.run(SunFontManager.java:358)
[2023-04-18T23:59:36.491Z] at java.desktop/sun.font.SunFontManager$2.run(SunFontManager.java:315)
[2023-04-18T23:59:36.491Z] at java.base/java.security.AccessController.doPrivileged(AccessController.java:318)
[2023-04-18T23:59:36.491Z] at java.desktop/sun.font.SunFontManager.<init>(SunFontManager.java:315)
[2023-04-18T23:59:36.491Z] at java.desktop/sun.awt.FcFontManager.<init>(FcFontManager.java:35)
[2023-04-18T23:59:36.491Z] at java.desktop/sun.awt.X11FontManager.<init>(X11FontManager.java:56)
[2023-04-18T23:59:36.491Z] ... 77 more
[2023-04-18T23:59:36.491Z]
[2023-04-18T23:59:36.491Z] JavaTest Message: Test threw exception: java.lang.Error: unexpected exception
[2023-04-18T23:59:36.491Z] JavaTest Message: shutting down test
[2023-04-18T23:59:36.491Z]
[2023-04-18T23:59:36.491Z] STATUS:Failed.`main' threw exception: java.lang.Error: unexpected exception
[2023-04-18T23:59:36.491Z] rerun:
[2023-04-18T23:59:36.491Z] cd /home/jenkins/workspace/Test_openjdk17_hs_extended.openjdk_x86-64_alpine-linux_testList_2/aqa-tests/TKG/output_16818616629195/jdk_beans_1/work/java/beans/XMLEncoder/Test4903007 && \
[2023-04-18T23:59:36.491Z] DISPLAY=:0 \
[2023-04-18T23:59:36.491Z] HOME=/home/jenkins \
[2023-04-18T23:59:36.491Z] PATH=/bin:/usr/bin:/usr/sbin \
[2023-04-18T23:59:36.491Z] CLASSPATH=/home/jenkins/workspace/Test_openjdk17_hs_extended.openjdk_x86-64_alpine-linux_testList_2/aqa-tests/TKG/output_16818616629195/jdk_beans_1/work/classes/java/beans/XMLEncoder/Test4903007.d:/home/jenkins/workspace/Test_openjdk17_hs_extended.openjdk_x86-64_alpine-linux_testList_2/aqa-tests/openjdk/openjdk-jdk/test/jdk/java/beans/XMLEncoder:/home/jenkins/workspace/Test_openjdk17_hs_extended.openjdk_x86-64_alpine-linux_testList_2/jvmtest/openjdk/jtreg/lib/javatest.jar:/home/jenkins/workspace/Test_openjdk17_hs_extended.openjdk_x86-64_alpine-linux_testList_2/jvmtest/openjdk/jtreg/lib/jtreg.jar \
[2023-04-18T23:59:36.491Z] /home/jenkins/workspace/Test_openjdk17_hs_extended.openjdk_x86-64_alpine-linux_testList_2/openjdkbinary/j2sdk-image/bin/java \
[2023-04-18T23:59:36.491Z] -Dtest.vm.opts='-ea -esa -Xmx512m -XX:-UseCompressedOops -Djava.awt.headless=true' \
[2023-04-18T23:59:36.491Z] -Dtest.tool.vm.opts='-J-ea -J-esa -J-Xmx512m -J-XX:-UseCompressedOops -J-Djava.awt.headless=true' \
[2023-04-18T23:59:36.491Z] -Dtest.compiler.opts= \
[2023-04-18T23:59:36.491Z] -Dtest.java.opts= \
[2023-04-18T23:59:36.491Z] -Dtest.jdk=/home/jenkins/workspace/Test_openjdk17_hs_extended.openjdk_x86-64_alpine-linux_testList_2/openjdkbinary/j2sdk-image \
[2023-04-18T23:59:36.491Z] -Dcompile.jdk=/home/jenkins/workspace/Test_openjdk17_hs_extended.openjdk_x86-64_alpine-linux_testList_2/openjdkbinary/j2sdk-image \
[2023-04-18T23:59:36.491Z] -Dtest.timeout.factor=8.0 \
[2023-04-18T23:59:36.491Z] -Dtest.nativepath=/home/jenkins/workspace/Test_openjdk17_hs_extended.openjdk_x86-64_alpine-linux_testList_2/openjdkbinary/openjdk-test-image/jdk/jtreg/native \
[2023-04-18T23:59:36.491Z] -Dtest.root=/home/jenkins/workspace/Test_openjdk17_hs_extended.openjdk_x86-64_alpine-linux_testList_2/aqa-tests/openjdk/openjdk-jdk/test/jdk \
[2023-04-18T23:59:36.491Z] -Dtest.name=java/beans/XMLEncoder/Test4903007.java \
[2023-04-18T23:59:36.491Z] -Dtest.file=/home/jenkins/workspace/Test_openjdk17_hs_extended.openjdk_x86-64_alpine-linux_testList_2/aqa-tests/openjdk/openjdk-jdk/test/jdk/java/beans/XMLEncoder/Test4903007.java \
[2023-04-18T23:59:36.491Z] -Dtest.src=/home/jenkins/workspace/Test_openjdk17_hs_extended.openjdk_x86-64_alpine-linux_testList_2/aqa-tests/openjdk/openjdk-jdk/test/jdk/java/beans/XMLEncoder \
[2023-04-18T23:59:36.491Z] -Dtest.src.path=/home/jenkins/workspace/Test_openjdk17_hs_extended.openjdk_x86-64_alpine-linux_testList_2/aqa-tests/openjdk/openjdk-jdk/test/jdk/java/beans/XMLEncoder \
[2023-04-18T23:59:36.491Z] -Dtest.classes=/home/jenkins/workspace/Test_openjdk17_hs_extended.openjdk_x86-64_alpine-linux_testList_2/aqa-tests/TKG/output_16818616629195/jdk_beans_1/work/classes/java/beans/XMLEncoder/Test4903007.d \
[2023-04-18T23:59:36.491Z] -Dtest.class.path=/home/jenkins/workspace/Test_openjdk17_hs_extended.openjdk_x86-64_alpine-linux_testList_2/aqa-tests/TKG/output_16818616629195/jdk_beans_1/work/classes/java/beans/XMLEncoder/Test4903007.d \
[2023-04-18T23:59:36.491Z] -Dtest.modules=java.desktop \
[2023-04-18T23:59:36.491Z] --add-modules java.desktop \
[2023-04-18T23:59:36.491Z] -ea \
[2023-04-18T23:59:36.491Z] -esa \
[2023-04-18T23:59:36.491Z] -Xmx512m \
[2023-04-18T23:59:36.491Z] -XX:-UseCompressedOops \
[2023-04-18T23:59:36.491Z] -Djava.awt.headless=true \
[2023-04-18T23:59:36.491Z] -Djava.library.path=/home/jenkins/workspace/Test_openjdk17_hs_extended.openjdk_x86-64_alpine-linux_testList_2/openjdkbinary/openjdk-test-image/jdk/jtreg/native \
[2023-04-18T23:59:36.491Z] -Djava.security.manager=allow \
[2023-04-18T23:59:36.491Z] com.sun.javatest.regtest.agent.MainWrapper /home/jenkins/workspace/Test_openjdk17_hs_extended.openjdk_x86-64_alpine-linux_testList_2/aqa-tests/TKG/output_16818616629195/jdk_beans_1/work/java/beans/XMLEncoder/Test4903007.d/main.0.jta
[2023-04-18T23:59:36.491Z]
[2023-04-18T23:59:36.491Z] TEST RESULT: Failed. Execution failed: `main' threw exception: java.lang.Error: unexpected exception
[2023-04-18T23:59:36.491Z] --------------------------------------------------
[2023-04-19T00:00:10.124Z] Test results: passed: 348; failed: 5
[2023-04-19T00:00:17.626Z] Report written to /home/jenkins/workspace/Test_openjdk17_hs_extended.openjdk_x86-64_alpine-linux_testList_2/aqa-tests/TKG/output_16818616629195/jdk_beans_1/report/html/report.html
[2023-04-19T00:00:17.626Z] Results written to /home/jenkins/workspace/Test_openjdk17_hs_extended.openjdk_x86-64_alpine-linux_testList_2/aqa-tests/TKG/output_16818616629195/jdk_beans_1/work
[2023-04-19T00:00:17.626Z] Error: Some tests failed or other problems occurred.
[2023-04-19T00:00:17.626Z] -----------------------------------
[2023-04-19T00:00:17.626Z] jdk_beans_1_FAILED
[2023-04-19T00:00:17.626Z] -----------------------------------
[2023-04-19T00:00:17.626Z]
[2023-04-19T00:00:17.626Z] TEST TEARDOWN:
[2023-04-19T00:00:17.626Z] Nothing to be done for teardown.
[2023-04-19T00:00:17.626Z] jdk_beans_1 Finish Time: Wed Apr 19 00:00:17 2023 Epoch Time (ms): 1681862417493