Post Test
[2024-09-26T23:52:19.329Z] make[4]: Leaving directory '/home/jenkins/workspace/Test_openjdk8_hs_extended.openjdk_ppc64le_linux_testList_1/aqa-tests/openjdk'
[2024-09-26T23:52:19.330Z] make[3]: Leaving directory '/home/jenkins/workspace/Test_openjdk8_hs_extended.openjdk_ppc64le_linux_testList_1/aqa-tests'
[2024-09-26T23:52:19.330Z]
[2024-09-26T23:52:19.330Z]
[2024-09-26T23:52:19.330Z] All tests finished, run result summary:
[2024-09-26T23:52:19.330Z] cd "/home/jenkins/workspace/Test_openjdk8_hs_extended.openjdk_ppc64le_linux_testList_1/aqa-tests/TKG/../TKG/scripts"; \
[2024-09-26T23:52:19.330Z] perl "resultsSum.pl" --failuremk="/home/jenkins/workspace/Test_openjdk8_hs_extended.openjdk_ppc64le_linux_testList_1/aqa-tests/TKG/../TKG/failedtargets.mk" --resultFile="/home/jenkins/workspace/Test_openjdk8_hs_extended.openjdk_ppc64le_linux_testList_1/aqa-tests/TKG/../TKG/output_17273860399668/TestTargetResult" --platFile="/home/jenkins/workspace/Test_openjdk8_hs_extended.openjdk_ppc64le_linux_testList_1/aqa-tests/TKG/../TKG/resources/buildPlatformMap.properties" --diagnostic=failure --jdkVersion=8 --jdkImpl=hotspot --jdkVendor="temurin" --spec=linux_ppc-64_le --buildList=openjdk --customTarget="" --testTarget=testList --tapPath=/home/jenkins/workspace/Test_openjdk8_hs_extended.openjdk_ppc64le_linux_testList_1/aqa-tests/TKG/../TKG/output_17273860399668/ --tapName=Test_openjdk8_hs_extended.openjdk_ppc64le_linux_testList_1.tap --comment=""
[2024-09-26T23:52:19.330Z]
[2024-09-26T23:52:19.330Z]
[2024-09-26T23:52:19.330Z] TEST TARGETS SUMMARY
[2024-09-26T23:52:19.330Z] ++++++++++++++++++++++++++++++++++++++++++++++++++++++++++++++++++++++++++
[2024-09-26T23:52:19.330Z] DISABLED test targets:
[2024-09-26T23:52:19.330Z] jdk_awt_0
[2024-09-26T23:52:19.330Z] jdk_awt_1
[2024-09-26T23:52:19.330Z] jdk_awt_2
[2024-09-26T23:52:19.330Z] jdk_sound_0
[2024-09-26T23:52:19.330Z] jdk_sound_1
[2024-09-26T23:52:19.330Z] jdk_sound_2
[2024-09-26T23:52:19.330Z] jdk_swing_0
[2024-09-26T23:52:19.330Z] jdk_swing_1
[2024-09-26T23:52:19.330Z] jdk_swing_2
[2024-09-26T23:52:19.330Z] jdk_security_infra_0
[2024-09-26T23:52:19.330Z] jdk_security_infra_1
[2024-09-26T23:52:19.330Z] jdk_security_infra_2
[2024-09-26T23:52:19.330Z] jdk_2d_0
[2024-09-26T23:52:19.330Z] jdk_2d_1
[2024-09-26T23:52:19.330Z] jdk_2d_2
[2024-09-26T23:52:19.330Z]
[2024-09-26T23:52:19.330Z] PASSED test targets:
[2024-09-26T23:52:19.330Z] jdk_io_1 - Test results: passed: 328
[2024-09-26T23:52:19.330Z] jdk_other_0 - Test results: passed: 218
[2024-09-26T23:52:19.330Z] jdk_other_1 - Test results: passed: 218
[2024-09-26T23:52:19.330Z] jdk_tools_0 - Test results: passed: 114
[2024-09-26T23:52:19.330Z] jdk_jfr_0 - Test results: passed: 430
[2024-09-26T23:52:19.330Z] jdk_jfr_1 - Test results: passed: 430
[2024-09-26T23:52:19.330Z]
[2024-09-26T23:52:19.330Z] FAILED test targets:
[2024-09-26T23:52:19.330Z] jdk_security3_1 - Test results: passed: 609; failed: 8
[2024-09-26T23:52:19.330Z] Failed test cases:
[2024-09-26T23:52:19.330Z] TEST: sun/security/pkcs11/Provider/Login.sh
[2024-09-26T23:52:19.330Z] TEST: sun/security/pkcs11/Secmod/AddPrivateKey.java
[2024-09-26T23:52:19.330Z] TEST: sun/security/pkcs11/Secmod/GetPrivateKey.java
[2024-09-26T23:52:19.330Z] TEST: sun/security/pkcs11/Secmod/JksSetPrivateKey.java
[2024-09-26T23:52:19.330Z] TEST: sun/security/pkcs11/Secmod/LoadKeystore.java
[2024-09-26T23:52:19.330Z] TEST: sun/security/pkcs11/Secmod/TrustAnchors.java
[2024-09-26T23:52:19.330Z] TEST: sun/security/pkcs11/sslecc/ClientJSSEServerJSSE.java
[2024-09-26T23:52:19.330Z] TEST: sun/security/tools/keytool/autotest.sh
[2024-09-26T23:52:19.330Z]
[2024-09-26T23:52:19.330Z] jdk_management_1 - Test results: passed: 108; failed: 2
[2024-09-26T23:52:19.330Z] Failed test cases:
[2024-09-26T23:52:19.330Z] TEST: sun/management/jmxremote/bootstrap/RmiRegistrySslTest.sh
[2024-09-26T23:52:19.330Z] TEST: sun/management/jmxremote/bootstrap/RmiSslBootstrapTest.sh
[2024-09-26T23:52:19.330Z]
[2024-09-26T23:52:19.330Z]
[2024-09-26T23:52:19.330Z] TOTAL: 42 EXECUTED: 8 PASSED: 6 FAILED: 2 DISABLED: 15 SKIPPED: 19
[2024-09-26T23:52:19.330Z] ++++++++++++++++++++++++++++++++++++++++++++++++++++++++++++++++++++++++++
[2024-09-26T23:52:19.330Z]
[2024-09-26T23:52:19.330Z] TESTCASES RESULTS SUMMARY: passed: 2,455; failed: 10; error: 0; skipped: 0
[2024-09-26T23:52:19.330Z] ++++++++++++++++++++++++++++++++++++++++++++++++++++++++++++++++++++++++++
[2024-09-26T23:52:19.330Z] make[2]: *** [settings.mk:451: resultsSummary] Error 2
[2024-09-26T23:52:19.330Z] make[2]: Leaving directory '/home/jenkins/workspace/Test_openjdk8_hs_extended.openjdk_ppc64le_linux_testList_1/aqa-tests/TKG'
[2024-09-26T23:52:19.330Z] make[1]: *** [makefile:70: _testList] Error 2
[2024-09-26T23:52:19.330Z] make[1]: Leaving directory '/home/jenkins/workspace/Test_openjdk8_hs_extended.openjdk_ppc64le_linux_testList_1/aqa-tests/TKG'
[2024-09-26T23:52:19.330Z] make: *** [parallelList.mk:11: testList_1] Error 2
[Pipeline] sh
[2024-09-26T23:52:21.914Z] ++ uname
[2024-09-26T23:52:21.914Z] + '[' Linux = AIX ']'
[2024-09-26T23:52:21.914Z] ++ uname
[2024-09-26T23:52:21.914Z] + '[' Linux = SunOS ']'
[2024-09-26T23:52:21.914Z] ++ uname
[2024-09-26T23:52:21.914Z] + '[' Linux = '*BSD' ']'
[2024-09-26T23:52:21.914Z] + MAKE=make
[2024-09-26T23:52:21.914Z] + make -f ./aqa-tests/TKG/testEnv.mk testEnvTeardown
[2024-09-26T23:52:21.914Z] make: Nothing to be done for 'testEnvTeardown'.
[Pipeline] }
[2024-09-26T23:52:22.437Z] Xvfb stopping
[Pipeline] // wrap
[Pipeline] echo
[2024-09-26T23:52:25.313Z] There were test failures, set build result to UNSTABLE.
[Pipeline] }
[Pipeline] // stage
[Pipeline] stage
[Pipeline] { (Post)
[Pipeline] step
[2024-09-26T23:52:25.581Z] TAP Reports Processing: START
[2024-09-26T23:52:25.582Z] Looking for TAP results report in workspace using pattern: aqa-tests/TKG/**/*.tap
[2024-09-26T23:52:26.681Z] Saving reports...
[2024-09-26T23:52:26.950Z] Processing '/home/jenkins/.jenkins/jobs/Test_openjdk8_hs_extended.openjdk_ppc64le_linux_testList_1/builds/17/tap-master-files/aqa-tests/TKG/output_17273860399668/Test_openjdk8_hs_extended.openjdk_ppc64le_linux_testList_1.tap'
[2024-09-26T23:52:26.950Z] Parsing TAP test result [/home/jenkins/.jenkins/jobs/Test_openjdk8_hs_extended.openjdk_ppc64le_linux_testList_1/builds/17/tap-master-files/aqa-tests/TKG/output_17273860399668/Test_openjdk8_hs_extended.openjdk_ppc64le_linux_testList_1.tap].
[2024-09-26T23:52:26.958Z] There are failed test cases. Marking build as UNSTABLE
[2024-09-26T23:52:26.958Z] TAP Reports Processing: FINISH
[Pipeline] echo
[2024-09-26T23:52:26.968Z] Saving aqa-tests/testenv/testenv.properties file on jenkins.
[Pipeline] archiveArtifacts
[2024-09-26T23:52:27.152Z] Archiving artifacts
[2024-09-26T23:52:27.583Z] Recording fingerprints
[Pipeline] echo
[2024-09-26T23:52:27.778Z] Saving aqa-tests/TKG/**/*.tap file on jenkins.
[Pipeline] archiveArtifacts
[2024-09-26T23:52:27.963Z] Archiving artifacts
[2024-09-26T23:52:29.185Z] Recording fingerprints
[Pipeline] sh
[2024-09-26T23:52:32.345Z] + pigz -9
[2024-09-26T23:52:32.345Z] + tar -cf - ./aqa-tests/TKG/output_17273860399668
[Pipeline] echo
[2024-09-26T23:55:28.665Z] ARTIFACTORY_SERVER is not set. Saving artifacts on jenkins.
[Pipeline] archiveArtifacts
[2024-09-26T23:55:28.848Z] Archiving artifacts
[2024-09-26T23:55:33.572Z] Recording fingerprints
[Pipeline] findFiles
[Pipeline] echo
[2024-09-26T23:55:37.168Z] Tap file found: aqa-tests/TKG/output_17273860399668/Test_openjdk8_hs_extended.openjdk_ppc64le_linux_testList_1.tap...
[Pipeline] readFile
[Pipeline] echo
[2024-09-26T23:55:37.470Z] Rerun in Grinder with failed test targets: https://ci.adoptium.net/job/Grinder/parambuild/?SDK_RESOURCE=upstream&TARGET=testList+TESTLIST=jdk_security3_1,jdk_management_1&BASE_DOCKER_REGISTRY_CREDENTIAL_ID=&TEST_FLAG=&UPSTREAM_TEST_JOB_NAME=Test_openjdk8_hs_extended.openjdk_ppc64le_linux&DOCKER_REQUIRED=false&ACTIVE_NODE_TIMEOUT=5&VENDOR_TEST_DIRS=&EXTRA_DOCKER_ARGS=&TKG_OWNER_BRANCH=adoptium%3Amaster&OPENJ9_SYSTEMTEST_OWNER_BRANCH=eclipse%3Amaster&PLATFORM=ppc64le_linux&GENERATE_JOBS=true&KEEP_REPORTDIR=true&PERSONAL_BUILD=false&DOCKER_REGISTRY_DIR=&RERUN_ITERATIONS=1&ADOPTOPENJDK_REPO=https%3A%2F%2Fgithub.com%2Fadoptium%2Faqa-tests.git&SETUP_JCK_RUN=false&DOCKER_REGISTRY_URL_CREDENTIAL_ID=&LABEL=&EXTRA_OPTIONS=&CUSTOMIZED_SDK_URL=&BUILD_IDENTIFIER=&JENKINS_KEY=&ADOPTOPENJDK_BRANCH=master&LIGHT_WEIGHT_CHECKOUT=false&USE_JRE=false&ARTIFACTORY_SERVER=&KEEP_WORKSPACE=false&USER_CREDENTIALS_ID=&JDK_VERSION=8&DOCKER_REGISTRY_URL=&ITERATIONS=1&VENDOR_TEST_REPOS=&JDK_REPO=https%3A%2F%2Fgithub.com%2Fadoptium%2Fjdk8u&JCK_GIT_BRANCH=master&OPENJ9_BRANCH=master&OPENJ9_SHA=&JCK_GIT_REPO=&VENDOR_TEST_BRANCHES=&UPSTREAM_JOB_NAME=build-scripts%2Fjobs%2Fjdk8u%2Fjdk8u-linux-ppc64le-temurin&OPENJ9_REPO=https%3A%2F%2Fgithub.com%2Feclipse-openj9%2Fopenj9.git&CLOUD_PROVIDER=&CUSTOM_TARGET=&VENDOR_TEST_SHAS=&JDK_BRANCH=jdk8u432-b05_adopt&LABEL_ADDITION=&ARTIFACTORY_REPO=&ARTIFACTORY_ROOT_DIR=&UPSTREAM_TEST_JOB_NUMBER=187&DOCKERIMAGE_TAG=&TEST_TIME=&JDK_IMPL=hotspot&SSH_AGENT_CREDENTIAL=&AUTO_DETECT=true&SLACK_CHANNEL=&DYNAMIC_COMPILE=false&RELATED_NODES=&ADOPTOPENJDK_SYSTEMTEST_OWNER_BRANCH=adoptium%3Amaster&APPLICATION_OPTIONS=&CUSTOMIZED_SDK_URL_CREDENTIAL_ID=eclipse_temurin_bot_email_and_token&ARCHIVE_TEST_RESULTS=false&NUM_MACHINES=&OPENJDK_SHA=&TRSS_URL=&USE_TESTENV_PROPERTIES=false&BUILD_LIST=openjdk&ADDITIONAL_ARTIFACTS_REQUIRED=&UPSTREAM_JOB_NUMBER=483&STF_OWNER_BRANCH=adoptium%3Amaster&TIME_LIMIT=25&JVM_OPTIONS=&PARALLEL=None
[Pipeline] echo
[2024-09-26T23:55:37.561Z] Rerun failed jdk test cases in Grinder with jdk_custom target: https://ci.adoptium.net/job/Grinder/parambuild/?SDK_RESOURCE=upstream&TARGET=jdk_custom&BASE_DOCKER_REGISTRY_CREDENTIAL_ID=&TEST_FLAG=&UPSTREAM_TEST_JOB_NAME=Test_openjdk8_hs_extended.openjdk_ppc64le_linux&DOCKER_REQUIRED=false&ACTIVE_NODE_TIMEOUT=5&VENDOR_TEST_DIRS=&EXTRA_DOCKER_ARGS=&TKG_OWNER_BRANCH=adoptium%3Amaster&OPENJ9_SYSTEMTEST_OWNER_BRANCH=eclipse%3Amaster&PLATFORM=ppc64le_linux&GENERATE_JOBS=true&KEEP_REPORTDIR=true&PERSONAL_BUILD=false&DOCKER_REGISTRY_DIR=&RERUN_ITERATIONS=1&ADOPTOPENJDK_REPO=https%3A%2F%2Fgithub.com%2Fadoptium%2Faqa-tests.git&SETUP_JCK_RUN=false&DOCKER_REGISTRY_URL_CREDENTIAL_ID=&LABEL=&EXTRA_OPTIONS=&CUSTOMIZED_SDK_URL=&BUILD_IDENTIFIER=&JENKINS_KEY=&ADOPTOPENJDK_BRANCH=master&LIGHT_WEIGHT_CHECKOUT=false&USE_JRE=false&ARTIFACTORY_SERVER=&KEEP_WORKSPACE=false&USER_CREDENTIALS_ID=&JDK_VERSION=8&DOCKER_REGISTRY_URL=&ITERATIONS=1&VENDOR_TEST_REPOS=&JDK_REPO=https%3A%2F%2Fgithub.com%2Fadoptium%2Fjdk8u&JCK_GIT_BRANCH=master&OPENJ9_BRANCH=master&OPENJ9_SHA=&JCK_GIT_REPO=&VENDOR_TEST_BRANCHES=&UPSTREAM_JOB_NAME=build-scripts%2Fjobs%2Fjdk8u%2Fjdk8u-linux-ppc64le-temurin&OPENJ9_REPO=https%3A%2F%2Fgithub.com%2Feclipse-openj9%2Fopenj9.git&CLOUD_PROVIDER=&CUSTOM_TARGET=sun%2Fsecurity%2Fpkcs11%2FProvider%2FLogin.sh+sun%2Fsecurity%2Fpkcs11%2FSecmod%2FAddPrivateKey.java+sun%2Fsecurity%2Fpkcs11%2FSecmod%2FGetPrivateKey.java+sun%2Fsecurity%2Fpkcs11%2FSecmod%2FJksSetPrivateKey.java+sun%2Fsecurity%2Fpkcs11%2FSecmod%2FLoadKeystore.java+sun%2Fsecurity%2Fpkcs11%2FSecmod%2FTrustAnchors.java+sun%2Fsecurity%2Fpkcs11%2Fsslecc%2FClientJSSEServerJSSE.java+sun%2Fsecurity%2Ftools%2Fkeytool%2Fautotest.sh+sun%2Fmanagement%2Fjmxremote%2Fbootstrap%2FRmiRegistrySslTest.sh+sun%2Fmanagement%2Fjmxremote%2Fbootstrap%2FRmiSslBootstrapTest.sh&VENDOR_TEST_SHAS=&JDK_BRANCH=jdk8u432-b05_adopt&LABEL_ADDITION=&ARTIFACTORY_REPO=&ARTIFACTORY_ROOT_DIR=&UPSTREAM_TEST_JOB_NUMBER=187&DOCKERIMAGE_TAG=&TEST_TIME=&JDK_IMPL=hotspot&SSH_AGENT_CREDENTIAL=&AUTO_DETECT=true&SLACK_CHANNEL=&DYNAMIC_COMPILE=false&RELATED_NODES=&ADOPTOPENJDK_SYSTEMTEST_OWNER_BRANCH=adoptium%3Amaster&APPLICATION_OPTIONS=&CUSTOMIZED_SDK_URL_CREDENTIAL_ID=eclipse_temurin_bot_email_and_token&ARCHIVE_TEST_RESULTS=false&NUM_MACHINES=&OPENJDK_SHA=&TRSS_URL=&USE_TESTENV_PROPERTIES=false&BUILD_LIST=openjdk&ADDITIONAL_ARTIFACTS_REQUIRED=&UPSTREAM_JOB_NUMBER=483&STF_OWNER_BRANCH=adoptium%3Amaster&TIME_LIMIT=25&JVM_OPTIONS=&PARALLEL=None
[Pipeline] junit
[2024-09-26T23:55:37.757Z] Recording test results
[2024-09-26T23:55:45.275Z] [Checks API] No suitable checks publisher found.
[Pipeline] }
[Pipeline] // stage
[Pipeline] echo
[2024-09-26T23:55:45.325Z] PROCESSCATCH: Terminating any hung/left over test processes:
[Pipeline] sh
[2024-09-26T23:55:47.349Z] + aqa-tests/terminateTestProcesses.sh jenkins
[2024-09-26T23:55:47.349Z] Unix type machine..
[2024-09-26T23:55:47.349Z] egrep: warning: egrep is obsolescent; using grep -E
[2024-09-26T23:55:47.349Z] grep: warning: stray \ before /
[2024-09-26T23:55:47.349Z] grep: warning: stray \ before /
[2024-09-26T23:55:47.349Z] Running on a Linux host
[2024-09-26T23:55:47.349Z] egrep: warning: egrep is obsolescent; using grep -E
[2024-09-26T23:55:47.349Z] egrep: warning: egrep is obsolescent; using grep -E
[2024-09-26T23:55:47.349Z] grep: warning: stray \ before /
[2024-09-26T23:55:47.349Z] egrep: warning: egrep is obsolescent; using grep -E
[2024-09-26T23:55:47.349Z] Woohoo - no rogue processes detected!
[Pipeline] cleanWs
[2024-09-26T23:55:48.240Z] [WS-CLEANUP] Deleting project workspace...
[2024-09-26T23:55:48.241Z] [WS-CLEANUP] Deferred wipeout is disabled by the job configuration...
[2024-09-26T23:56:09.348Z] [WS-CLEANUP] done
[Pipeline] sh
[2024-09-26T23:56:11.364Z] + find /tmp -name '*core*' -print -exec rm -f '{}' ';'
[Pipeline] }
[Pipeline] // timeout
[Pipeline] }
[Pipeline] // node
[Pipeline] }
[Pipeline] // stage
[Pipeline] echo
[2024-09-26T23:56:20.153Z] SETUP_LABEL: ci.role.test
[Pipeline] }
[Pipeline] // timestamps
[Pipeline] End of Pipeline
/home/jenkins/.jenkins/workspace/Test_openjdk8_hs_extended.openjdk_ppc64le_linux_testList_1@tmp/jfrog/17/.jfrog deleted
Finished: UNSTABLE