Post Test
[2024-09-28T12:13:22.289Z] make[3]: Leaving directory '/home/jenkins/workspace/Test_openjdk17_hs_sanity.openjdk_aarch64_linux/aqa-tests/openjdk'
[2024-09-28T12:13:22.289Z] make[2]: Leaving directory '/home/jenkins/workspace/Test_openjdk17_hs_sanity.openjdk_aarch64_linux/aqa-tests'
[2024-09-28T12:13:22.289Z]
[2024-09-28T12:13:22.289Z]
[2024-09-28T12:13:22.289Z] All tests finished, run result summary:
[2024-09-28T12:13:22.289Z] cd "/home/jenkins/workspace/Test_openjdk17_hs_sanity.openjdk_aarch64_linux/aqa-tests/TKG/../TKG/scripts"; \
[2024-09-28T12:13:22.289Z] perl "resultsSum.pl" --failuremk="/home/jenkins/workspace/Test_openjdk17_hs_sanity.openjdk_aarch64_linux/aqa-tests/TKG/../TKG/failedtargets.mk" --resultFile="/home/jenkins/workspace/Test_openjdk17_hs_sanity.openjdk_aarch64_linux/aqa-tests/TKG/../TKG/output_17275205737720/TestTargetResult" --platFile="/home/jenkins/workspace/Test_openjdk17_hs_sanity.openjdk_aarch64_linux/aqa-tests/TKG/../TKG/resources/buildPlatformMap.properties" --diagnostic=failure --jdkVersion=17 --jdkImpl=hotspot --jdkVendor="eclipse" --spec=linux_aarch64 --buildList=openjdk --customTarget="" --testTarget=sanity.openjdk --tapPath=/home/jenkins/workspace/Test_openjdk17_hs_sanity.openjdk_aarch64_linux/aqa-tests/TKG/../TKG/output_17275205737720/ --tapName=Test_openjdk17_hs_sanity.openjdk_aarch64_linux.tap --comment=""
[2024-09-28T12:13:22.289Z]
[2024-09-28T12:13:22.289Z]
[2024-09-28T12:13:22.289Z] TEST TARGETS SUMMARY
[2024-09-28T12:13:22.289Z] ++++++++++++++++++++++++++++++++++++++++++++++++++++++++++++++++++++++++++
[2024-09-28T12:13:22.289Z] PASSED test targets:
[2024-09-28T12:13:22.289Z] hotspot_sanity_0 - Test results: passed: 1
[2024-09-28T12:13:22.289Z] jdk_lang_native_0 - Test results: passed: 1
[2024-09-28T12:13:22.289Z] jdk_lang_native_1 - Test results: passed: 1
[2024-09-28T12:13:22.289Z] jdk_math_0 - Test results: passed: 44
[2024-09-28T12:13:22.289Z] jdk_math_1 - Test results: passed: 44
[2024-09-28T12:13:22.289Z] jdk_security1_0 - Test results: passed: 213
[2024-09-28T12:13:22.289Z] jdk_security1_1 - Test results: passed: 213
[2024-09-28T12:13:22.289Z] jdk_security4_0 - Test results: passed: 145
[2024-09-28T12:13:22.289Z] jdk_security4_1 - Test results: passed: 145
[2024-09-28T12:13:22.289Z] jdk_foreign_0 - Test results: passed: 74
[2024-09-28T12:13:22.289Z] jdk_foreign_1 - Test results: passed: 74
[2024-09-28T12:13:22.289Z] jdk_svc_sanity_0 - Test results: passed: 15
[2024-09-28T12:13:22.289Z] jdk_svc_sanity_1 - Test results: passed: 15
[2024-09-28T12:13:22.289Z] jdk11_tier1_buffer_0 - Test results: passed: 13
[2024-09-28T12:13:22.289Z] jdk11_tier1_buffer_1 - Test results: passed: 13
[2024-09-28T12:13:22.289Z] jdk11_tier1_iso8859_0 - Test results: passed: 1
[2024-09-28T12:13:22.289Z] jdk11_tier1_iso8859_1 - Test results: passed: 1
[2024-09-28T12:13:22.289Z]
[2024-09-28T12:13:22.289Z] FAILED test targets:
[2024-09-28T12:13:22.289Z] jdk_lang_0 - Test results: passed: 889; failed: 2
[2024-09-28T12:13:22.289Z] Failed test cases:
[2024-09-28T12:13:22.289Z] TEST: java/lang/ProcessBuilder/JspawnhelperWarnings.java
[2024-09-28T12:13:22.289Z] TEST: jdk/internal/loader/URLClassPath/LargeClasspathWithPkgPrefix.java
[2024-09-28T12:13:22.289Z]
[2024-09-28T12:13:22.289Z] jdk_lang_1 - Test results: passed: 889; failed: 2
[2024-09-28T12:13:22.289Z] Failed test cases:
[2024-09-28T12:13:22.289Z] TEST: java/lang/ProcessBuilder/JspawnhelperWarnings.java
[2024-09-28T12:13:22.289Z] TEST: jdk/internal/loader/URLClassPath/LargeClasspathWithPkgPrefix.java
[2024-09-28T12:13:22.289Z]
[2024-09-28T12:13:22.289Z] jdk_security2_0 - Test results: passed: 223; failed: 1
[2024-09-28T12:13:22.289Z] Failed test cases:
[2024-09-28T12:13:22.289Z] TEST: javax/crypto/KEM/RSA_KEM.java
[2024-09-28T12:13:22.289Z]
[2024-09-28T12:13:22.289Z] jdk_security2_1 - Test results: passed: 223; failed: 1
[2024-09-28T12:13:22.289Z] Failed test cases:
[2024-09-28T12:13:22.289Z] TEST: javax/crypto/KEM/RSA_KEM.java
[2024-09-28T12:13:22.289Z]
[2024-09-28T12:13:22.289Z] jdk_util_0 - Test results: passed: 915; failed: 3
[2024-09-28T12:13:22.289Z] Failed test cases:
[2024-09-28T12:13:22.289Z] TEST: java/util/Currency/CurrencyTest.java
[2024-09-28T12:13:22.289Z] TEST: java/util/Currency/ValidateISO4217.java
[2024-09-28T12:13:22.289Z] TEST: java/util/regex/whitebox/GraphemeTest.java
[2024-09-28T12:13:22.289Z]
[2024-09-28T12:13:22.289Z] jdk_util_1 - Test results: passed: 915; failed: 3
[2024-09-28T12:13:22.289Z] Failed test cases:
[2024-09-28T12:13:22.289Z] TEST: java/util/Currency/CurrencyTest.java
[2024-09-28T12:13:22.289Z] TEST: java/util/Currency/ValidateISO4217.java
[2024-09-28T12:13:22.289Z] TEST: java/util/regex/whitebox/GraphemeTest.java
[2024-09-28T12:13:22.289Z]
[2024-09-28T12:13:22.289Z]
[2024-09-28T12:13:22.289Z] TOTAL: 37 EXECUTED: 23 PASSED: 17 FAILED: 6 DISABLED: 0 SKIPPED: 14
[2024-09-28T12:13:22.289Z] ++++++++++++++++++++++++++++++++++++++++++++++++++++++++++++++++++++++++++
[2024-09-28T12:13:22.289Z]
[2024-09-28T12:13:22.289Z] TESTCASES RESULTS SUMMARY: passed: 5,067; failed: 12; error: 0; skipped: 0
[2024-09-28T12:13:22.289Z] ++++++++++++++++++++++++++++++++++++++++++++++++++++++++++++++++++++++++++
[2024-09-28T12:13:22.289Z] make[1]: *** [settings.mk:446: resultsSummary] Error 2
[2024-09-28T12:13:22.289Z] make[1]: Leaving directory '/home/jenkins/workspace/Test_openjdk17_hs_sanity.openjdk_aarch64_linux/aqa-tests/TKG'
[2024-09-28T12:13:22.289Z] make: *** [makefile:70: _sanity.openjdk] Error 2
[Pipeline] sh
[2024-09-28T12:13:25.303Z] ++ uname
[2024-09-28T12:13:25.303Z] + '[' Linux = AIX ']'
[2024-09-28T12:13:25.303Z] ++ uname
[2024-09-28T12:13:25.303Z] + '[' Linux = SunOS ']'
[2024-09-28T12:13:25.303Z] ++ uname
[2024-09-28T12:13:25.303Z] + '[' Linux = '*BSD' ']'
[2024-09-28T12:13:25.303Z] + MAKE=make
[2024-09-28T12:13:25.303Z] + make -f ./aqa-tests/TKG/testEnv.mk testEnvTeardown
[2024-09-28T12:13:25.303Z] make: Nothing to be done for 'testEnvTeardown'.
[Pipeline] }
[2024-09-28T12:13:25.715Z] Xvfb stopping
[Pipeline] // wrap
[Pipeline] echo
[2024-09-28T12:13:26.527Z] There were test failures, set build result to UNSTABLE.
[Pipeline] }
[Pipeline] // stage
[Pipeline] stage
[Pipeline] { (Post)
[Pipeline] step
[2024-09-28T12:13:26.763Z] TAP Reports Processing: START
[2024-09-28T12:13:26.764Z] Looking for TAP results report in workspace using pattern: aqa-tests/TKG/**/*.tap
[2024-09-28T12:13:28.718Z] Saving reports...
[2024-09-28T12:13:28.860Z] Processing '/home/jenkins/.jenkins/jobs/Test_openjdk17_hs_sanity.openjdk_aarch64_linux/builds/443/tap-master-files/aqa-tests/TKG/output_17275205737720/Test_openjdk17_hs_sanity.openjdk_aarch64_linux.tap'
[2024-09-28T12:13:28.860Z] Parsing TAP test result [/home/jenkins/.jenkins/jobs/Test_openjdk17_hs_sanity.openjdk_aarch64_linux/builds/443/tap-master-files/aqa-tests/TKG/output_17275205737720/Test_openjdk17_hs_sanity.openjdk_aarch64_linux.tap].
[2024-09-28T12:13:28.868Z] There are failed test cases. Marking build as UNSTABLE
[2024-09-28T12:13:28.868Z] TAP Reports Processing: FINISH
[Pipeline] echo
[2024-09-28T12:13:28.888Z] Saving aqa-tests/testenv/testenv.properties file on jenkins.
[Pipeline] archiveArtifacts
[2024-09-28T12:13:29.032Z] Archiving artifacts
[2024-09-28T12:13:29.308Z] Recording fingerprints
[Pipeline] echo
[2024-09-28T12:13:29.464Z] Saving aqa-tests/TKG/**/*.tap file on jenkins.
[Pipeline] archiveArtifacts
[2024-09-28T12:13:29.606Z] Archiving artifacts
[2024-09-28T12:13:31.709Z] Recording fingerprints
[Pipeline] sh
[2024-09-28T12:13:35.384Z] + tar -cf - ./aqa-tests/TKG/output_17275205737720
[2024-09-28T12:13:35.384Z] + pigz -9
[Pipeline] echo
[2024-09-28T12:13:49.824Z] ARTIFACTORY_SERVER is not set. Saving artifacts on jenkins.
[Pipeline] archiveArtifacts
[2024-09-28T12:13:49.970Z] Archiving artifacts
[2024-09-28T12:14:03.737Z] Recording fingerprints
[Pipeline] findFiles
[Pipeline] echo
[2024-09-28T12:14:08.507Z] Tap file found: aqa-tests/TKG/output_17275205737720/Test_openjdk17_hs_sanity.openjdk_aarch64_linux.tap...
[Pipeline] readFile
[Pipeline] echo
[2024-09-28T12:14:08.785Z] Rerun in Grinder with failed test targets: https://ci.adoptium.net/job/Grinder/parambuild/?SDK_RESOURCE=releases&TARGET=testList+TESTLIST=jdk_lang_0,jdk_lang_1,jdk_security2_0,jdk_security2_1,jdk_util_0,jdk_util_1&BASE_DOCKER_REGISTRY_CREDENTIAL_ID=&TEST_FLAG=&UPSTREAM_TEST_JOB_NAME=&DOCKER_REQUIRED=false&ACTIVE_NODE_TIMEOUT=&VENDOR_TEST_DIRS=&EXTRA_DOCKER_ARGS=&TKG_OWNER_BRANCH=adoptium%3Amaster&OPENJ9_SYSTEMTEST_OWNER_BRANCH=eclipse%3Amaster&PLATFORM=aarch64_linux&GENERATE_JOBS=false&KEEP_REPORTDIR=true&PERSONAL_BUILD=false&DOCKER_REGISTRY_DIR=&ADOPTOPENJDK_REPO=https%3A%2F%2Fgithub.com%2Fadoptium%2Faqa-tests.git&RERUN_ITERATIONS=0&SETUP_JCK_RUN=false&DOCKER_REGISTRY_URL_CREDENTIAL_ID=&LABEL=test-docker-fedora41-armv8-1&EXTRA_OPTIONS=&CUSTOMIZED_SDK_URL=&BUILD_IDENTIFIER=&JENKINS_KEY=&ADOPTOPENJDK_BRANCH=v1.0.3-release&LIGHT_WEIGHT_CHECKOUT=true&USE_JRE=false&ARTIFACTORY_SERVER=&KEEP_WORKSPACE=false&JDK_VERSION=17&USER_CREDENTIALS_ID=&DOCKER_REGISTRY_URL=&ITERATIONS=1&VENDOR_TEST_REPOS=&JDK_REPO=&JCK_GIT_BRANCH=master&OPENJ9_BRANCH=master&OPENJ9_SHA=&JCK_GIT_REPO=&VENDOR_TEST_BRANCHES=&OPENJ9_REPO=https%3A%2F%2Fgithub.com%2Feclipse-openj9%2Fopenj9.git&UPSTREAM_JOB_NAME=&CLOUD_PROVIDER=&CUSTOM_TARGET=&VENDOR_TEST_SHAS=&JDK_BRANCH=&LABEL_ADDITION=&ARTIFACTORY_REPO=&ARTIFACTORY_ROOT_DIR=&UPSTREAM_TEST_JOB_NUMBER=&DOCKERIMAGE_TAG=&JDK_IMPL=hotspot&TEST_TIME=&SSH_AGENT_CREDENTIAL=&AUTO_DETECT=true&SLACK_CHANNEL=&DYNAMIC_COMPILE=false&RELATED_NODES=&ADOPTOPENJDK_SYSTEMTEST_OWNER_BRANCH=adoptium%3Amaster&APPLICATION_OPTIONS=&CUSTOMIZED_SDK_URL_CREDENTIAL_ID=eclipse_temurin_bot_email_and_token&ARCHIVE_TEST_RESULTS=false&OPENJDK_SHA=&NUM_MACHINES=&TRSS_URL=&USE_TESTENV_PROPERTIES=true&BUILD_LIST=openjdk&ADDITIONAL_ARTIFACTS_REQUIRED=&UPSTREAM_JOB_NUMBER=&STF_OWNER_BRANCH=adoptium%3Amaster&TIME_LIMIT=200&JVM_OPTIONS=&PARALLEL=None
[Pipeline] echo
[2024-09-28T12:14:08.859Z] Rerun failed jdk test cases in Grinder with jdk_custom target: https://ci.adoptium.net/job/Grinder/parambuild/?SDK_RESOURCE=releases&TARGET=jdk_custom&BASE_DOCKER_REGISTRY_CREDENTIAL_ID=&TEST_FLAG=&UPSTREAM_TEST_JOB_NAME=&DOCKER_REQUIRED=false&ACTIVE_NODE_TIMEOUT=&VENDOR_TEST_DIRS=&EXTRA_DOCKER_ARGS=&TKG_OWNER_BRANCH=adoptium%3Amaster&OPENJ9_SYSTEMTEST_OWNER_BRANCH=eclipse%3Amaster&PLATFORM=aarch64_linux&GENERATE_JOBS=false&KEEP_REPORTDIR=true&PERSONAL_BUILD=false&DOCKER_REGISTRY_DIR=&ADOPTOPENJDK_REPO=https%3A%2F%2Fgithub.com%2Fadoptium%2Faqa-tests.git&RERUN_ITERATIONS=0&SETUP_JCK_RUN=false&DOCKER_REGISTRY_URL_CREDENTIAL_ID=&LABEL=test-docker-fedora41-armv8-1&EXTRA_OPTIONS=&CUSTOMIZED_SDK_URL=&BUILD_IDENTIFIER=&JENKINS_KEY=&ADOPTOPENJDK_BRANCH=v1.0.3-release&LIGHT_WEIGHT_CHECKOUT=true&USE_JRE=false&ARTIFACTORY_SERVER=&KEEP_WORKSPACE=false&JDK_VERSION=17&USER_CREDENTIALS_ID=&DOCKER_REGISTRY_URL=&ITERATIONS=1&VENDOR_TEST_REPOS=&JDK_REPO=&JCK_GIT_BRANCH=master&OPENJ9_BRANCH=master&OPENJ9_SHA=&JCK_GIT_REPO=&VENDOR_TEST_BRANCHES=&OPENJ9_REPO=https%3A%2F%2Fgithub.com%2Feclipse-openj9%2Fopenj9.git&UPSTREAM_JOB_NAME=&CLOUD_PROVIDER=&CUSTOM_TARGET=java%2Flang%2FProcessBuilder%2FJspawnhelperWarnings.java+jdk%2Finternal%2Floader%2FURLClassPath%2FLargeClasspathWithPkgPrefix.java+java%2Flang%2FProcessBuilder%2FJspawnhelperWarnings.java+jdk%2Finternal%2Floader%2FURLClassPath%2FLargeClasspathWithPkgPrefix.java+javax%2Fcrypto%2FKEM%2FRSA_KEM.java+javax%2Fcrypto%2FKEM%2FRSA_KEM.java+java%2Futil%2FCurrency%2FCurrencyTest.java+java%2Futil%2FCurrency%2FValidateISO4217.java+java%2Futil%2Fregex%2Fwhitebox%2FGraphemeTest.java+java%2Futil%2FCurrency%2FCurrencyTest.java+java%2Futil%2FCurrency%2FValidateISO4217.java+java%2Futil%2Fregex%2Fwhitebox%2FGraphemeTest.java&VENDOR_TEST_SHAS=&JDK_BRANCH=&LABEL_ADDITION=&ARTIFACTORY_REPO=&ARTIFACTORY_ROOT_DIR=&UPSTREAM_TEST_JOB_NUMBER=&DOCKERIMAGE_TAG=&JDK_IMPL=hotspot&TEST_TIME=&SSH_AGENT_CREDENTIAL=&AUTO_DETECT=true&SLACK_CHANNEL=&DYNAMIC_COMPILE=false&RELATED_NODES=&ADOPTOPENJDK_SYSTEMTEST_OWNER_BRANCH=adoptium%3Amaster&APPLICATION_OPTIONS=&CUSTOMIZED_SDK_URL_CREDENTIAL_ID=eclipse_temurin_bot_email_and_token&ARCHIVE_TEST_RESULTS=false&OPENJDK_SHA=&NUM_MACHINES=&TRSS_URL=&USE_TESTENV_PROPERTIES=true&BUILD_LIST=openjdk&ADDITIONAL_ARTIFACTS_REQUIRED=&UPSTREAM_JOB_NUMBER=&STF_OWNER_BRANCH=adoptium%3Amaster&TIME_LIMIT=200&JVM_OPTIONS=&PARALLEL=None
[Pipeline] junit
[2024-09-28T12:14:09.014Z] Recording test results
[2024-09-28T12:14:17.076Z] [Checks API] No suitable checks publisher found.
[Pipeline] }
[Pipeline] // stage
[Pipeline] echo
[2024-09-28T12:14:17.128Z] PROCESSCATCH: Terminating any hung/left over test processes:
[Pipeline] sh
[2024-09-28T12:14:18.796Z] + aqa-tests/terminateTestProcesses.sh jenkins
[2024-09-28T12:14:18.796Z] Unix type machine..
[2024-09-28T12:14:18.796Z] egrep: warning: egrep is obsolescent; using grep -E
[2024-09-28T12:14:18.796Z] grep: warning: stray \ before /
[2024-09-28T12:14:18.796Z] grep: warning: stray \ before /
[2024-09-28T12:14:18.796Z] Running on a Linux host
[2024-09-28T12:14:18.796Z] egrep: warning: egrep is obsolescent; using grep -E
[2024-09-28T12:14:18.796Z] egrep: warning: egrep is obsolescent; using grep -E
[2024-09-28T12:14:18.796Z] egrep: warning: egrep is obsolescent; using grep -E
[2024-09-28T12:14:18.796Z] grep: warning: stray \ before /
[2024-09-28T12:14:18.796Z] Woohoo - no rogue processes detected!
[Pipeline] cleanWs
[2024-09-28T12:14:19.488Z] [WS-CLEANUP] Deleting project workspace...
[2024-09-28T12:14:19.488Z] [WS-CLEANUP] Deferred wipeout is disabled by the job configuration...
[2024-09-28T12:14:38.654Z] [WS-CLEANUP] done
[Pipeline] sh
[2024-09-28T12:14:40.272Z] + find /tmp -name '*core*' -print -exec rm -f '{}' ';'
[Pipeline] }
[Pipeline] // timeout
[Pipeline] }
[Pipeline] // node
[Pipeline] }
[Pipeline] // stage
[Pipeline] echo
[2024-09-28T12:14:40.826Z] SETUP_LABEL: ci.role.test
[Pipeline] }
[Pipeline] // timestamps
[Pipeline] End of Pipeline
/home/jenkins/.jenkins/workspace/Test_openjdk17_hs_sanity.openjdk_aarch64_linux@tmp/jfrog/443/.jfrog deleted
Finished: UNSTABLE