Post Test
[2024-11-29T02:54:46.602Z] make[3]: Leaving directory '/cygdrive/c/Users/jenkins/workspace/Test_openjdk21_hs_extended.openjdk_aarch64_windows_rerun/aqa-tests/openjdk'
[2024-11-29T02:54:46.602Z] make[2]: Leaving directory '/cygdrive/c/Users/jenkins/workspace/Test_openjdk21_hs_extended.openjdk_aarch64_windows_rerun/aqa-tests'
[2024-11-29T02:54:46.602Z]
[2024-11-29T02:54:47.040Z]
[2024-11-29T02:54:47.040Z] All tests finished, run result summary:
[2024-11-29T02:54:47.041Z] cd "C:/Users/jenkins/workspace/Test_openjdk21_hs_extended.openjdk_aarch64_windows_rerun/aqa-tests/\\TKG\\scripts"; \
[2024-11-29T02:54:47.041Z] perl "resultsSum.pl" --failuremk="C:/Users/jenkins/workspace/Test_openjdk21_hs_extended.openjdk_aarch64_windows_rerun/aqa-tests/\\TKG\\failedtargets.mk" --resultFile="C:/Users/jenkins/workspace/Test_openjdk21_hs_extended.openjdk_aarch64_windows_rerun/aqa-tests/\\TKG\\output_17328318258394\\TestTargetResult" --platFile="C:/Users/jenkins/workspace/Test_openjdk21_hs_extended.openjdk_aarch64_windows_rerun/aqa-tests/\\TKG\\resources\\buildPlatformMap.properties" --diagnostic=failure --jdkVersion=21 --jdkImpl=hotspot --jdkVendor="eclipse" --spec=win_aarch64 --buildList=openjdk --customTarget="" --testTarget=testList --tapPath=C:/Users/jenkins/workspace/Test_openjdk21_hs_extended.openjdk_aarch64_windows_rerun/aqa-tests/\\TKG\\output_17328318258394\\ --tapName=Test_openjdk21_hs_extended.openjdk_aarch64_windows_rerun.tap --comment=""
[2024-11-29T02:54:48.086Z]
[2024-11-29T02:54:48.086Z]
[2024-11-29T02:54:48.086Z] TEST TARGETS SUMMARY
[2024-11-29T02:54:48.086Z] ++++++++++++++++++++++++++++++++++++++++++++++++++++++++++++++++++++++++++
[2024-11-29T02:54:48.086Z] PASSED test targets:
[2024-11-29T02:54:48.086Z] jdk_jfr_1 - Test results: passed: 583
[2024-11-29T02:54:48.086Z]
[2024-11-29T02:54:48.086Z] FAILED test targets:
[2024-11-29T02:54:48.086Z] hotspot_runtime_0 - Test results: passed: 886; failed: 7
[2024-11-29T02:54:48.086Z] Failed test cases:
[2024-11-29T02:54:48.086Z] TEST: runtime/cds/appcds/TestDumpClassListSource.java
[2024-11-29T02:54:48.086Z] TEST: runtime/ErrorHandling/CreateCoredumpOnCrash.java
[2024-11-29T02:54:48.086Z] TEST: runtime/ErrorHandling/MachCodeFramesInErrorFile.java
[2024-11-29T02:54:48.086Z] TEST: runtime/memory/ReadFromNoaccessArea.java
[2024-11-29T02:54:48.086Z] TEST: runtime/memory/ReserveMemory.java
[2024-11-29T02:54:48.086Z] TEST: runtime/ReservedStack/ReservedStackTest.java
[2024-11-29T02:54:48.086Z] TEST: runtime/ReservedStack/ReservedStackTestCompiler.java
[2024-11-29T02:54:48.086Z]
[2024-11-29T02:54:48.086Z] hotspot_serviceability_0 - Test results: passed: 324; failed: 2
[2024-11-29T02:54:48.086Z] Failed test cases:
[2024-11-29T02:54:48.086Z] TEST: serviceability/jvmti/RedefineClasses/RedefineSharedClassJFR.java
[2024-11-29T02:54:48.086Z] TEST: serviceability/sa/ClhsdbJstackXcompStress.java
[2024-11-29T02:54:48.086Z]
[2024-11-29T02:54:48.086Z] jdk_beans_0 - Test results: passed: 357; failed: 10
[2024-11-29T02:54:48.086Z] Failed test cases:
[2024-11-29T02:54:48.086Z] TEST: java/beans/PropertyEditor/6380849/TestPropertyEditor.java
[2024-11-29T02:54:48.086Z] TEST: java/beans/PropertyEditor/TestColorClassJava.java
[2024-11-29T02:54:48.086Z] TEST: java/beans/PropertyEditor/TestColorClassNull.java
[2024-11-29T02:54:48.086Z] TEST: java/beans/PropertyEditor/TestColorClass.java
[2024-11-29T02:54:48.086Z] TEST: java/beans/PropertyEditor/TestColorClassValue.java
[2024-11-29T02:54:48.086Z] TEST: java/beans/PropertyEditor/TestFontClass.java
[2024-11-29T02:54:48.086Z] TEST: java/beans/PropertyEditor/TestFontClassJava.java
[2024-11-29T02:54:48.086Z] TEST: java/beans/PropertyEditor/TestFontClassNull.java
[2024-11-29T02:54:48.086Z] TEST: java/beans/PropertyEditor/TestFontClassValue.java
[2024-11-29T02:54:48.086Z] TEST: java/beans/XMLEncoder/java_awt_ScrollPane.java
[2024-11-29T02:54:48.086Z]
[2024-11-29T02:54:48.086Z] jdk_beans_1 - Test results: passed: 357; failed: 10
[2024-11-29T02:54:48.087Z] Failed test cases:
[2024-11-29T02:54:48.087Z] TEST: java/beans/PropertyEditor/6380849/TestPropertyEditor.java
[2024-11-29T02:54:48.087Z] TEST: java/beans/PropertyEditor/TestColorClass.java
[2024-11-29T02:54:48.087Z] TEST: java/beans/PropertyEditor/TestColorClassJava.java
[2024-11-29T02:54:48.087Z] TEST: java/beans/PropertyEditor/TestColorClassNull.java
[2024-11-29T02:54:48.087Z] TEST: java/beans/PropertyEditor/TestColorClassValue.java
[2024-11-29T02:54:48.087Z] TEST: java/beans/PropertyEditor/TestFontClassJava.java
[2024-11-29T02:54:48.087Z] TEST: java/beans/PropertyEditor/TestFontClass.java
[2024-11-29T02:54:48.087Z] TEST: java/beans/PropertyEditor/TestFontClassNull.java
[2024-11-29T02:54:48.087Z] TEST: java/beans/PropertyEditor/TestFontClassValue.java
[2024-11-29T02:54:48.087Z] TEST: java/beans/XMLEncoder/java_awt_ScrollPane.java
[2024-11-29T02:54:48.087Z]
[2024-11-29T02:54:48.087Z] jdk_net_0 - Test results: passed: 891; failed: 2
[2024-11-29T02:54:48.087Z] Failed test cases:
[2024-11-29T02:54:48.087Z] TEST: com/sun/net/httpserver/simpleserver/jwebserver/CommandLinePositiveTest.java
[2024-11-29T02:54:48.087Z] TEST: com/sun/net/httpserver/simpleserver/CommandLinePositiveTest.java
[2024-11-29T02:54:48.087Z]
[2024-11-29T02:54:48.087Z] jdk_net_1 - Test results: passed: 891; failed: 2
[2024-11-29T02:54:48.087Z] Failed test cases:
[2024-11-29T02:54:48.087Z] TEST: com/sun/net/httpserver/simpleserver/jwebserver/CommandLinePositiveTest.java
[2024-11-29T02:54:48.087Z] TEST: com/sun/net/httpserver/simpleserver/CommandLinePositiveTest.java
[2024-11-29T02:54:48.087Z]
[2024-11-29T02:54:48.087Z] jdk_security3_0 - Test results: passed: 965; failed: 1
[2024-11-29T02:54:48.087Z] Failed test cases:
[2024-11-29T02:54:48.087Z] TEST: sun/security/ssl/X509TrustManagerImpl/distrust/Symantec.java
[2024-11-29T02:54:48.087Z]
[2024-11-29T02:54:48.087Z] jdk_security3_1 - Test results: passed: 964; failed: 2
[2024-11-29T02:54:48.087Z] Failed test cases:
[2024-11-29T02:54:48.087Z] TEST: javax/net/ssl/SSLSocket/Tls13PacketSize.java
[2024-11-29T02:54:48.087Z] TEST: sun/security/ssl/X509TrustManagerImpl/distrust/Symantec.java
[2024-11-29T02:54:48.087Z]
[2024-11-29T02:54:48.087Z] jdk_tools_0 - Test results: passed: 265; failed: 2
[2024-11-29T02:54:48.087Z] Failed test cases:
[2024-11-29T02:54:48.087Z] TEST: tools/jpackage/share/ServiceTest.java
[2024-11-29T02:54:48.087Z] TEST: tools/jpackage/windows/WinLongVersionTest.java#id1
[2024-11-29T02:54:48.087Z]
[2024-11-29T02:54:48.087Z] jdk_tools_1 - Test results: passed: 265; failed: 2
[2024-11-29T02:54:48.087Z] Failed test cases:
[2024-11-29T02:54:48.087Z] TEST: tools/jpackage/share/ServiceTest.java
[2024-11-29T02:54:48.087Z] TEST: tools/jpackage/windows/WinLongVersionTest.java#id1
[2024-11-29T02:54:48.087Z]
[2024-11-29T02:54:48.087Z] jdk_imageio_0 - Test results: passed: 203; failed: 1
[2024-11-29T02:54:48.087Z] Failed test cases:
[2024-11-29T02:54:48.087Z] TEST: javax/imageio/plugins/jpeg/JPEGsNotAcceleratedTest.java
[2024-11-29T02:54:48.087Z]
[2024-11-29T02:54:48.087Z] jdk_imageio_1 - Test results: passed: 203; failed: 1
[2024-11-29T02:54:48.087Z] Failed test cases:
[2024-11-29T02:54:48.087Z] TEST: javax/imageio/plugins/jpeg/JPEGsNotAcceleratedTest.java
[2024-11-29T02:54:48.087Z]
[2024-11-29T02:54:48.087Z]
[2024-11-29T02:54:48.087Z] TOTAL: 13 EXECUTED: 13 PASSED: 1 FAILED: 12 DISABLED: 0 SKIPPED: 0
[2024-11-29T02:54:48.087Z] ++++++++++++++++++++++++++++++++++++++++++++++++++++++++++++++++++++++++++
[2024-11-29T02:54:48.087Z]
[2024-11-29T02:54:48.087Z] TESTCASES RESULTS SUMMARY: passed: 7,154; failed: 42; error: 0; skipped: 0
[2024-11-29T02:54:48.087Z] ++++++++++++++++++++++++++++++++++++++++++++++++++++++++++++++++++++++++++
[2024-11-29T02:54:48.087Z] cat: 'C:/Users/jenkins/workspace/Test_openjdk21_hs_extended.openjdk_aarch64_windows_rerun/aqa-tests/TKGoutput_17328318258394../AQACert.log': No such file or directory
[2024-11-29T02:54:48.087Z] cat: 'C:/Users/jenkins/workspace/Test_openjdk21_hs_extended.openjdk_aarch64_windows_rerun/aqa-tests/TKGoutput_17328318258394../SHA.txt': No such file or directory
[2024-11-29T02:54:48.087Z] make[1]: *** [settings.mk:450: resultsSummary] Error 2
[2024-11-29T02:54:48.087Z] make[1]: Leaving directory '/cygdrive/c/Users/jenkins/workspace/Test_openjdk21_hs_extended.openjdk_aarch64_windows_rerun/aqa-tests/TKG'
[2024-11-29T02:54:48.087Z] make: *** [makefile:70: _testList] Error 2
[Pipeline] sh
[2024-11-29T02:54:48.903Z] ++ uname
[2024-11-29T02:54:48.903Z] + '[' CYGWIN_NT-10.0-22000 = AIX ']'
[2024-11-29T02:54:48.903Z] ++ uname
[2024-11-29T02:54:48.903Z] + '[' CYGWIN_NT-10.0-22000 = SunOS ']'
[2024-11-29T02:54:48.903Z] ++ uname
[2024-11-29T02:54:48.903Z] + '[' CYGWIN_NT-10.0-22000 = '*BSD' ']'
[2024-11-29T02:54:48.903Z] + MAKE=make
[2024-11-29T02:54:48.903Z] + make -f ./aqa-tests/TKG/testEnv.mk testEnvTeardown
[2024-11-29T02:54:48.903Z] make: Nothing to be done for 'testEnvTeardown'.
[Pipeline] echo
[2024-11-29T02:54:49.044Z] There were test failures, set build result to UNSTABLE.
[Pipeline] }
[Pipeline] // stage
[Pipeline] stage
[Pipeline] { (Post)
[Pipeline] step
[2024-11-29T02:54:49.125Z] TAP Reports Processing: START
[2024-11-29T02:54:49.126Z] Looking for TAP results report in workspace using pattern: aqa-tests/TKG/**/*.tap
[2024-11-29T02:55:28.725Z] Saving reports...
[2024-11-29T02:55:28.756Z] Processing '/home/jenkins/.jenkins/jobs/Test_openjdk21_hs_extended.openjdk_aarch64_windows_rerun/builds/27/tap-master-files/aqa-tests/TKG/output_17328318258394/Test_openjdk21_hs_extended.openjdk_aarch64_windows_rerun.tap'
[2024-11-29T02:55:28.756Z] Parsing TAP test result [/home/jenkins/.jenkins/jobs/Test_openjdk21_hs_extended.openjdk_aarch64_windows_rerun/builds/27/tap-master-files/aqa-tests/TKG/output_17328318258394/Test_openjdk21_hs_extended.openjdk_aarch64_windows_rerun.tap].
[2024-11-29T02:55:28.759Z] There are failed test cases. Marking build as UNSTABLE
[2024-11-29T02:55:28.759Z] TAP Reports Processing: FINISH
[Pipeline] echo
[2024-11-29T02:55:28.768Z] Saving aqa-tests/testenv/testenv.properties file on jenkins.
[Pipeline] archiveArtifacts
[2024-11-29T02:55:28.790Z] Archiving artifacts
[2024-11-29T02:55:28.838Z] Recording fingerprints
[Pipeline] echo
[2024-11-29T02:55:28.871Z] Saving aqa-tests/TKG/**/*.tap file on jenkins.
[Pipeline] archiveArtifacts
[2024-11-29T02:55:28.892Z] Archiving artifacts
[2024-11-29T02:55:45.906Z] Recording fingerprints
[Pipeline] sh
[2024-11-29T02:56:03.284Z] + tar -cf - ./aqa-tests/TKG/output_17328318258394
[2024-11-29T02:56:03.284Z] + pigz -9
[2024-11-29T02:56:03.284Z] + gzip -9
[Pipeline] echo
[2024-11-29T03:10:57.892Z] ARTIFACTORY_SERVER is not set. Saving artifacts on jenkins.
[Pipeline] archiveArtifacts
[2024-11-29T03:10:57.914Z] Archiving artifacts
[2024-11-29T03:12:15.749Z] Recording fingerprints
[Pipeline] findFiles
[Pipeline] echo
[2024-11-29T03:13:01.954Z] Tap file found: aqa-tests\TKG\output_17328318258394\Test_openjdk21_hs_extended.openjdk_aarch64_windows_rerun.tap...
[Pipeline] readFile
[Pipeline] echo
[2024-11-29T03:13:02.072Z] Rerun in Grinder with failed test targets: https://ci.adoptium.net/job/Grinder/parambuild/?SDK_RESOURCE=upstream&TARGET=testList+TESTLIST=hotspot_runtime_0,hotspot_serviceability_0,jdk_beans_0,jdk_beans_1,jdk_net_0,jdk_net_1,jdk_security3_0,jdk_security3_1,jdk_tools_0,jdk_tools_1,jdk_imageio_0,jdk_imageio_1&BASE_DOCKER_REGISTRY_CREDENTIAL_ID=&TEST_FLAG=&UPSTREAM_TEST_JOB_NAME=&DOCKER_REQUIRED=false&ACTIVE_NODE_TIMEOUT=5&VENDOR_TEST_DIRS=&EXTRA_DOCKER_ARGS=&TKG_OWNER_BRANCH=adoptium%3Amaster&OPENJ9_SYSTEMTEST_OWNER_BRANCH=eclipse%3Amaster&PLATFORM=aarch64_windows&GENERATE_JOBS=true&KEEP_REPORTDIR=true&PERSONAL_BUILD=false&DOCKER_REGISTRY_DIR=&RERUN_ITERATIONS=1&ADOPTOPENJDK_REPO=https%3A%2F%2Fgithub.com%2Fadoptium%2Faqa-tests.git&SETUP_JCK_RUN=false&DOCKER_REGISTRY_URL_CREDENTIAL_ID=&LABEL=&EXTRA_OPTIONS=&CUSTOMIZED_SDK_URL=&BUILD_IDENTIFIER=&JENKINS_KEY=&ADOPTOPENJDK_BRANCH=master&LIGHT_WEIGHT_CHECKOUT=false&USE_JRE=false&ARTIFACTORY_SERVER=&KEEP_WORKSPACE=false&USER_CREDENTIALS_ID=&JDK_VERSION=21&DOCKER_REGISTRY_URL=&ITERATIONS=1&VENDOR_TEST_REPOS=&JDK_REPO=https%3A%2F%2Fgithub.com%2Fadoptium%2Fjdk21u&JCK_GIT_BRANCH=master&OPENJ9_BRANCH=master&OPENJ9_SHA=&JCK_GIT_REPO=&VENDOR_TEST_BRANCHES=&UPSTREAM_JOB_NAME=build-scripts%2Fjobs%2Fjdk21u%2Fjdk21u-windows-aarch64-temurin&OPENJ9_REPO=https%3A%2F%2Fgithub.com%2Feclipse-openj9%2Fopenj9.git&CLOUD_PROVIDER=&CUSTOM_TARGET=&VENDOR_TEST_SHAS=&JDK_BRANCH=jdk-21.0.6%2B5_adopt&LABEL_ADDITION=&ARTIFACTORY_REPO=&ARTIFACTORY_ROOT_DIR=&UPSTREAM_TEST_JOB_NUMBER=&DOCKERIMAGE_TAG=&TEST_TIME=&JDK_IMPL=hotspot&SSH_AGENT_CREDENTIAL=&AUTO_DETECT=true&SLACK_CHANNEL=aqavit-bot&DYNAMIC_COMPILE=false&RELATED_NODES=&ADOPTOPENJDK_SYSTEMTEST_OWNER_BRANCH=adoptium%3Amaster&APPLICATION_OPTIONS=&CUSTOMIZED_SDK_URL_CREDENTIAL_ID=eclipse_temurin_bot_email_and_token&ARCHIVE_TEST_RESULTS=false&NUM_MACHINES=&OPENJDK_SHA=&TRSS_URL=&USE_TESTENV_PROPERTIES=false&BUILD_LIST=openjdk&ADDITIONAL_ARTIFACTS_REQUIRED=&UPSTREAM_JOB_NUMBER=17&STF_OWNER_BRANCH=adoptium%3Amaster&TIME_LIMIT=25&JVM_OPTIONS=&PARALLEL=None
[Pipeline] echo
[2024-11-29T03:13:02.109Z] Rerun failed jdk test cases in Grinder with jdk_custom target: https://ci.adoptium.net/job/Grinder/parambuild/?SDK_RESOURCE=upstream&TARGET=jdk_custom&BASE_DOCKER_REGISTRY_CREDENTIAL_ID=&TEST_FLAG=&UPSTREAM_TEST_JOB_NAME=&DOCKER_REQUIRED=false&ACTIVE_NODE_TIMEOUT=5&VENDOR_TEST_DIRS=&EXTRA_DOCKER_ARGS=&TKG_OWNER_BRANCH=adoptium%3Amaster&OPENJ9_SYSTEMTEST_OWNER_BRANCH=eclipse%3Amaster&PLATFORM=aarch64_windows&GENERATE_JOBS=true&KEEP_REPORTDIR=true&PERSONAL_BUILD=false&DOCKER_REGISTRY_DIR=&RERUN_ITERATIONS=1&ADOPTOPENJDK_REPO=https%3A%2F%2Fgithub.com%2Fadoptium%2Faqa-tests.git&SETUP_JCK_RUN=false&DOCKER_REGISTRY_URL_CREDENTIAL_ID=&LABEL=&EXTRA_OPTIONS=&CUSTOMIZED_SDK_URL=&BUILD_IDENTIFIER=&JENKINS_KEY=&ADOPTOPENJDK_BRANCH=master&LIGHT_WEIGHT_CHECKOUT=false&USE_JRE=false&ARTIFACTORY_SERVER=&KEEP_WORKSPACE=false&USER_CREDENTIALS_ID=&JDK_VERSION=21&DOCKER_REGISTRY_URL=&ITERATIONS=1&VENDOR_TEST_REPOS=&JDK_REPO=https%3A%2F%2Fgithub.com%2Fadoptium%2Fjdk21u&JCK_GIT_BRANCH=master&OPENJ9_BRANCH=master&OPENJ9_SHA=&JCK_GIT_REPO=&VENDOR_TEST_BRANCHES=&UPSTREAM_JOB_NAME=build-scripts%2Fjobs%2Fjdk21u%2Fjdk21u-windows-aarch64-temurin&OPENJ9_REPO=https%3A%2F%2Fgithub.com%2Feclipse-openj9%2Fopenj9.git&CLOUD_PROVIDER=&CUSTOM_TARGET=java%2Fbeans%2FPropertyEditor%2F6380849%2FTestPropertyEditor.java+java%2Fbeans%2FPropertyEditor%2FTestColorClassJava.java+java%2Fbeans%2FPropertyEditor%2FTestColorClassNull.java+java%2Fbeans%2FPropertyEditor%2FTestColorClass.java+java%2Fbeans%2FPropertyEditor%2FTestColorClassValue.java+java%2Fbeans%2FPropertyEditor%2FTestFontClass.java+java%2Fbeans%2FPropertyEditor%2FTestFontClassJava.java+java%2Fbeans%2FPropertyEditor%2FTestFontClassNull.java+java%2Fbeans%2FPropertyEditor%2FTestFontClassValue.java+java%2Fbeans%2FXMLEncoder%2Fjava_awt_ScrollPane.java+java%2Fbeans%2FPropertyEditor%2F6380849%2FTestPropertyEditor.java+java%2Fbeans%2FPropertyEditor%2FTestColorClass.java+java%2Fbeans%2FPropertyEditor%2FTestColorClassJava.java+java%2Fbeans%2FPropertyEditor%2FTestColorClassNull.java+java%2Fbeans%2FPropertyEditor%2FTestColorClassValue.java+java%2Fbeans%2FPropertyEditor%2FTestFontClassJava.java+java%2Fbeans%2FPropertyEditor%2FTestFontClass.java+java%2Fbeans%2FPropertyEditor%2FTestFontClassNull.java+java%2Fbeans%2FPropertyEditor%2FTestFontClassValue.java+java%2Fbeans%2FXMLEncoder%2Fjava_awt_ScrollPane.java+com%2Fsun%2Fnet%2Fhttpserver%2Fsimpleserver%2Fjwebserver%2FCommandLinePositiveTest.java+com%2Fsun%2Fnet%2Fhttpserver%2Fsimpleserver%2FCommandLinePositiveTest.java+sun%2Fsecurity%2Fssl%2FX509TrustManagerImpl%2Fdistrust%2FSymantec.java+javax%2Fnet%2Fssl%2FSSLSocket%2FTls13PacketSize.java+sun%2Fsecurity%2Fssl%2FX509TrustManagerImpl%2Fdistrust%2FSymantec.java+tools%2Fjpackage%2Fshare%2FServiceTest.java+tools%2Fjpackage%2Fwindows%2FWinLongVersionTest.java%23id1+javax%2Fimageio%2Fplugins%2Fjpeg%2FJPEGsNotAcceleratedTest.java&VENDOR_TEST_SHAS=&JDK_BRANCH=jdk-21.0.6%2B5_adopt&LABEL_ADDITION=&ARTIFACTORY_REPO=&ARTIFACTORY_ROOT_DIR=&UPSTREAM_TEST_JOB_NUMBER=&DOCKERIMAGE_TAG=&TEST_TIME=&JDK_IMPL=hotspot&SSH_AGENT_CREDENTIAL=&AUTO_DETECT=true&SLACK_CHANNEL=aqavit-bot&DYNAMIC_COMPILE=false&RELATED_NODES=&ADOPTOPENJDK_SYSTEMTEST_OWNER_BRANCH=adoptium%3Amaster&APPLICATION_OPTIONS=&CUSTOMIZED_SDK_URL_CREDENTIAL_ID=eclipse_temurin_bot_email_and_token&ARCHIVE_TEST_RESULTS=false&NUM_MACHINES=&OPENJDK_SHA=&TRSS_URL=&USE_TESTENV_PROPERTIES=false&BUILD_LIST=openjdk&ADDITIONAL_ARTIFACTS_REQUIRED=&UPSTREAM_JOB_NUMBER=17&STF_OWNER_BRANCH=adoptium%3Amaster&TIME_LIMIT=25&JVM_OPTIONS=&PARALLEL=None
[Pipeline] echo
[2024-11-29T03:13:02.154Z] Rerun failed hotspot test cases in Grinder with hotspot_custom target: https://ci.adoptium.net/job/Grinder/parambuild/?SDK_RESOURCE=upstream&TARGET=hotspot_custom&BASE_DOCKER_REGISTRY_CREDENTIAL_ID=&TEST_FLAG=&UPSTREAM_TEST_JOB_NAME=&DOCKER_REQUIRED=false&ACTIVE_NODE_TIMEOUT=5&VENDOR_TEST_DIRS=&EXTRA_DOCKER_ARGS=&TKG_OWNER_BRANCH=adoptium%3Amaster&OPENJ9_SYSTEMTEST_OWNER_BRANCH=eclipse%3Amaster&PLATFORM=aarch64_windows&GENERATE_JOBS=true&KEEP_REPORTDIR=true&PERSONAL_BUILD=false&DOCKER_REGISTRY_DIR=&RERUN_ITERATIONS=1&ADOPTOPENJDK_REPO=https%3A%2F%2Fgithub.com%2Fadoptium%2Faqa-tests.git&SETUP_JCK_RUN=false&DOCKER_REGISTRY_URL_CREDENTIAL_ID=&LABEL=&EXTRA_OPTIONS=&CUSTOMIZED_SDK_URL=&BUILD_IDENTIFIER=&JENKINS_KEY=&ADOPTOPENJDK_BRANCH=master&LIGHT_WEIGHT_CHECKOUT=false&USE_JRE=false&ARTIFACTORY_SERVER=&KEEP_WORKSPACE=false&USER_CREDENTIALS_ID=&JDK_VERSION=21&DOCKER_REGISTRY_URL=&ITERATIONS=1&VENDOR_TEST_REPOS=&JDK_REPO=https%3A%2F%2Fgithub.com%2Fadoptium%2Fjdk21u&JCK_GIT_BRANCH=master&OPENJ9_BRANCH=master&OPENJ9_SHA=&JCK_GIT_REPO=&VENDOR_TEST_BRANCHES=&UPSTREAM_JOB_NAME=build-scripts%2Fjobs%2Fjdk21u%2Fjdk21u-windows-aarch64-temurin&OPENJ9_REPO=https%3A%2F%2Fgithub.com%2Feclipse-openj9%2Fopenj9.git&CLOUD_PROVIDER=&CUSTOM_TARGET=runtime%2Fcds%2Fappcds%2FTestDumpClassListSource.java+runtime%2FErrorHandling%2FCreateCoredumpOnCrash.java+runtime%2FErrorHandling%2FMachCodeFramesInErrorFile.java+runtime%2Fmemory%2FReadFromNoaccessArea.java+runtime%2Fmemory%2FReserveMemory.java+runtime%2FReservedStack%2FReservedStackTest.java+runtime%2FReservedStack%2FReservedStackTestCompiler.java+serviceability%2Fjvmti%2FRedefineClasses%2FRedefineSharedClassJFR.java+serviceability%2Fsa%2FClhsdbJstackXcompStress.java&VENDOR_TEST_SHAS=&JDK_BRANCH=jdk-21.0.6%2B5_adopt&LABEL_ADDITION=&ARTIFACTORY_REPO=&ARTIFACTORY_ROOT_DIR=&UPSTREAM_TEST_JOB_NUMBER=&DOCKERIMAGE_TAG=&TEST_TIME=&JDK_IMPL=hotspot&SSH_AGENT_CREDENTIAL=&AUTO_DETECT=true&SLACK_CHANNEL=aqavit-bot&DYNAMIC_COMPILE=false&RELATED_NODES=&ADOPTOPENJDK_SYSTEMTEST_OWNER_BRANCH=adoptium%3Amaster&APPLICATION_OPTIONS=&CUSTOMIZED_SDK_URL_CREDENTIAL_ID=eclipse_temurin_bot_email_and_token&ARCHIVE_TEST_RESULTS=false&NUM_MACHINES=&OPENJDK_SHA=&TRSS_URL=&USE_TESTENV_PROPERTIES=false&BUILD_LIST=openjdk&ADDITIONAL_ARTIFACTS_REQUIRED=&UPSTREAM_JOB_NUMBER=17&STF_OWNER_BRANCH=adoptium%3Amaster&TIME_LIMIT=25&JVM_OPTIONS=&PARALLEL=None
[Pipeline] junit
[2024-11-29T03:13:02.186Z] Recording test results
[2024-11-29T03:15:05.950Z] [Checks API] No suitable checks publisher found.
[Pipeline] }
[Pipeline] // stage
[Pipeline] echo
[2024-11-29T03:15:06.003Z] PROCESSCATCH: Terminating any hung/left over test processes:
[Pipeline] sh
[2024-11-29T03:15:06.757Z] + aqa-tests/terminateTestProcesses.sh null
[2024-11-29T03:15:06.757Z] Windows machine, using powershell queries...
[2024-11-29T03:15:08.292Z] Woohoo - no rogue processes detected!
[Pipeline] cleanWs
[2024-11-29T03:15:08.362Z] [WS-CLEANUP] Deleting project workspace...
[2024-11-29T03:15:08.362Z] [WS-CLEANUP] Deferred wipeout is disabled by the job configuration...
[2024-11-29T03:18:56.014Z] [WS-CLEANUP] done
[Pipeline] sh
[2024-11-29T03:18:56.763Z] + find /cygdrive/c/temp -name '*core*' -print -exec rm -f '{}' ';'
[Pipeline] }
[Pipeline] // timeout
[Pipeline] timeout
[2024-11-29T03:18:56.822Z] Timeout set to expire in 5 min 0 sec
[Pipeline] {
[Pipeline] }
[Pipeline] // timeout
[Pipeline] }
[Pipeline] // node
[Pipeline] }
[Pipeline] // stage
[Pipeline] echo
[2024-11-29T03:18:57.000Z] SETUP_LABEL: ci.role.test
[Pipeline] }
[Pipeline] // timestamps
[Pipeline] End of Pipeline
/home/jenkins/.jenkins/workspace/Test_openjdk21_hs_extended.openjdk_aarch64_windows_rerun@tmp/jfrog/27/.jfrog deleted
Finished: UNSTABLE