jdk_beans_0
[2024-12-05T09:41:09.570Z] Running test jdk_beans_0 ...
[2024-12-05T09:41:09.570Z] ===============================================
[2024-12-05T09:41:09.570Z] jdk_beans_0 Start Time: Thu Dec 5 09:41:04 2024 Epoch Time (ms): 1733391664495
[2024-12-05T09:41:09.570Z] variation: Mode150
[2024-12-05T09:41:09.570Z] JVM_OPTIONS: -XX:+UseCompressedOops
[2024-12-05T09:41:09.570Z] { \
[2024-12-05T09:41:09.570Z] echo ""; echo "TEST SETUP:"; \
[2024-12-05T09:41:09.570Z] echo "Nothing to be done for setup."; \
[2024-12-05T09:41:09.570Z] mkdir -p "C:/jenkins/workspace/Test_openjdk17_hs_extended.openjdk_x86-64_windows_testList_2/aqa-tests/\\TKG\\output_17333892671188\\jdk_beans_0"; \
[2024-12-05T09:41:09.570Z] cd "C:/jenkins/workspace/Test_openjdk17_hs_extended.openjdk_x86-64_windows_testList_2/aqa-tests/\\TKG\\output_17333892671188\\jdk_beans_0"; \
[2024-12-05T09:41:09.570Z] echo ""; echo "TESTING:"; \
[2024-12-05T09:41:09.570Z] "c:/jenkins/workspace/Test_openjdk17_hs_extended.openjdk_x86-64_windows_testList_2/jdkbinary/j2sdk-image\\bin\\java" -Xmx512m -jar "C:/jenkins/workspace/Test_openjdk17_hs_extended.openjdk_x86-64_windows_testList_2/aqa-tests///..//jvmtest\\openjdk\\jtreg\\lib\\jtreg.jar" \
[2024-12-05T09:41:09.570Z] -agentvm -a -ea -esa -v:fail,error,time,nopass -retain:fail,error,*.dmp,javacore.*,heapdump.*,*.trc -ignore:quiet -timeoutFactor:8 -xml:verify -concurrency:3 -nativepath:"c:\jenkins\workspace\Test_openjdk17_hs_extended.openjdk_x86-64_windows_testList_2/jdkbinary/openjdk-test-image\\jdk\\jtreg\\native" -vmoptions:"-Xmx512m -XX:+UseCompressedOops " \
[2024-12-05T09:41:09.570Z] -w ""C:/jenkins/workspace/Test_openjdk17_hs_extended.openjdk_x86-64_windows_testList_2/aqa-tests/\\TKG\\output_17333892671188\\jdk_beans_0"\\work" \
[2024-12-05T09:41:09.570Z] -r ""C:/jenkins/workspace/Test_openjdk17_hs_extended.openjdk_x86-64_windows_testList_2/aqa-tests/\\TKG\\output_17333892671188\\jdk_beans_0"\\report" \
[2024-12-05T09:41:09.570Z] -jdk:"c:/jenkins/workspace/Test_openjdk17_hs_extended.openjdk_x86-64_windows_testList_2/jdkbinary/j2sdk-image" \
[2024-12-05T09:41:09.570Z] -exclude:"C:/jenkins/workspace/Test_openjdk17_hs_extended.openjdk_x86-64_windows_testList_2/aqa-tests/\\openjdk\\openjdk-jdk\\test\\jdk\\ProblemList.txt" \
[2024-12-05T09:41:09.570Z] -exclude:"C:/jenkins/workspace/Test_openjdk17_hs_extended.openjdk_x86-64_windows_testList_2/aqa-tests///..//jvmtest\\openjdk\\excludes/ProblemList_openjdk17.txt" \
[2024-12-05T09:41:09.570Z] \
[2024-12-05T09:41:09.570Z] -exclude:"C:/jenkins/workspace/Test_openjdk17_hs_extended.openjdk_x86-64_windows_testList_2/aqa-tests/\\openjdk\\excludes\\vendors\\eclipse\\ProblemList_openjdk17.txt" \
[2024-12-05T09:41:09.570Z] "C:/jenkins/workspace/Test_openjdk17_hs_extended.openjdk_x86-64_windows_testList_2/aqa-tests/\\openjdk\\openjdk-jdk\\test\\jdk:jdk_beans"; \
[2024-12-05T09:41:09.570Z] if [ $? -eq 0 ]; then echo "-----------------------------------"; echo "jdk_beans_0""_PASSED"; echo "-----------------------------------"; cd C:/jenkins/workspace/Test_openjdk17_hs_extended.openjdk_x86-64_windows_testList_2/aqa-tests/; else echo "-----------------------------------"; echo "jdk_beans_0""_FAILED"; echo "-----------------------------------"; fi; \
[2024-12-05T09:41:09.570Z] echo ""; echo "TEST TEARDOWN:"; \
[2024-12-05T09:41:09.570Z] echo "Nothing to be done for teardown."; \
[2024-12-05T09:41:09.570Z] } 2>&1 | tee -a "C:/jenkins/workspace/Test_openjdk17_hs_extended.openjdk_x86-64_windows_testList_2/aqa-tests/\\TKG\\output_17333892671188\\TestTargetResult";
[2024-12-05T09:41:09.570Z]
[2024-12-05T09:41:09.570Z] TEST SETUP:
[2024-12-05T09:41:09.570Z] Nothing to be done for setup.
[2024-12-05T09:41:09.570Z]
[2024-12-05T09:41:09.570Z] TESTING:
[2024-12-05T09:41:09.570Z] Directory "C:\jenkins\workspace\Test_openjdk17_hs_extended.openjdk_x86-64_windows_testList_2\aqa-tests\TKG\output_17333892671188\jdk_beans_0\work" not found: creating
[2024-12-05T09:41:09.570Z] Directory "C:\jenkins\workspace\Test_openjdk17_hs_extended.openjdk_x86-64_windows_testList_2\aqa-tests\TKG\output_17333892671188\jdk_beans_0\report" not found: creating
[2024-12-05T09:41:10.670Z] XML output with verification to C:\Jenkins\workspace\Test_openjdk17_hs_extended.openjdk_x86-64_windows_testList_2\aqa-tests\TKG\output_17333892671188\jdk_beans_0\work
[2024-12-05T09:43:03.745Z] --------------------------------------------------
[2024-12-05T09:43:03.745Z] TEST: java/beans/PropertyEditor/6380849/TestPropertyEditor.java
[2024-12-05T09:43:03.746Z] TEST JDK: c:\jenkins\workspace\Test_openjdk17_hs_extended.openjdk_x86-64_windows_testList_2\jdkbinary\j2sdk-image
[2024-12-05T09:43:03.746Z]
[2024-12-05T09:43:03.746Z] ACTION: compile -- Passed. Compilation successful
[2024-12-05T09:43:03.746Z] REASON: User specified action: run compile -XDignore.symbol.file TestPropertyEditor.java
[2024-12-05T09:43:03.746Z] TIME: 1.823 seconds
[2024-12-05T09:43:03.746Z] messages:
[2024-12-05T09:43:03.746Z] command: compile -XDignore.symbol.file C:\Jenkins\workspace\Test_openjdk17_hs_extended.openjdk_x86-64_windows_testList_2\aqa-tests\openjdk\openjdk-jdk\test\jdk\java\beans\PropertyEditor\6380849\TestPropertyEditor.java
[2024-12-05T09:43:03.746Z] reason: User specified action: run compile -XDignore.symbol.file TestPropertyEditor.java
[2024-12-05T09:43:03.746Z] started: Thu Dec 05 09:42:55 UTC 2024
[2024-12-05T09:43:03.746Z] Additional options from @modules: --add-modules java.desktop --add-exports java.desktop/com.sun.beans.editors=ALL-UNNAMED
[2024-12-05T09:43:03.746Z] Mode: othervm
[2024-12-05T09:43:03.746Z] finished: Thu Dec 05 09:42:56 UTC 2024
[2024-12-05T09:43:03.746Z] elapsed time (seconds): 1.823
[2024-12-05T09:43:03.746Z] configuration:
[2024-12-05T09:43:03.746Z] javac compilation environment
[2024-12-05T09:43:03.746Z] add modules: java.desktop
[2024-12-05T09:43:03.746Z] add exports: java.desktop/com.sun.beans.editors ALL-UNNAMED
[2024-12-05T09:43:03.746Z] source path: C:\Jenkins\workspace\Test_openjdk17_hs_extended.openjdk_x86-64_windows_testList_2\aqa-tests\openjdk\openjdk-jdk\test\jdk\java\beans\PropertyEditor\6380849
[2024-12-05T09:43:03.746Z] class path: C:\Jenkins\workspace\Test_openjdk17_hs_extended.openjdk_x86-64_windows_testList_2\aqa-tests\openjdk\openjdk-jdk\test\jdk\java\beans\PropertyEditor\6380849
[2024-12-05T09:43:03.746Z] C:\Jenkins\workspace\Test_openjdk17_hs_extended.openjdk_x86-64_windows_testList_2\aqa-tests\TKG\output_17333892671188\jdk_beans_0\work\classes\2\java\beans\PropertyEditor\6380849\TestPropertyEditor.d
[2024-12-05T09:43:03.746Z]
[2024-12-05T09:43:03.746Z] rerun:
[2024-12-05T09:43:03.746Z] cd 'C:\Jenkins\workspace\Test_openjdk17_hs_extended.openjdk_x86-64_windows_testList_2\aqa-tests\TKG\output_17333892671188\jdk_beans_0\work\java\beans\PropertyEditor\6380849\TestPropertyEditor' && \
[2024-12-05T09:43:03.746Z] PATH='C:\Program Files\Java\jdk-17.0.8.1+1\bin;C:\cygwin64\bin;C:\Windows\system32;C:\Windows;C:\Windows\System32\Wbem;C:\Windows\System32\WindowsPowerShell\v1.0;C:\Windows\System32\OpenSSH;C:\Program Files\dotnet;C:\Users\adoptopenjdk\AppData\Local\Microsoft\WindowsApps;C:\Strawberry\perl\bin;C:\Program Files\Git\cmd;C:\openjdk\jdk-8\bin;C:\apache-ant\apache-ant-1.10.15\bin;C:\Program Files (x86)\IncrediBuild;C:\Program Files (x86)\Windows Kits\10\Windows Performance Toolkit;C:\rust\bin;C:\Program Files\IcedTeaWEB\bin;C:\Program Files\Microsoft SQL Server\110\Tools\Binn;C:\Program Files (x86)\Microsoft SDKs\TypeScript\1.0;C:\Program Files\Microsoft SQL Server\120\Tools\Binn;C:\Users\jenkins\AppData\Local\Microsoft\WindowsApps' \
[2024-12-05T09:43:03.746Z] SystemDrive=C: \
[2024-12-05T09:43:03.746Z] SystemRoot='C:\Windows' \
[2024-12-05T09:43:03.746Z] TEMP='C:\Users\jenkins\AppData\Local\Temp\3' \
[2024-12-05T09:43:03.746Z] TMP='C:\Users\jenkins\AppData\Local\Temp\3' \
[2024-12-05T09:43:03.746Z] windir='C:\Windows' \
[2024-12-05T09:43:03.746Z] 'c:\jenkins\workspace\Test_openjdk17_hs_extended.openjdk_x86-64_windows_testList_2\jdkbinary\j2sdk-image\bin\javac' \
[2024-12-05T09:43:03.746Z] -J-ea \
[2024-12-05T09:43:03.746Z] -J-esa \
[2024-12-05T09:43:03.746Z] -J-Xmx512m \
[2024-12-05T09:43:03.746Z] -J-XX:+UseCompressedOops \
[2024-12-05T09:43:03.746Z] -J-Dtest.vm.opts='-ea -esa -Xmx512m -XX:+UseCompressedOops' \
[2024-12-05T09:43:03.746Z] -J-Dtest.tool.vm.opts='-J-ea -J-esa -J-Xmx512m -J-XX:+UseCompressedOops' \
[2024-12-05T09:43:03.746Z] -J-Dtest.compiler.opts= \
[2024-12-05T09:43:03.746Z] -J-Dtest.java.opts= \
[2024-12-05T09:43:03.746Z] -J-Dtest.jdk='c:\jenkins\workspace\Test_openjdk17_hs_extended.openjdk_x86-64_windows_testList_2\jdkbinary\j2sdk-image' \
[2024-12-05T09:43:03.746Z] -J-Dcompile.jdk='c:\jenkins\workspace\Test_openjdk17_hs_extended.openjdk_x86-64_windows_testList_2\jdkbinary\j2sdk-image' \
[2024-12-05T09:43:03.746Z] -J-Dtest.timeout.factor=8.0 \
[2024-12-05T09:43:03.746Z] -J-Dtest.nativepath='c:\jenkins\workspace\Test_openjdk17_hs_extended.openjdk_x86-64_windows_testList_2\jdkbinary\openjdk-test-image\jdk\jtreg\native' \
[2024-12-05T09:43:03.746Z] -J-Dtest.root='C:\Jenkins\workspace\Test_openjdk17_hs_extended.openjdk_x86-64_windows_testList_2\aqa-tests\openjdk\openjdk-jdk\test\jdk' \
[2024-12-05T09:43:03.746Z] -J-Dtest.name=java/beans/PropertyEditor/6380849/TestPropertyEditor.java \
[2024-12-05T09:43:03.746Z] -J-Dtest.file='C:\Jenkins\workspace\Test_openjdk17_hs_extended.openjdk_x86-64_windows_testList_2\aqa-tests\openjdk\openjdk-jdk\test\jdk\java\beans\PropertyEditor\6380849\TestPropertyEditor.java' \
[2024-12-05T09:43:03.746Z] -J-Dtest.src='C:\Jenkins\workspace\Test_openjdk17_hs_extended.openjdk_x86-64_windows_testList_2\aqa-tests\openjdk\openjdk-jdk\test\jdk\java\beans\PropertyEditor\6380849' \
[2024-12-05T09:43:03.746Z] -J-Dtest.src.path='C:\Jenkins\workspace\Test_openjdk17_hs_extended.openjdk_x86-64_windows_testList_2\aqa-tests\openjdk\openjdk-jdk\test\jdk\java\beans\PropertyEditor\6380849' \
[2024-12-05T09:43:03.746Z] -J-Dtest.classes='C:\Jenkins\workspace\Test_openjdk17_hs_extended.openjdk_x86-64_windows_testList_2\aqa-tests\TKG\output_17333892671188\jdk_beans_0\work\classes\2\java\beans\PropertyEditor\6380849\TestPropertyEditor.d' \
[2024-12-05T09:43:03.746Z] -J-Dtest.class.path='C:\Jenkins\workspace\Test_openjdk17_hs_extended.openjdk_x86-64_windows_testList_2\aqa-tests\TKG\output_17333892671188\jdk_beans_0\work\classes\2\java\beans\PropertyEditor\6380849\TestPropertyEditor.d' \
[2024-12-05T09:43:03.746Z] -J-Dtest.modules=java.desktop/com.sun.beans.editors \
[2024-12-05T09:43:03.746Z] '@C:\Jenkins\workspace\Test_openjdk17_hs_extended.openjdk_x86-64_windows_testList_2\aqa-tests\TKG\output_17333892671188\jdk_beans_0\work\java\beans\PropertyEditor\6380849\TestPropertyEditor.d\compile.0.jta'
[2024-12-05T09:43:03.746Z] STDOUT:
[2024-12-05T09:43:03.746Z] STDERR:
[2024-12-05T09:43:03.746Z]
[2024-12-05T09:43:03.746Z] ACTION: build -- Passed. All files up to date
[2024-12-05T09:43:03.746Z] REASON: Named class compiled on demand
[2024-12-05T09:43:03.746Z] TIME: 0.027 seconds
[2024-12-05T09:43:03.746Z] messages:
[2024-12-05T09:43:03.746Z] command: build TestPropertyEditor
[2024-12-05T09:43:03.746Z] reason: Named class compiled on demand
[2024-12-05T09:43:03.746Z] started: Thu Dec 05 09:42:56 UTC 2024
[2024-12-05T09:43:03.746Z] finished: Thu Dec 05 09:42:56 UTC 2024
[2024-12-05T09:43:03.746Z] elapsed time (seconds): 0.027
[2024-12-05T09:43:03.746Z]
[2024-12-05T09:43:03.746Z] ACTION: main -- Failed. Execution failed: `main' threw exception: java.lang.Error: expected editor is not found
[2024-12-05T09:43:03.746Z] REASON: User specified action: run main TestPropertyEditor
[2024-12-05T09:43:03.746Z] TIME: 0.648 seconds
[2024-12-05T09:43:03.746Z] messages:
[2024-12-05T09:43:03.746Z] command: main TestPropertyEditor
[2024-12-05T09:43:03.746Z] reason: User specified action: run main TestPropertyEditor
[2024-12-05T09:43:03.746Z] started: Thu Dec 05 09:42:56 UTC 2024
[2024-12-05T09:43:03.746Z] Mode: othervm
[2024-12-05T09:43:03.746Z] Additional options from @modules: --add-modules java.desktop --add-exports java.desktop/com.sun.beans.editors=ALL-UNNAMED
[2024-12-05T09:43:03.746Z] finished: Thu Dec 05 09:42:57 UTC 2024
[2024-12-05T09:43:03.746Z] elapsed time (seconds): 0.648
[2024-12-05T09:43:03.746Z] configuration:
[2024-12-05T09:43:03.746Z] Boot Layer
[2024-12-05T09:43:03.746Z] add modules: java.desktop
[2024-12-05T09:43:03.746Z] add exports: java.desktop/com.sun.beans.editors ALL-UNNAMED
[2024-12-05T09:43:03.746Z]
[2024-12-05T09:43:03.746Z] STDOUT:
[2024-12-05T09:43:03.746Z] STDERR:
[2024-12-05T09:43:03.746Z] java.lang.Error: expected editor is not found
[2024-12-05T09:43:03.746Z] at TestPropertyEditor.test(TestPropertyEditor.java:76)
[2024-12-05T09:43:03.746Z] at TestPropertyEditor.run(TestPropertyEditor.java:106)
[2024-12-05T09:43:03.746Z] at TestPropertyEditor.main(TestPropertyEditor.java:65)
[2024-12-05T09:43:03.746Z] at java.base/jdk.internal.reflect.NativeMethodAccessorImpl.invoke0(Native Method)
[2024-12-05T09:43:03.746Z] at java.base/jdk.internal.reflect.NativeMethodAccessorImpl.invoke(NativeMethodAccessorImpl.java:77)
[2024-12-05T09:43:03.746Z] at java.base/jdk.internal.reflect.DelegatingMethodAccessorImpl.invoke(DelegatingMethodAccessorImpl.java:43)
[2024-12-05T09:43:03.746Z] at java.base/java.lang.reflect.Method.invoke(Method.java:569)
[2024-12-05T09:43:03.746Z] at com.sun.javatest.regtest.agent.MainWrapper$MainTask.run(MainWrapper.java:138)
[2024-12-05T09:43:03.746Z] at java.base/java.lang.Thread.run(Thread.java:840)
[2024-12-05T09:43:03.746Z]
[2024-12-05T09:43:03.746Z] JavaTest Message: Test threw exception: java.lang.Error: expected editor is not found
[2024-12-05T09:43:03.746Z] JavaTest Message: shutting down test
[2024-12-05T09:43:03.746Z]
[2024-12-05T09:43:03.746Z] STATUS:Failed.`main' threw exception: java.lang.Error: expected editor is not found
[2024-12-05T09:43:03.746Z] rerun:
[2024-12-05T09:43:03.746Z] cd 'C:\Jenkins\workspace\Test_openjdk17_hs_extended.openjdk_x86-64_windows_testList_2\aqa-tests\TKG\output_17333892671188\jdk_beans_0\work\java\beans\PropertyEditor\6380849\TestPropertyEditor' && \
[2024-12-05T09:43:03.746Z] PATH='C:\Program Files\Java\jdk-17.0.8.1+1\bin;C:\cygwin64\bin;C:\Windows\system32;C:\Windows;C:\Windows\System32\Wbem;C:\Windows\System32\WindowsPowerShell\v1.0;C:\Windows\System32\OpenSSH;C:\Program Files\dotnet;C:\Users\adoptopenjdk\AppData\Local\Microsoft\WindowsApps;C:\Strawberry\perl\bin;C:\Program Files\Git\cmd;C:\openjdk\jdk-8\bin;C:\apache-ant\apache-ant-1.10.15\bin;C:\Program Files (x86)\IncrediBuild;C:\Program Files (x86)\Windows Kits\10\Windows Performance Toolkit;C:\rust\bin;C:\Program Files\IcedTeaWEB\bin;C:\Program Files\Microsoft SQL Server\110\Tools\Binn;C:\Program Files (x86)\Microsoft SDKs\TypeScript\1.0;C:\Program Files\Microsoft SQL Server\120\Tools\Binn;C:\Users\jenkins\AppData\Local\Microsoft\WindowsApps' \
[2024-12-05T09:43:03.746Z] SystemDrive=C: \
[2024-12-05T09:43:03.746Z] SystemRoot='C:\Windows' \
[2024-12-05T09:43:03.746Z] TEMP='C:\Users\jenkins\AppData\Local\Temp\3' \
[2024-12-05T09:43:03.746Z] TMP='C:\Users\jenkins\AppData\Local\Temp\3' \
[2024-12-05T09:43:03.746Z] windir='C:\Windows' \
[2024-12-05T09:43:03.746Z] CLASSPATH='C:\Jenkins\workspace\Test_openjdk17_hs_extended.openjdk_x86-64_windows_testList_2\aqa-tests\TKG\output_17333892671188\jdk_beans_0\work\classes\2\java\beans\PropertyEditor\6380849\TestPropertyEditor.d;C:\Jenkins\workspace\Test_openjdk17_hs_extended.openjdk_x86-64_windows_testList_2\aqa-tests\openjdk\openjdk-jdk\test\jdk\java\beans\PropertyEditor\6380849;C:\Jenkins\workspace\Test_openjdk17_hs_extended.openjdk_x86-64_windows_testList_2\jvmtest\openjdk\jtreg\lib\javatest.jar;C:\Jenkins\workspace\Test_openjdk17_hs_extended.openjdk_x86-64_windows_testList_2\jvmtest\openjdk\jtreg\lib\jtreg.jar' \
[2024-12-05T09:43:03.746Z] 'c:\jenkins\workspace\Test_openjdk17_hs_extended.openjdk_x86-64_windows_testList_2\jdkbinary\j2sdk-image\bin\java' \
[2024-12-05T09:43:03.746Z] -Dtest.vm.opts='-ea -esa -Xmx512m -XX:+UseCompressedOops' \
[2024-12-05T09:43:03.746Z] -Dtest.tool.vm.opts='-J-ea -J-esa -J-Xmx512m -J-XX:+UseCompressedOops' \
[2024-12-05T09:43:03.746Z] -Dtest.compiler.opts= \
[2024-12-05T09:43:03.746Z] -Dtest.java.opts= \
[2024-12-05T09:43:03.746Z] -Dtest.jdk='c:\jenkins\workspace\Test_openjdk17_hs_extended.openjdk_x86-64_windows_testList_2\jdkbinary\j2sdk-image' \
[2024-12-05T09:43:03.746Z] -Dcompile.jdk='c:\jenkins\workspace\Test_openjdk17_hs_extended.openjdk_x86-64_windows_testList_2\jdkbinary\j2sdk-image' \
[2024-12-05T09:43:03.746Z] -Dtest.timeout.factor=8.0 \
[2024-12-05T09:43:03.746Z] -Dtest.nativepath='c:\jenkins\workspace\Test_openjdk17_hs_extended.openjdk_x86-64_windows_testList_2\jdkbinary\openjdk-test-image\jdk\jtreg\native' \
[2024-12-05T09:43:03.746Z] -Dtest.root='C:\Jenkins\workspace\Test_openjdk17_hs_extended.openjdk_x86-64_windows_testList_2\aqa-tests\openjdk\openjdk-jdk\test\jdk' \
[2024-12-05T09:43:03.746Z] -Dtest.name=java/beans/PropertyEditor/6380849/TestPropertyEditor.java \
[2024-12-05T09:43:03.746Z] -Dtest.file='C:\Jenkins\workspace\Test_openjdk17_hs_extended.openjdk_x86-64_windows_testList_2\aqa-tests\openjdk\openjdk-jdk\test\jdk\java\beans\PropertyEditor\6380849\TestPropertyEditor.java' \
[2024-12-05T09:43:03.746Z] -Dtest.src='C:\Jenkins\workspace\Test_openjdk17_hs_extended.openjdk_x86-64_windows_testList_2\aqa-tests\openjdk\openjdk-jdk\test\jdk\java\beans\PropertyEditor\6380849' \
[2024-12-05T09:43:03.746Z] -Dtest.src.path='C:\Jenkins\workspace\Test_openjdk17_hs_extended.openjdk_x86-64_windows_testList_2\aqa-tests\openjdk\openjdk-jdk\test\jdk\java\beans\PropertyEditor\6380849' \
[2024-12-05T09:43:03.746Z] -Dtest.classes='C:\Jenkins\workspace\Test_openjdk17_hs_extended.openjdk_x86-64_windows_testList_2\aqa-tests\TKG\output_17333892671188\jdk_beans_0\work\classes\2\java\beans\PropertyEditor\6380849\TestPropertyEditor.d' \
[2024-12-05T09:43:03.746Z] -Dtest.class.path='C:\Jenkins\workspace\Test_openjdk17_hs_extended.openjdk_x86-64_windows_testList_2\aqa-tests\TKG\output_17333892671188\jdk_beans_0\work\classes\2\java\beans\PropertyEditor\6380849\TestPropertyEditor.d' \
[2024-12-05T09:43:03.746Z] -Dtest.modules=java.desktop/com.sun.beans.editors \
[2024-12-05T09:43:03.746Z] --add-modules java.desktop \
[2024-12-05T09:43:03.746Z] --add-exports java.desktop/com.sun.beans.editors=ALL-UNNAMED \
[2024-12-05T09:43:03.746Z] -ea \
[2024-12-05T09:43:03.746Z] -esa \
[2024-12-05T09:43:03.746Z] -Xmx512m \
[2024-12-05T09:43:03.746Z] -XX:+UseCompressedOops \
[2024-12-05T09:43:03.746Z] '-Djava.library.path=c:\jenkins\workspace\Test_openjdk17_hs_extended.openjdk_x86-64_windows_testList_2\jdkbinary\openjdk-test-image\jdk\jtreg\native' \
[2024-12-05T09:43:03.746Z] com.sun.javatest.regtest.agent.MainWrapper 'C:\Jenkins\workspace\Test_openjdk17_hs_extended.openjdk_x86-64_windows_testList_2\aqa-tests\TKG\output_17333892671188\jdk_beans_0\work\java\beans\PropertyEditor\6380849\TestPropertyEditor.d\main.1.jta'
[2024-12-05T09:43:03.746Z]
[2024-12-05T09:43:03.746Z] TEST RESULT: Failed. Execution failed: `main' threw exception: java.lang.Error: expected editor is not found
[2024-12-05T09:43:03.746Z] --------------------------------------------------
[2024-12-05T09:43:27.069Z] TEST: java/beans/PropertyEditor/TestColorClass.java
[2024-12-05T09:43:27.069Z] TEST JDK: c:\jenkins\workspace\Test_openjdk17_hs_extended.openjdk_x86-64_windows_testList_2\jdkbinary\j2sdk-image
[2024-12-05T09:43:27.069Z]
[2024-12-05T09:43:27.069Z] ACTION: build -- Passed. Build successful
[2024-12-05T09:43:27.069Z] REASON: Named class compiled on demand
[2024-12-05T09:43:27.069Z] TIME: 2.576 seconds
[2024-12-05T09:43:27.069Z] messages:
[2024-12-05T09:43:27.069Z] command: build TestColorClass
[2024-12-05T09:43:27.069Z] reason: Named class compiled on demand
[2024-12-05T09:43:27.069Z] started: Thu Dec 05 09:43:20 UTC 2024
[2024-12-05T09:43:27.069Z] Test directory:
[2024-12-05T09:43:27.069Z] compile: TestColorClass
[2024-12-05T09:43:27.069Z] finished: Thu Dec 05 09:43:22 UTC 2024
[2024-12-05T09:43:27.069Z] elapsed time (seconds): 2.576
[2024-12-05T09:43:27.069Z]
[2024-12-05T09:43:27.069Z] ACTION: compile -- Passed. Compilation successful
[2024-12-05T09:43:27.069Z] REASON: .class file out of date or does not exist
[2024-12-05T09:43:27.069Z] TIME: 2.575 seconds
[2024-12-05T09:43:27.069Z] messages:
[2024-12-05T09:43:27.069Z] command: compile C:\Jenkins\workspace\Test_openjdk17_hs_extended.openjdk_x86-64_windows_testList_2\aqa-tests\openjdk\openjdk-jdk\test\jdk\java\beans\PropertyEditor\TestColorClass.java
[2024-12-05T09:43:27.069Z] reason: .class file out of date or does not exist
[2024-12-05T09:43:27.069Z] started: Thu Dec 05 09:43:20 UTC 2024
[2024-12-05T09:43:27.069Z] Additional options from @modules: --add-modules java.compiler,java.desktop,jdk.compiler
[2024-12-05T09:43:27.069Z] Mode: othervm
[2024-12-05T09:43:27.069Z] finished: Thu Dec 05 09:43:22 UTC 2024
[2024-12-05T09:43:27.069Z] elapsed time (seconds): 2.575
[2024-12-05T09:43:27.069Z] configuration:
[2024-12-05T09:43:27.069Z] javac compilation environment
[2024-12-05T09:43:27.069Z] add modules: java.compiler java.desktop jdk.compiler
[2024-12-05T09:43:27.069Z] source path: C:\Jenkins\workspace\Test_openjdk17_hs_extended.openjdk_x86-64_windows_testList_2\aqa-tests\openjdk\openjdk-jdk\test\jdk\java\beans\PropertyEditor
[2024-12-05T09:43:27.069Z] class path: C:\Jenkins\workspace\Test_openjdk17_hs_extended.openjdk_x86-64_windows_testList_2\aqa-tests\openjdk\openjdk-jdk\test\jdk\java\beans\PropertyEditor
[2024-12-05T09:43:27.069Z] C:\Jenkins\workspace\Test_openjdk17_hs_extended.openjdk_x86-64_windows_testList_2\aqa-tests\TKG\output_17333892671188\jdk_beans_0\work\classes\2\java\beans\PropertyEditor\TestColorClass.d
[2024-12-05T09:43:27.069Z]
[2024-12-05T09:43:27.069Z] rerun:
[2024-12-05T09:43:27.069Z] cd 'C:\Jenkins\workspace\Test_openjdk17_hs_extended.openjdk_x86-64_windows_testList_2\aqa-tests\TKG\output_17333892671188\jdk_beans_0\work\java\beans\PropertyEditor\TestColorClass' && \
[2024-12-05T09:43:27.069Z] PATH='C:\Program Files\Java\jdk-17.0.8.1+1\bin;C:\cygwin64\bin;C:\Windows\system32;C:\Windows;C:\Windows\System32\Wbem;C:\Windows\System32\WindowsPowerShell\v1.0;C:\Windows\System32\OpenSSH;C:\Program Files\dotnet;C:\Users\adoptopenjdk\AppData\Local\Microsoft\WindowsApps;C:\Strawberry\perl\bin;C:\Program Files\Git\cmd;C:\openjdk\jdk-8\bin;C:\apache-ant\apache-ant-1.10.15\bin;C:\Program Files (x86)\IncrediBuild;C:\Program Files (x86)\Windows Kits\10\Windows Performance Toolkit;C:\rust\bin;C:\Program Files\IcedTeaWEB\bin;C:\Program Files\Microsoft SQL Server\110\Tools\Binn;C:\Program Files (x86)\Microsoft SDKs\TypeScript\1.0;C:\Program Files\Microsoft SQL Server\120\Tools\Binn;C:\Users\jenkins\AppData\Local\Microsoft\WindowsApps' \
[2024-12-05T09:43:27.069Z] SystemDrive=C: \
[2024-12-05T09:43:27.070Z] SystemRoot='C:\Windows' \
[2024-12-05T09:43:27.070Z] TEMP='C:\Users\jenkins\AppData\Local\Temp\3' \
[2024-12-05T09:43:27.070Z] TMP='C:\Users\jenkins\AppData\Local\Temp\3' \
[2024-12-05T09:43:27.070Z] windir='C:\Windows' \
[2024-12-05T09:43:27.070Z] 'c:\jenkins\workspace\Test_openjdk17_hs_extended.openjdk_x86-64_windows_testList_2\jdkbinary\j2sdk-image\bin\javac' \
[2024-12-05T09:43:27.070Z] -J-ea \
[2024-12-05T09:43:27.070Z] -J-esa \
[2024-12-05T09:43:27.070Z] -J-Xmx512m \
[2024-12-05T09:43:27.070Z] -J-XX:+UseCompressedOops \
[2024-12-05T09:43:27.070Z] -J-Dtest.vm.opts='-ea -esa -Xmx512m -XX:+UseCompressedOops' \
[2024-12-05T09:43:27.070Z] -J-Dtest.tool.vm.opts='-J-ea -J-esa -J-Xmx512m -J-XX:+UseCompressedOops' \
[2024-12-05T09:43:27.070Z] -J-Dtest.compiler.opts= \
[2024-12-05T09:43:27.070Z] -J-Dtest.java.opts= \
[2024-12-05T09:43:27.070Z] -J-Dtest.jdk='c:\jenkins\workspace\Test_openjdk17_hs_extended.openjdk_x86-64_windows_testList_2\jdkbinary\j2sdk-image' \
[2024-12-05T09:43:27.070Z] -J-Dcompile.jdk='c:\jenkins\workspace\Test_openjdk17_hs_extended.openjdk_x86-64_windows_testList_2\jdkbinary\j2sdk-image' \
[2024-12-05T09:43:27.070Z] -J-Dtest.timeout.factor=8.0 \
[2024-12-05T09:43:27.070Z] -J-Dtest.nativepath='c:\jenkins\workspace\Test_openjdk17_hs_extended.openjdk_x86-64_windows_testList_2\jdkbinary\openjdk-test-image\jdk\jtreg\native' \
[2024-12-05T09:43:27.070Z] -J-Dtest.root='C:\Jenkins\workspace\Test_openjdk17_hs_extended.openjdk_x86-64_windows_testList_2\aqa-tests\openjdk\openjdk-jdk\test\jdk' \
[2024-12-05T09:43:27.070Z] -J-Dtest.name=java/beans/PropertyEditor/TestColorClass.java \
[2024-12-05T09:43:27.070Z] -J-Dtest.file='C:\Jenkins\workspace\Test_openjdk17_hs_extended.openjdk_x86-64_windows_testList_2\aqa-tests\openjdk\openjdk-jdk\test\jdk\java\beans\PropertyEditor\TestColorClass.java' \
[2024-12-05T09:43:27.070Z] -J-Dtest.src='C:\Jenkins\workspace\Test_openjdk17_hs_extended.openjdk_x86-64_windows_testList_2\aqa-tests\openjdk\openjdk-jdk\test\jdk\java\beans\PropertyEditor' \
[2024-12-05T09:43:27.070Z] -J-Dtest.src.path='C:\Jenkins\workspace\Test_openjdk17_hs_extended.openjdk_x86-64_windows_testList_2\aqa-tests\openjdk\openjdk-jdk\test\jdk\java\beans\PropertyEditor' \
[2024-12-05T09:43:27.070Z] -J-Dtest.classes='C:\Jenkins\workspace\Test_openjdk17_hs_extended.openjdk_x86-64_windows_testList_2\aqa-tests\TKG\output_17333892671188\jdk_beans_0\work\classes\2\java\beans\PropertyEditor\TestColorClass.d' \
[2024-12-05T09:43:27.070Z] -J-Dtest.class.path='C:\Jenkins\workspace\Test_openjdk17_hs_extended.openjdk_x86-64_windows_testList_2\aqa-tests\TKG\output_17333892671188\jdk_beans_0\work\classes\2\java\beans\PropertyEditor\TestColorClass.d' \
[2024-12-05T09:43:27.070Z] -J-Dtest.modules='java.compiler java.desktop jdk.compiler' \
[2024-12-05T09:43:27.070Z] --add-modules java.compiler,java.desktop,jdk.compiler \
[2024-12-05T09:43:27.070Z] -d 'C:\Jenkins\workspace\Test_openjdk17_hs_extended.openjdk_x86-64_windows_testList_2\aqa-tests\TKG\output_17333892671188\jdk_beans_0\work\classes\2\java\beans\PropertyEditor\TestColorClass.d' \
[2024-12-05T09:43:27.070Z] -sourcepath 'C:\Jenkins\workspace\Test_openjdk17_hs_extended.openjdk_x86-64_windows_testList_2\aqa-tests\openjdk\openjdk-jdk\test\jdk\java\beans\PropertyEditor' \
[2024-12-05T09:43:27.070Z] -classpath 'C:\Jenkins\workspace\Test_openjdk17_hs_extended.openjdk_x86-64_windows_testList_2\aqa-tests\openjdk\openjdk-jdk\test\jdk\java\beans\PropertyEditor;C:\Jenkins\workspace\Test_openjdk17_hs_extended.openjdk_x86-64_windows_testList_2\aqa-tests\TKG\output_17333892671188\jdk_beans_0\work\classes\2\java\beans\PropertyEditor\TestColorClass.d' 'C:\Jenkins\workspace\Test_openjdk17_hs_extended.openjdk_x86-64_windows_testList_2\aqa-tests\openjdk\openjdk-jdk\test\jdk\java\beans\PropertyEditor\TestColorClass.java'
[2024-12-05T09:43:27.070Z] STDOUT:
[2024-12-05T09:43:27.070Z] STDERR:
[2024-12-05T09:43:27.070Z] C:\Jenkins\workspace\Test_openjdk17_hs_extended.openjdk_x86-64_windows_testList_2\aqa-tests\openjdk\openjdk-jdk\test\jdk\java\beans\PropertyEditor\TestColorClass.java:40: warning: [removal] SecurityManager in java.lang has been deprecated and marked for removal
[2024-12-05T09:43:27.070Z] System.setSecurityManager(new SecurityManager());
[2024-12-05T09:43:27.070Z] ^
[2024-12-05T09:43:27.070Z] C:\Jenkins\workspace\Test_openjdk17_hs_extended.openjdk_x86-64_windows_testList_2\aqa-tests\openjdk\openjdk-jdk\test\jdk\java\beans\PropertyEditor\TestColorClass.java:40: warning: [removal] setSecurityManager(SecurityManager) in System has been deprecated and marked for removal
[2024-12-05T09:43:27.070Z] System.setSecurityManager(new SecurityManager());
[2024-12-05T09:43:27.070Z] ^
[2024-12-05T09:43:27.070Z] Note: C:\Jenkins\workspace\Test_openjdk17_hs_extended.openjdk_x86-64_windows_testList_2\aqa-tests\openjdk\openjdk-jdk\test\jdk\java\beans\PropertyEditor\TestEditor.java uses unchecked or unsafe operations.
[2024-12-05T09:43:27.070Z] Note: Recompile with -Xlint:unchecked for details.
[2024-12-05T09:43:27.070Z] 2 warnings
[2024-12-05T09:43:27.070Z]
[2024-12-05T09:43:27.070Z] ACTION: main -- Failed. Execution failed: `main' threw exception: java.lang.Error: could not find editor for class java.awt.Color
[2024-12-05T09:43:27.070Z] REASON: User specified action: run main/othervm -Djava.security.manager=allow TestColorClass
[2024-12-05T09:43:27.070Z] TIME: 0.765 seconds
[2024-12-05T09:43:27.070Z] messages:
[2024-12-05T09:43:27.070Z] command: main -Djava.security.manager=allow TestColorClass
[2024-12-05T09:43:27.070Z] reason: User specified action: run main/othervm -Djava.security.manager=allow TestColorClass
[2024-12-05T09:43:27.070Z] started: Thu Dec 05 09:43:22 UTC 2024
[2024-12-05T09:43:27.070Z] Mode: othervm [/othervm specified]
[2024-12-05T09:43:27.070Z] Additional options from @modules: --add-modules java.compiler,java.desktop,jdk.compiler
[2024-12-05T09:43:27.070Z] finished: Thu Dec 05 09:43:23 UTC 2024
[2024-12-05T09:43:27.070Z] elapsed time (seconds): 0.765
[2024-12-05T09:43:27.070Z] configuration:
[2024-12-05T09:43:27.070Z] Boot Layer
[2024-12-05T09:43:27.070Z] add modules: java.compiler java.desktop jdk.compiler
[2024-12-05T09:43:27.070Z]
[2024-12-05T09:43:27.070Z] STDOUT:
[2024-12-05T09:43:27.070Z] Property class: class java.awt.Color
[2024-12-05T09:43:27.070Z] STDERR:
[2024-12-05T09:43:27.070Z] WARNING: A terminally deprecated method in java.lang.System has been called
[2024-12-05T09:43:27.070Z] WARNING: System::setSecurityManager has been called by TestColorClass (file:/C:/Jenkins/workspace/Test_openjdk17_hs_extended.openjdk_x86-64_windows_testList_2/aqa-tests/TKG/output_17333892671188/jdk_beans_0/work/classes/2/java/beans/PropertyEditor/TestColorClass.d/)
[2024-12-05T09:43:27.070Z] WARNING: Please consider reporting this to the maintainers of TestColorClass
[2024-12-05T09:43:27.070Z] WARNING: System::setSecurityManager will be removed in a future release
[2024-12-05T09:43:27.070Z] java.lang.Error: could not find editor for class java.awt.Color
[2024-12-05T09:43:27.070Z] at TestEditor.<init>(TestEditor.java:35)
[2024-12-05T09:43:27.070Z] at TestColorClass.main(TestColorClass.java:41)
[2024-12-05T09:43:27.070Z] at java.base/jdk.internal.reflect.NativeMethodAccessorImpl.invoke0(Native Method)
[2024-12-05T09:43:27.070Z] at java.base/jdk.internal.reflect.NativeMethodAccessorImpl.invoke(NativeMethodAccessorImpl.java:77)
[2024-12-05T09:43:27.070Z] at java.base/jdk.internal.reflect.DelegatingMethodAccessorImpl.invoke(DelegatingMethodAccessorImpl.java:43)
[2024-12-05T09:43:27.070Z] at java.base/java.lang.reflect.Method.invoke(Method.java:569)
[2024-12-05T09:43:27.070Z] at com.sun.javatest.regtest.agent.MainWrapper$MainTask.run(MainWrapper.java:138)
[2024-12-05T09:43:27.070Z] at java.base/java.lang.Thread.run(Thread.java:840)
[2024-12-05T09:43:27.070Z]
[2024-12-05T09:43:27.070Z] JavaTest Message: Test threw exception: java.lang.Error: could not find editor for class java.awt.Color
[2024-12-05T09:43:27.070Z] JavaTest Message: shutting down test
[2024-12-05T09:43:27.070Z]
[2024-12-05T09:43:27.070Z] STATUS:Failed.`main' threw exception: java.lang.Error: could not find editor for class java.awt.Color
[2024-12-05T09:43:27.070Z] rerun:
[2024-12-05T09:43:27.070Z] cd 'C:\Jenkins\workspace\Test_openjdk17_hs_extended.openjdk_x86-64_windows_testList_2\aqa-tests\TKG\output_17333892671188\jdk_beans_0\work\java\beans\PropertyEditor\TestColorClass' && \
[2024-12-05T09:43:27.070Z] PATH='C:\Program Files\Java\jdk-17.0.8.1+1\bin;C:\cygwin64\bin;C:\Windows\system32;C:\Windows;C:\Windows\System32\Wbem;C:\Windows\System32\WindowsPowerShell\v1.0;C:\Windows\System32\OpenSSH;C:\Program Files\dotnet;C:\Users\adoptopenjdk\AppData\Local\Microsoft\WindowsApps;C:\Strawberry\perl\bin;C:\Program Files\Git\cmd;C:\openjdk\jdk-8\bin;C:\apache-ant\apache-ant-1.10.15\bin;C:\Program Files (x86)\IncrediBuild;C:\Program Files (x86)\Windows Kits\10\Windows Performance Toolkit;C:\rust\bin;C:\Program Files\IcedTeaWEB\bin;C:\Program Files\Microsoft SQL Server\110\Tools\Binn;C:\Program Files (x86)\Microsoft SDKs\TypeScript\1.0;C:\Program Files\Microsoft SQL Server\120\Tools\Binn;C:\Users\jenkins\AppData\Local\Microsoft\WindowsApps' \
[2024-12-05T09:43:27.070Z] SystemDrive=C: \
[2024-12-05T09:43:27.070Z] SystemRoot='C:\Windows' \
[2024-12-05T09:43:27.070Z] TEMP='C:\Users\jenkins\AppData\Local\Temp\3' \
[2024-12-05T09:43:27.070Z] TMP='C:\Users\jenkins\AppData\Local\Temp\3' \
[2024-12-05T09:43:27.070Z] windir='C:\Windows' \
[2024-12-05T09:43:27.070Z] CLASSPATH='C:\Jenkins\workspace\Test_openjdk17_hs_extended.openjdk_x86-64_windows_testList_2\aqa-tests\TKG\output_17333892671188\jdk_beans_0\work\classes\2\java\beans\PropertyEditor\TestColorClass.d;C:\Jenkins\workspace\Test_openjdk17_hs_extended.openjdk_x86-64_windows_testList_2\aqa-tests\openjdk\openjdk-jdk\test\jdk\java\beans\PropertyEditor;C:\Jenkins\workspace\Test_openjdk17_hs_extended.openjdk_x86-64_windows_testList_2\jvmtest\openjdk\jtreg\lib\javatest.jar;C:\Jenkins\workspace\Test_openjdk17_hs_extended.openjdk_x86-64_windows_testList_2\jvmtest\openjdk\jtreg\lib\jtreg.jar' \
[2024-12-05T09:43:27.070Z] 'c:\jenkins\workspace\Test_openjdk17_hs_extended.openjdk_x86-64_windows_testList_2\jdkbinary\j2sdk-image\bin\java' \
[2024-12-05T09:43:27.070Z] -Dtest.vm.opts='-ea -esa -Xmx512m -XX:+UseCompressedOops' \
[2024-12-05T09:43:27.070Z] -Dtest.tool.vm.opts='-J-ea -J-esa -J-Xmx512m -J-XX:+UseCompressedOops' \
[2024-12-05T09:43:27.070Z] -Dtest.compiler.opts= \
[2024-12-05T09:43:27.070Z] -Dtest.java.opts= \
[2024-12-05T09:43:27.070Z] -Dtest.jdk='c:\jenkins\workspace\Test_openjdk17_hs_extended.openjdk_x86-64_windows_testList_2\jdkbinary\j2sdk-image' \
[2024-12-05T09:43:27.070Z] -Dcompile.jdk='c:\jenkins\workspace\Test_openjdk17_hs_extended.openjdk_x86-64_windows_testList_2\jdkbinary\j2sdk-image' \
[2024-12-05T09:43:27.070Z] -Dtest.timeout.factor=8.0 \
[2024-12-05T09:43:27.070Z] -Dtest.nativepath='c:\jenkins\workspace\Test_openjdk17_hs_extended.openjdk_x86-64_windows_testList_2\jdkbinary\openjdk-test-image\jdk\jtreg\native' \
[2024-12-05T09:43:27.070Z] -Dtest.root='C:\Jenkins\workspace\Test_openjdk17_hs_extended.openjdk_x86-64_windows_testList_2\aqa-tests\openjdk\openjdk-jdk\test\jdk' \
[2024-12-05T09:43:27.070Z] -Dtest.name=java/beans/PropertyEditor/TestColorClass.java \
[2024-12-05T09:43:27.070Z] -Dtest.file='C:\Jenkins\workspace\Test_openjdk17_hs_extended.openjdk_x86-64_windows_testList_2\aqa-tests\openjdk\openjdk-jdk\test\jdk\java\beans\PropertyEditor\TestColorClass.java' \
[2024-12-05T09:43:27.070Z] -Dtest.src='C:\Jenkins\workspace\Test_openjdk17_hs_extended.openjdk_x86-64_windows_testList_2\aqa-tests\openjdk\openjdk-jdk\test\jdk\java\beans\PropertyEditor' \
[2024-12-05T09:43:27.070Z] -Dtest.src.path='C:\Jenkins\workspace\Test_openjdk17_hs_extended.openjdk_x86-64_windows_testList_2\aqa-tests\openjdk\openjdk-jdk\test\jdk\java\beans\PropertyEditor' \
[2024-12-05T09:43:27.070Z] -Dtest.classes='C:\Jenkins\workspace\Test_openjdk17_hs_extended.openjdk_x86-64_windows_testList_2\aqa-tests\TKG\output_17333892671188\jdk_beans_0\work\classes\2\java\beans\PropertyEditor\TestColorClass.d' \
[2024-12-05T09:43:27.070Z] -Dtest.class.path='C:\Jenkins\workspace\Test_openjdk17_hs_extended.openjdk_x86-64_windows_testList_2\aqa-tests\TKG\output_17333892671188\jdk_beans_0\work\classes\2\java\beans\PropertyEditor\TestColorClass.d' \
[2024-12-05T09:43:27.070Z] -Dtest.modules='java.compiler java.desktop jdk.compiler' \
[2024-12-05T09:43:27.070Z] --add-modules java.compiler,java.desktop,jdk.compiler \
[2024-12-05T09:43:27.070Z] -ea \
[2024-12-05T09:43:27.070Z] -esa \
[2024-12-05T09:43:27.070Z] -Xmx512m \
[2024-12-05T09:43:27.070Z] -XX:+UseCompressedOops \
[2024-12-05T09:43:27.070Z] '-Djava.library.path=c:\jenkins\workspace\Test_openjdk17_hs_extended.openjdk_x86-64_windows_testList_2\jdkbinary\openjdk-test-image\jdk\jtreg\native' \
[2024-12-05T09:43:27.070Z] -Djava.security.manager=allow \
[2024-12-05T09:43:27.070Z] com.sun.javatest.regtest.agent.MainWrapper 'C:\Jenkins\workspace\Test_openjdk17_hs_extended.openjdk_x86-64_windows_testList_2\aqa-tests\TKG\output_17333892671188\jdk_beans_0\work\java\beans\PropertyEditor\TestColorClass.d\main.0.jta'
[2024-12-05T09:43:27.070Z]
[2024-12-05T09:43:27.070Z] TEST RESULT: Failed. Execution failed: `main' threw exception: java.lang.Error: could not find editor for class java.awt.Color
[2024-12-05T09:43:27.070Z] --------------------------------------------------
[2024-12-05T09:43:27.070Z] TEST: java/beans/PropertyEditor/TestColorClassJava.java
[2024-12-05T09:43:27.070Z] TEST JDK: c:\jenkins\workspace\Test_openjdk17_hs_extended.openjdk_x86-64_windows_testList_2\jdkbinary\j2sdk-image
[2024-12-05T09:43:27.070Z]
[2024-12-05T09:43:27.070Z] ACTION: build -- Passed. Build successful
[2024-12-05T09:43:27.070Z] REASON: Named class compiled on demand
[2024-12-05T09:43:27.070Z] TIME: 2.56 seconds
[2024-12-05T09:43:27.070Z] messages:
[2024-12-05T09:43:27.070Z] command: build TestColorClassJava
[2024-12-05T09:43:27.070Z] reason: Named class compiled on demand
[2024-12-05T09:43:27.070Z] started: Thu Dec 05 09:43:20 UTC 2024
[2024-12-05T09:43:27.070Z] Test directory:
[2024-12-05T09:43:27.070Z] compile: TestColorClassJava
[2024-12-05T09:43:27.070Z] finished: Thu Dec 05 09:43:22 UTC 2024
[2024-12-05T09:43:27.070Z] elapsed time (seconds): 2.56
[2024-12-05T09:43:27.070Z]
[2024-12-05T09:43:27.070Z] ACTION: compile -- Passed. Compilation successful
[2024-12-05T09:43:27.070Z] REASON: .class file out of date or does not exist
[2024-12-05T09:43:27.070Z] TIME: 2.558 seconds
[2024-12-05T09:43:27.070Z] messages:
[2024-12-05T09:43:27.070Z] command: compile C:\Jenkins\workspace\Test_openjdk17_hs_extended.openjdk_x86-64_windows_testList_2\aqa-tests\openjdk\openjdk-jdk\test\jdk\java\beans\PropertyEditor\TestColorClassJava.java
[2024-12-05T09:43:27.070Z] reason: .class file out of date or does not exist
[2024-12-05T09:43:27.070Z] started: Thu Dec 05 09:43:20 UTC 2024
[2024-12-05T09:43:27.070Z] Additional options from @modules: --add-modules java.compiler,java.desktop,jdk.compiler
[2024-12-05T09:43:27.070Z] Mode: othervm
[2024-12-05T09:43:27.070Z] finished: Thu Dec 05 09:43:22 UTC 2024
[2024-12-05T09:43:27.070Z] elapsed time (seconds): 2.558
[2024-12-05T09:43:27.070Z] configuration:
[2024-12-05T09:43:27.070Z] javac compilation environment
[2024-12-05T09:43:27.070Z] add modules: java.compiler java.desktop jdk.compiler
[2024-12-05T09:43:27.070Z] source path: C:\Jenkins\workspace\Test_openjdk17_hs_extended.openjdk_x86-64_windows_testList_2\aqa-tests\openjdk\openjdk-jdk\test\jdk\java\beans\PropertyEditor
[2024-12-05T09:43:27.070Z] class path: C:\Jenkins\workspace\Test_openjdk17_hs_extended.openjdk_x86-64_windows_testList_2\aqa-tests\openjdk\openjdk-jdk\test\jdk\java\beans\PropertyEditor
[2024-12-05T09:43:27.070Z] C:\Jenkins\workspace\Test_openjdk17_hs_extended.openjdk_x86-64_windows_testList_2\aqa-tests\TKG\output_17333892671188\jdk_beans_0\work\classes\0\java\beans\PropertyEditor\TestColorClassJava.d
[2024-12-05T09:43:27.070Z]
[2024-12-05T09:43:27.070Z] rerun:
[2024-12-05T09:43:27.070Z] cd 'C:\Jenkins\workspace\Test_openjdk17_hs_extended.openjdk_x86-64_windows_testList_2\aqa-tests\TKG\output_17333892671188\jdk_beans_0\work\java\beans\PropertyEditor\TestColorClassJava' && \
[2024-12-05T09:43:27.070Z] PATH='C:\Program Files\Java\jdk-17.0.8.1+1\bin;C:\cygwin64\bin;C:\Windows\system32;C:\Windows;C:\Windows\System32\Wbem;C:\Windows\System32\WindowsPowerShell\v1.0;C:\Windows\System32\OpenSSH;C:\Program Files\dotnet;C:\Users\adoptopenjdk\AppData\Local\Microsoft\WindowsApps;C:\Strawberry\perl\bin;C:\Program Files\Git\cmd;C:\openjdk\jdk-8\bin;C:\apache-ant\apache-ant-1.10.15\bin;C:\Program Files (x86)\IncrediBuild;C:\Program Files (x86)\Windows Kits\10\Windows Performance Toolkit;C:\rust\bin;C:\Program Files\IcedTeaWEB\bin;C:\Program Files\Microsoft SQL Server\110\Tools\Binn;C:\Program Files (x86)\Microsoft SDKs\TypeScript\1.0;C:\Program Files\Microsoft SQL Server\120\Tools\Binn;C:\Users\jenkins\AppData\Local\Microsoft\WindowsApps' \
[2024-12-05T09:43:27.070Z] SystemDrive=C: \
[2024-12-05T09:43:27.070Z] SystemRoot='C:\Windows' \
[2024-12-05T09:43:27.070Z] TEMP='C:\Users\jenkins\AppData\Local\Temp\3' \
[2024-12-05T09:43:27.070Z] TMP='C:\Users\jenkins\AppData\Local\Temp\3' \
[2024-12-05T09:43:27.070Z] windir='C:\Windows' \
[2024-12-05T09:43:27.070Z] 'c:\jenkins\workspace\Test_openjdk17_hs_extended.openjdk_x86-64_windows_testList_2\jdkbinary\j2sdk-image\bin\javac' \
[2024-12-05T09:43:27.070Z] -J-ea \
[2024-12-05T09:43:27.070Z] -J-esa \
[2024-12-05T09:43:27.070Z] -J-Xmx512m \
[2024-12-05T09:43:27.070Z] -J-XX:+UseCompressedOops \
[2024-12-05T09:43:27.070Z] -J-Dtest.vm.opts='-ea -esa -Xmx512m -XX:+UseCompressedOops' \
[2024-12-05T09:43:27.070Z] -J-Dtest.tool.vm.opts='-J-ea -J-esa -J-Xmx512m -J-XX:+UseCompressedOops' \
[2024-12-05T09:43:27.070Z] -J-Dtest.compiler.opts= \
[2024-12-05T09:43:27.070Z] -J-Dtest.java.opts= \
[2024-12-05T09:43:27.070Z] -J-Dtest.jdk='c:\jenkins\workspace\Test_openjdk17_hs_extended.openjdk_x86-64_windows_testList_2\jdkbinary\j2sdk-image' \
[2024-12-05T09:43:27.070Z] -J-Dcompile.jdk='c:\jenkins\workspace\Test_openjdk17_hs_extended.openjdk_x86-64_windows_testList_2\jdkbinary\j2sdk-image' \
[2024-12-05T09:43:27.070Z] -J-Dtest.timeout.factor=8.0 \
[2024-12-05T09:43:27.071Z] -J-Dtest.nativepath='c:\jenkins\workspace\Test_openjdk17_hs_extended.openjdk_x86-64_windows_testList_2\jdkbinary\openjdk-test-image\jdk\jtreg\native' \
[2024-12-05T09:43:27.071Z] -J-Dtest.root='C:\Jenkins\workspace\Test_openjdk17_hs_extended.openjdk_x86-64_windows_testList_2\aqa-tests\openjdk\openjdk-jdk\test\jdk' \
[2024-12-05T09:43:27.071Z] -J-Dtest.name=java/beans/PropertyEditor/TestColorClassJava.java \
[2024-12-05T09:43:27.071Z] -J-Dtest.file='C:\Jenkins\workspace\Test_openjdk17_hs_extended.openjdk_x86-64_windows_testList_2\aqa-tests\openjdk\openjdk-jdk\test\jdk\java\beans\PropertyEditor\TestColorClassJava.java' \
[2024-12-05T09:43:27.071Z] -J-Dtest.src='C:\Jenkins\workspace\Test_openjdk17_hs_extended.openjdk_x86-64_windows_testList_2\aqa-tests\openjdk\openjdk-jdk\test\jdk\java\beans\PropertyEditor' \
[2024-12-05T09:43:27.071Z] -J-Dtest.src.path='C:\Jenkins\workspace\Test_openjdk17_hs_extended.openjdk_x86-64_windows_testList_2\aqa-tests\openjdk\openjdk-jdk\test\jdk\java\beans\PropertyEditor' \
[2024-12-05T09:43:27.071Z] -J-Dtest.classes='C:\Jenkins\workspace\Test_openjdk17_hs_extended.openjdk_x86-64_windows_testList_2\aqa-tests\TKG\output_17333892671188\jdk_beans_0\work\classes\0\java\beans\PropertyEditor\TestColorClassJava.d' \
[2024-12-05T09:43:27.071Z] -J-Dtest.class.path='C:\Jenkins\workspace\Test_openjdk17_hs_extended.openjdk_x86-64_windows_testList_2\aqa-tests\TKG\output_17333892671188\jdk_beans_0\work\classes\0\java\beans\PropertyEditor\TestColorClassJava.d' \
[2024-12-05T09:43:27.071Z] -J-Dtest.modules='java.compiler java.desktop jdk.compiler' \
[2024-12-05T09:43:27.071Z] --add-modules java.compiler,java.desktop,jdk.compiler \
[2024-12-05T09:43:27.071Z] -d 'C:\Jenkins\workspace\Test_openjdk17_hs_extended.openjdk_x86-64_windows_testList_2\aqa-tests\TKG\output_17333892671188\jdk_beans_0\work\classes\0\java\beans\PropertyEditor\TestColorClassJava.d' \
[2024-12-05T09:43:27.071Z] -sourcepath 'C:\Jenkins\workspace\Test_openjdk17_hs_extended.openjdk_x86-64_windows_testList_2\aqa-tests\openjdk\openjdk-jdk\test\jdk\java\beans\PropertyEditor' \
[2024-12-05T09:43:27.071Z] -classpath 'C:\Jenkins\workspace\Test_openjdk17_hs_extended.openjdk_x86-64_windows_testList_2\aqa-tests\openjdk\openjdk-jdk\test\jdk\java\beans\PropertyEditor;C:\Jenkins\workspace\Test_openjdk17_hs_extended.openjdk_x86-64_windows_testList_2\aqa-tests\TKG\output_17333892671188\jdk_beans_0\work\classes\0\java\beans\PropertyEditor\TestColorClassJava.d' 'C:\Jenkins\workspace\Test_openjdk17_hs_extended.openjdk_x86-64_windows_testList_2\aqa-tests\openjdk\openjdk-jdk\test\jdk\java\beans\PropertyEditor\TestColorClassJava.java'
[2024-12-05T09:43:27.071Z] STDOUT:
[2024-12-05T09:43:27.071Z] STDERR:
[2024-12-05T09:43:27.071Z] Note: C:\Jenkins\workspace\Test_openjdk17_hs_extended.openjdk_x86-64_windows_testList_2\aqa-tests\openjdk\openjdk-jdk\test\jdk\java\beans\PropertyEditor\TestEditor.java uses unchecked or unsafe operations.
[2024-12-05T09:43:27.071Z] Note: Recompile with -Xlint:unchecked for details.
[2024-12-05T09:43:27.071Z]
[2024-12-05T09:43:27.071Z] ACTION: main -- Failed. Execution failed: `main' threw exception: java.lang.Error: could not find editor for class java.awt.Color
[2024-12-05T09:43:27.071Z] REASON: Assumed action based on file name: run main TestColorClassJava
[2024-12-05T09:43:27.071Z] TIME: 0.76 seconds
[2024-12-05T09:43:27.071Z] messages:
[2024-12-05T09:43:27.071Z] command: main TestColorClassJava
[2024-12-05T09:43:27.071Z] reason: Assumed action based on file name: run main TestColorClassJava
[2024-12-05T09:43:27.071Z] started: Thu Dec 05 09:43:22 UTC 2024
[2024-12-05T09:43:27.071Z] Mode: othervm
[2024-12-05T09:43:27.071Z] Additional options from @modules: --add-modules java.compiler,java.desktop,jdk.compiler
[2024-12-05T09:43:27.071Z] finished: Thu Dec 05 09:43:23 UTC 2024
[2024-12-05T09:43:27.071Z] elapsed time (seconds): 0.76
[2024-12-05T09:43:27.071Z] configuration:
[2024-12-05T09:43:27.071Z] Boot Layer
[2024-12-05T09:43:27.071Z] add modules: java.compiler java.desktop jdk.compiler
[2024-12-05T09:43:27.071Z]
[2024-12-05T09:43:27.071Z] STDOUT:
[2024-12-05T09:43:27.071Z] Property class: class java.awt.Color
[2024-12-05T09:43:27.071Z] STDERR:
[2024-12-05T09:43:27.071Z] java.lang.Error: could not find editor for class java.awt.Color
[2024-12-05T09:43:27.071Z] at TestEditor.<init>(TestEditor.java:35)
[2024-12-05T09:43:27.071Z] at TestColorClassJava.main(TestColorClassJava.java:39)
[2024-12-05T09:43:27.071Z] at java.base/jdk.internal.reflect.NativeMethodAccessorImpl.invoke0(Native Method)
[2024-12-05T09:43:27.071Z] at java.base/jdk.internal.reflect.NativeMethodAccessorImpl.invoke(NativeMethodAccessorImpl.java:77)
[2024-12-05T09:43:27.071Z] at java.base/jdk.internal.reflect.DelegatingMethodAccessorImpl.invoke(DelegatingMethodAccessorImpl.java:43)
[2024-12-05T09:43:27.071Z] at java.base/java.lang.reflect.Method.invoke(Method.java:569)
[2024-12-05T09:43:27.071Z] at com.sun.javatest.regtest.agent.MainWrapper$MainTask.run(MainWrapper.java:138)
[2024-12-05T09:43:27.071Z] at java.base/java.lang.Thread.run(Thread.java:840)
[2024-12-05T09:43:27.071Z]
[2024-12-05T09:43:27.071Z] JavaTest Message: Test threw exception: java.lang.Error: could not find editor for class java.awt.Color
[2024-12-05T09:43:27.071Z] JavaTest Message: shutting down test
[2024-12-05T09:43:27.071Z]
[2024-12-05T09:43:27.071Z] STATUS:Failed.`main' threw exception: java.lang.Error: could not find editor for class java.awt.Color
[2024-12-05T09:43:27.071Z] rerun:
[2024-12-05T09:43:27.071Z] cd 'C:\Jenkins\workspace\Test_openjdk17_hs_extended.openjdk_x86-64_windows_testList_2\aqa-tests\TKG\output_17333892671188\jdk_beans_0\work\java\beans\PropertyEditor\TestColorClassJava' && \
[2024-12-05T09:43:27.071Z] PATH='C:\Program Files\Java\jdk-17.0.8.1+1\bin;C:\cygwin64\bin;C:\Windows\system32;C:\Windows;C:\Windows\System32\Wbem;C:\Windows\System32\WindowsPowerShell\v1.0;C:\Windows\System32\OpenSSH;C:\Program Files\dotnet;C:\Users\adoptopenjdk\AppData\Local\Microsoft\WindowsApps;C:\Strawberry\perl\bin;C:\Program Files\Git\cmd;C:\openjdk\jdk-8\bin;C:\apache-ant\apache-ant-1.10.15\bin;C:\Program Files (x86)\IncrediBuild;C:\Program Files (x86)\Windows Kits\10\Windows Performance Toolkit;C:\rust\bin;C:\Program Files\IcedTeaWEB\bin;C:\Program Files\Microsoft SQL Server\110\Tools\Binn;C:\Program Files (x86)\Microsoft SDKs\TypeScript\1.0;C:\Program Files\Microsoft SQL Server\120\Tools\Binn;C:\Users\jenkins\AppData\Local\Microsoft\WindowsApps' \
[2024-12-05T09:43:27.071Z] SystemDrive=C: \
[2024-12-05T09:43:27.071Z] SystemRoot='C:\Windows' \
[2024-12-05T09:43:27.071Z] TEMP='C:\Users\jenkins\AppData\Local\Temp\3' \
[2024-12-05T09:43:27.071Z] TMP='C:\Users\jenkins\AppData\Local\Temp\3' \
[2024-12-05T09:43:27.071Z] windir='C:\Windows' \
[2024-12-05T09:43:27.071Z] CLASSPATH='C:\Jenkins\workspace\Test_openjdk17_hs_extended.openjdk_x86-64_windows_testList_2\aqa-tests\TKG\output_17333892671188\jdk_beans_0\work\classes\0\java\beans\PropertyEditor\TestColorClassJava.d;C:\Jenkins\workspace\Test_openjdk17_hs_extended.openjdk_x86-64_windows_testList_2\aqa-tests\openjdk\openjdk-jdk\test\jdk\java\beans\PropertyEditor;C:\Jenkins\workspace\Test_openjdk17_hs_extended.openjdk_x86-64_windows_testList_2\jvmtest\openjdk\jtreg\lib\javatest.jar;C:\Jenkins\workspace\Test_openjdk17_hs_extended.openjdk_x86-64_windows_testList_2\jvmtest\openjdk\jtreg\lib\jtreg.jar' \
[2024-12-05T09:43:27.071Z] 'c:\jenkins\workspace\Test_openjdk17_hs_extended.openjdk_x86-64_windows_testList_2\jdkbinary\j2sdk-image\bin\java' \
[2024-12-05T09:43:27.071Z] -Dtest.vm.opts='-ea -esa -Xmx512m -XX:+UseCompressedOops' \
[2024-12-05T09:43:27.071Z] -Dtest.tool.vm.opts='-J-ea -J-esa -J-Xmx512m -J-XX:+UseCompressedOops' \
[2024-12-05T09:43:27.071Z] -Dtest.compiler.opts= \
[2024-12-05T09:43:27.071Z] -Dtest.java.opts= \
[2024-12-05T09:43:27.071Z] -Dtest.jdk='c:\jenkins\workspace\Test_openjdk17_hs_extended.openjdk_x86-64_windows_testList_2\jdkbinary\j2sdk-image' \
[2024-12-05T09:43:27.071Z] -Dcompile.jdk='c:\jenkins\workspace\Test_openjdk17_hs_extended.openjdk_x86-64_windows_testList_2\jdkbinary\j2sdk-image' \
[2024-12-05T09:43:27.071Z] -Dtest.timeout.factor=8.0 \
[2024-12-05T09:43:27.071Z] -Dtest.nativepath='c:\jenkins\workspace\Test_openjdk17_hs_extended.openjdk_x86-64_windows_testList_2\jdkbinary\openjdk-test-image\jdk\jtreg\native' \
[2024-12-05T09:43:27.071Z] -Dtest.root='C:\Jenkins\workspace\Test_openjdk17_hs_extended.openjdk_x86-64_windows_testList_2\aqa-tests\openjdk\openjdk-jdk\test\jdk' \
[2024-12-05T09:43:27.071Z] -Dtest.name=java/beans/PropertyEditor/TestColorClassJava.java \
[2024-12-05T09:43:27.071Z] -Dtest.file='C:\Jenkins\workspace\Test_openjdk17_hs_extended.openjdk_x86-64_windows_testList_2\aqa-tests\openjdk\openjdk-jdk\test\jdk\java\beans\PropertyEditor\TestColorClassJava.java' \
[2024-12-05T09:43:27.071Z] -Dtest.src='C:\Jenkins\workspace\Test_openjdk17_hs_extended.openjdk_x86-64_windows_testList_2\aqa-tests\openjdk\openjdk-jdk\test\jdk\java\beans\PropertyEditor' \
[2024-12-05T09:43:27.071Z] -Dtest.src.path='C:\Jenkins\workspace\Test_openjdk17_hs_extended.openjdk_x86-64_windows_testList_2\aqa-tests\openjdk\openjdk-jdk\test\jdk\java\beans\PropertyEditor' \
[2024-12-05T09:43:27.071Z] -Dtest.classes='C:\Jenkins\workspace\Test_openjdk17_hs_extended.openjdk_x86-64_windows_testList_2\aqa-tests\TKG\output_17333892671188\jdk_beans_0\work\classes\0\java\beans\PropertyEditor\TestColorClassJava.d' \
[2024-12-05T09:43:27.071Z] -Dtest.class.path='C:\Jenkins\workspace\Test_openjdk17_hs_extended.openjdk_x86-64_windows_testList_2\aqa-tests\TKG\output_17333892671188\jdk_beans_0\work\classes\0\java\beans\PropertyEditor\TestColorClassJava.d' \
[2024-12-05T09:43:27.071Z] -Dtest.modules='java.compiler java.desktop jdk.compiler' \
[2024-12-05T09:43:27.071Z] --add-modules java.compiler,java.desktop,jdk.compiler \
[2024-12-05T09:43:27.071Z] -ea \
[2024-12-05T09:43:27.071Z] -esa \
[2024-12-05T09:43:27.071Z] -Xmx512m \
[2024-12-05T09:43:27.071Z] -XX:+UseCompressedOops \
[2024-12-05T09:43:27.071Z] '-Djava.library.path=c:\jenkins\workspace\Test_openjdk17_hs_extended.openjdk_x86-64_windows_testList_2\jdkbinary\openjdk-test-image\jdk\jtreg\native' \
[2024-12-05T09:43:27.071Z] com.sun.javatest.regtest.agent.MainWrapper 'C:\Jenkins\workspace\Test_openjdk17_hs_extended.openjdk_x86-64_windows_testList_2\aqa-tests\TKG\output_17333892671188\jdk_beans_0\work\java\beans\PropertyEditor\TestColorClassJava.d\main.0.jta'
[2024-12-05T09:43:27.071Z]
[2024-12-05T09:43:27.071Z] TEST RESULT: Failed. Execution failed: `main' threw exception: java.lang.Error: could not find editor for class java.awt.Color
[2024-12-05T09:43:27.071Z] --------------------------------------------------
[2024-12-05T09:43:27.071Z] TEST: java/beans/PropertyEditor/TestColorClassNull.java
[2024-12-05T09:43:27.071Z] TEST JDK: c:\jenkins\workspace\Test_openjdk17_hs_extended.openjdk_x86-64_windows_testList_2\jdkbinary\j2sdk-image
[2024-12-05T09:43:27.071Z]
[2024-12-05T09:43:27.071Z] ACTION: build -- Passed. Build successful
[2024-12-05T09:43:27.071Z] REASON: Named class compiled on demand
[2024-12-05T09:43:27.071Z] TIME: 2.769 seconds
[2024-12-05T09:43:27.071Z] messages:
[2024-12-05T09:43:27.071Z] command: build TestColorClassNull
[2024-12-05T09:43:27.071Z] reason: Named class compiled on demand
[2024-12-05T09:43:27.071Z] started: Thu Dec 05 09:43:20 UTC 2024
[2024-12-05T09:43:27.071Z] Test directory:
[2024-12-05T09:43:27.071Z] compile: TestColorClassNull
[2024-12-05T09:43:27.071Z] finished: Thu Dec 05 09:43:23 UTC 2024
[2024-12-05T09:43:27.071Z] elapsed time (seconds): 2.769
[2024-12-05T09:43:27.071Z]
[2024-12-05T09:43:27.071Z] ACTION: compile -- Passed. Compilation successful
[2024-12-05T09:43:27.071Z] REASON: .class file out of date or does not exist
[2024-12-05T09:43:27.071Z] TIME: 2.768 seconds
[2024-12-05T09:43:27.071Z] messages:
[2024-12-05T09:43:27.071Z] command: compile C:\Jenkins\workspace\Test_openjdk17_hs_extended.openjdk_x86-64_windows_testList_2\aqa-tests\openjdk\openjdk-jdk\test\jdk\java\beans\PropertyEditor\TestColorClassNull.java
[2024-12-05T09:43:27.071Z] reason: .class file out of date or does not exist
[2024-12-05T09:43:27.071Z] started: Thu Dec 05 09:43:20 UTC 2024
[2024-12-05T09:43:27.071Z] Additional options from @modules: --add-modules java.compiler,java.desktop,jdk.compiler
[2024-12-05T09:43:27.071Z] Mode: othervm
[2024-12-05T09:43:27.071Z] finished: Thu Dec 05 09:43:23 UTC 2024
[2024-12-05T09:43:27.071Z] elapsed time (seconds): 2.768
[2024-12-05T09:43:27.071Z] configuration:
[2024-12-05T09:43:27.071Z] javac compilation environment
[2024-12-05T09:43:27.071Z] add modules: java.compiler java.desktop jdk.compiler
[2024-12-05T09:43:27.071Z] source path: C:\Jenkins\workspace\Test_openjdk17_hs_extended.openjdk_x86-64_windows_testList_2\aqa-tests\openjdk\openjdk-jdk\test\jdk\java\beans\PropertyEditor
[2024-12-05T09:43:27.071Z] class path: C:\Jenkins\workspace\Test_openjdk17_hs_extended.openjdk_x86-64_windows_testList_2\aqa-tests\openjdk\openjdk-jdk\test\jdk\java\beans\PropertyEditor
[2024-12-05T09:43:27.071Z] C:\Jenkins\workspace\Test_openjdk17_hs_extended.openjdk_x86-64_windows_testList_2\aqa-tests\TKG\output_17333892671188\jdk_beans_0\work\classes\1\java\beans\PropertyEditor\TestColorClassNull.d
[2024-12-05T09:43:27.071Z]
[2024-12-05T09:43:27.071Z] rerun:
[2024-12-05T09:43:27.071Z] cd 'C:\Jenkins\workspace\Test_openjdk17_hs_extended.openjdk_x86-64_windows_testList_2\aqa-tests\TKG\output_17333892671188\jdk_beans_0\work\java\beans\PropertyEditor\TestColorClassNull' && \
[2024-12-05T09:43:27.071Z] PATH='C:\Program Files\Java\jdk-17.0.8.1+1\bin;C:\cygwin64\bin;C:\Windows\system32;C:\Windows;C:\Windows\System32\Wbem;C:\Windows\System32\WindowsPowerShell\v1.0;C:\Windows\System32\OpenSSH;C:\Program Files\dotnet;C:\Users\adoptopenjdk\AppData\Local\Microsoft\WindowsApps;C:\Strawberry\perl\bin;C:\Program Files\Git\cmd;C:\openjdk\jdk-8\bin;C:\apache-ant\apache-ant-1.10.15\bin;C:\Program Files (x86)\IncrediBuild;C:\Program Files (x86)\Windows Kits\10\Windows Performance Toolkit;C:\rust\bin;C:\Program Files\IcedTeaWEB\bin;C:\Program Files\Microsoft SQL Server\110\Tools\Binn;C:\Program Files (x86)\Microsoft SDKs\TypeScript\1.0;C:\Program Files\Microsoft SQL Server\120\Tools\Binn;C:\Users\jenkins\AppData\Local\Microsoft\WindowsApps' \
[2024-12-05T09:43:27.071Z] SystemDrive=C: \
[2024-12-05T09:43:27.071Z] SystemRoot='C:\Windows' \
[2024-12-05T09:43:27.071Z] TEMP='C:\Users\jenkins\AppData\Local\Temp\3' \
[2024-12-05T09:43:27.071Z] TMP='C:\Users\jenkins\AppData\Local\Temp\3' \
[2024-12-05T09:43:27.071Z] windir='C:\Windows' \
[2024-12-05T09:43:27.071Z] 'c:\jenkins\workspace\Test_openjdk17_hs_extended.openjdk_x86-64_windows_testList_2\jdkbinary\j2sdk-image\bin\javac' \
[2024-12-05T09:43:27.071Z] -J-ea \
[2024-12-05T09:43:27.071Z] -J-esa \
[2024-12-05T09:43:27.071Z] -J-Xmx512m \
[2024-12-05T09:43:27.071Z] -J-XX:+UseCompressedOops \
[2024-12-05T09:43:27.071Z] -J-Dtest.vm.opts='-ea -esa -Xmx512m -XX:+UseCompressedOops' \
[2024-12-05T09:43:27.071Z] -J-Dtest.tool.vm.opts='-J-ea -J-esa -J-Xmx512m -J-XX:+UseCompressedOops' \
[2024-12-05T09:43:27.071Z] -J-Dtest.compiler.opts= \
[2024-12-05T09:43:27.071Z] -J-Dtest.java.opts= \
[2024-12-05T09:43:27.071Z] -J-Dtest.jdk='c:\jenkins\workspace\Test_openjdk17_hs_extended.openjdk_x86-64_windows_testList_2\jdkbinary\j2sdk-image' \
[2024-12-05T09:43:27.071Z] -J-Dcompile.jdk='c:\jenkins\workspace\Test_openjdk17_hs_extended.openjdk_x86-64_windows_testList_2\jdkbinary\j2sdk-image' \
[2024-12-05T09:43:27.071Z] -J-Dtest.timeout.factor=8.0 \
[2024-12-05T09:43:27.071Z] -J-Dtest.nativepath='c:\jenkins\workspace\Test_openjdk17_hs_extended.openjdk_x86-64_windows_testList_2\jdkbinary\openjdk-test-image\jdk\jtreg\native' \
[2024-12-05T09:43:27.071Z] -J-Dtest.root='C:\Jenkins\workspace\Test_openjdk17_hs_extended.openjdk_x86-64_windows_testList_2\aqa-tests\openjdk\openjdk-jdk\test\jdk' \
[2024-12-05T09:43:27.071Z] -J-Dtest.name=java/beans/PropertyEditor/TestColorClassNull.java \
[2024-12-05T09:43:27.071Z] -J-Dtest.file='C:\Jenkins\workspace\Test_openjdk17_hs_extended.openjdk_x86-64_windows_testList_2\aqa-tests\openjdk\openjdk-jdk\test\jdk\java\beans\PropertyEditor\TestColorClassNull.java' \
[2024-12-05T09:43:27.071Z] -J-Dtest.src='C:\Jenkins\workspace\Test_openjdk17_hs_extended.openjdk_x86-64_windows_testList_2\aqa-tests\openjdk\openjdk-jdk\test\jdk\java\beans\PropertyEditor' \
[2024-12-05T09:43:27.071Z] -J-Dtest.src.path='C:\Jenkins\workspace\Test_openjdk17_hs_extended.openjdk_x86-64_windows_testList_2\aqa-tests\openjdk\openjdk-jdk\test\jdk\java\beans\PropertyEditor' \
[2024-12-05T09:43:27.071Z] -J-Dtest.classes='C:\Jenkins\workspace\Test_openjdk17_hs_extended.openjdk_x86-64_windows_testList_2\aqa-tests\TKG\output_17333892671188\jdk_beans_0\work\classes\1\java\beans\PropertyEditor\TestColorClassNull.d' \
[2024-12-05T09:43:27.071Z] -J-Dtest.class.path='C:\Jenkins\workspace\Test_openjdk17_hs_extended.openjdk_x86-64_windows_testList_2\aqa-tests\TKG\output_17333892671188\jdk_beans_0\work\classes\1\java\beans\PropertyEditor\TestColorClassNull.d' \
[2024-12-05T09:43:27.071Z] -J-Dtest.modules='java.compiler java.desktop jdk.compiler' \
[2024-12-05T09:43:27.071Z] --add-modules java.compiler,java.desktop,jdk.compiler \
[2024-12-05T09:43:27.071Z] -d 'C:\Jenkins\workspace\Test_openjdk17_hs_extended.openjdk_x86-64_windows_testList_2\aqa-tests\TKG\output_17333892671188\jdk_beans_0\work\classes\1\java\beans\PropertyEditor\TestColorClassNull.d' \
[2024-12-05T09:43:27.071Z] -sourcepath 'C:\Jenkins\workspace\Test_openjdk17_hs_extended.openjdk_x86-64_windows_testList_2\aqa-tests\openjdk\openjdk-jdk\test\jdk\java\beans\PropertyEditor' \
[2024-12-05T09:43:27.071Z] -classpath 'C:\Jenkins\workspace\Test_openjdk17_hs_extended.openjdk_x86-64_windows_testList_2\aqa-tests\openjdk\openjdk-jdk\test\jdk\java\beans\PropertyEditor;C:\Jenkins\workspace\Test_openjdk17_hs_extended.openjdk_x86-64_windows_testList_2\aqa-tests\TKG\output_17333892671188\jdk_beans_0\work\classes\1\java\beans\PropertyEditor\TestColorClassNull.d' 'C:\Jenkins\workspace\Test_openjdk17_hs_extended.openjdk_x86-64_windows_testList_2\aqa-tests\openjdk\openjdk-jdk\test\jdk\java\beans\PropertyEditor\TestColorClassNull.java'
[2024-12-05T09:43:27.071Z] STDOUT:
[2024-12-05T09:43:27.071Z] STDERR:
[2024-12-05T09:43:27.071Z] Note: C:\Jenkins\workspace\Test_openjdk17_hs_extended.openjdk_x86-64_windows_testList_2\aqa-tests\openjdk\openjdk-jdk\test\jdk\java\beans\PropertyEditor\TestEditor.java uses unchecked or unsafe operations.
[2024-12-05T09:43:27.071Z] Note: Recompile with -Xlint:unchecked for details.
[2024-12-05T09:43:27.071Z]
[2024-12-05T09:43:27.071Z] ACTION: main -- Failed. Execution failed: `main' threw exception: java.lang.Error: could not find editor for class java.awt.Color
[2024-12-05T09:43:27.071Z] REASON: Assumed action based on file name: run main TestColorClassNull
[2024-12-05T09:43:27.071Z] TIME: 0.471 seconds
[2024-12-05T09:43:27.071Z] messages:
[2024-12-05T09:43:27.071Z] command: main TestColorClassNull
[2024-12-05T09:43:27.071Z] reason: Assumed action based on file name: run main TestColorClassNull
[2024-12-05T09:43:27.071Z] started: Thu Dec 05 09:43:23 UTC 2024
[2024-12-05T09:43:27.071Z] Mode: othervm
[2024-12-05T09:43:27.071Z] Additional options from @modules: --add-modules java.compiler,java.desktop,jdk.compiler
[2024-12-05T09:43:27.071Z] finished: Thu Dec 05 09:43:23 UTC 2024
[2024-12-05T09:43:27.071Z] elapsed time (seconds): 0.471
[2024-12-05T09:43:27.071Z] configuration:
[2024-12-05T09:43:27.071Z] Boot Layer
[2024-12-05T09:43:27.071Z] add modules: java.compiler java.desktop jdk.compiler
[2024-12-05T09:43:27.071Z]
[2024-12-05T09:43:27.071Z] STDOUT:
[2024-12-05T09:43:27.071Z] Property class: class java.awt.Color
[2024-12-05T09:43:27.071Z] STDERR:
[2024-12-05T09:43:27.071Z] java.lang.Error: could not find editor for class java.awt.Color
[2024-12-05T09:43:27.072Z] at TestEditor.<init>(TestEditor.java:35)
[2024-12-05T09:43:27.072Z] at TestColorClassNull.main(TestColorClassNull.java:39)
[2024-12-05T09:43:27.072Z] at java.base/jdk.internal.reflect.NativeMethodAccessorImpl.invoke0(Native Method)
[2024-12-05T09:43:27.072Z] at java.base/jdk.internal.reflect.NativeMethodAccessorImpl.invoke(NativeMethodAccessorImpl.java:77)
[2024-12-05T09:43:27.072Z] at java.base/jdk.internal.reflect.DelegatingMethodAccessorImpl.invoke(DelegatingMethodAccessorImpl.java:43)
[2024-12-05T09:43:27.072Z] at java.base/java.lang.reflect.Method.invoke(Method.java:569)
[2024-12-05T09:43:27.072Z] at com.sun.javatest.regtest.agent.MainWrapper$MainTask.run(MainWrapper.java:138)
[2024-12-05T09:43:27.072Z] at java.base/java.lang.Thread.run(Thread.java:840)
[2024-12-05T09:43:27.072Z]
[2024-12-05T09:43:27.072Z] JavaTest Message: Test threw exception: java.lang.Error: could not find editor for class java.awt.Color
[2024-12-05T09:43:27.072Z] JavaTest Message: shutting down test
[2024-12-05T09:43:27.072Z]
[2024-12-05T09:43:27.072Z] STATUS:Failed.`main' threw exception: java.lang.Error: could not find editor for class java.awt.Color
[2024-12-05T09:43:27.072Z] rerun:
[2024-12-05T09:43:27.072Z] cd 'C:\Jenkins\workspace\Test_openjdk17_hs_extended.openjdk_x86-64_windows_testList_2\aqa-tests\TKG\output_17333892671188\jdk_beans_0\work\java\beans\PropertyEditor\TestColorClassNull' && \
[2024-12-05T09:43:27.072Z] PATH='C:\Program Files\Java\jdk-17.0.8.1+1\bin;C:\cygwin64\bin;C:\Windows\system32;C:\Windows;C:\Windows\System32\Wbem;C:\Windows\System32\WindowsPowerShell\v1.0;C:\Windows\System32\OpenSSH;C:\Program Files\dotnet;C:\Users\adoptopenjdk\AppData\Local\Microsoft\WindowsApps;C:\Strawberry\perl\bin;C:\Program Files\Git\cmd;C:\openjdk\jdk-8\bin;C:\apache-ant\apache-ant-1.10.15\bin;C:\Program Files (x86)\IncrediBuild;C:\Program Files (x86)\Windows Kits\10\Windows Performance Toolkit;C:\rust\bin;C:\Program Files\IcedTeaWEB\bin;C:\Program Files\Microsoft SQL Server\110\Tools\Binn;C:\Program Files (x86)\Microsoft SDKs\TypeScript\1.0;C:\Program Files\Microsoft SQL Server\120\Tools\Binn;C:\Users\jenkins\AppData\Local\Microsoft\WindowsApps' \
[2024-12-05T09:43:27.072Z] SystemDrive=C: \
[2024-12-05T09:43:27.072Z] SystemRoot='C:\Windows' \
[2024-12-05T09:43:27.072Z] TEMP='C:\Users\jenkins\AppData\Local\Temp\3' \
[2024-12-05T09:43:27.072Z] TMP='C:\Users\jenkins\AppData\Local\Temp\3' \
[2024-12-05T09:43:27.072Z] windir='C:\Windows' \
[2024-12-05T09:43:27.072Z] CLASSPATH='C:\Jenkins\workspace\Test_openjdk17_hs_extended.openjdk_x86-64_windows_testList_2\aqa-tests\TKG\output_17333892671188\jdk_beans_0\work\classes\1\java\beans\PropertyEditor\TestColorClassNull.d;C:\Jenkins\workspace\Test_openjdk17_hs_extended.openjdk_x86-64_windows_testList_2\aqa-tests\openjdk\openjdk-jdk\test\jdk\java\beans\PropertyEditor;C:\Jenkins\workspace\Test_openjdk17_hs_extended.openjdk_x86-64_windows_testList_2\jvmtest\openjdk\jtreg\lib\javatest.jar;C:\Jenkins\workspace\Test_openjdk17_hs_extended.openjdk_x86-64_windows_testList_2\jvmtest\openjdk\jtreg\lib\jtreg.jar' \
[2024-12-05T09:43:27.072Z] 'c:\jenkins\workspace\Test_openjdk17_hs_extended.openjdk_x86-64_windows_testList_2\jdkbinary\j2sdk-image\bin\java' \
[2024-12-05T09:43:27.072Z] -Dtest.vm.opts='-ea -esa -Xmx512m -XX:+UseCompressedOops' \
[2024-12-05T09:43:27.072Z] -Dtest.tool.vm.opts='-J-ea -J-esa -J-Xmx512m -J-XX:+UseCompressedOops' \
[2024-12-05T09:43:27.072Z] -Dtest.compiler.opts= \
[2024-12-05T09:43:27.072Z] -Dtest.java.opts= \
[2024-12-05T09:43:27.072Z] -Dtest.jdk='c:\jenkins\workspace\Test_openjdk17_hs_extended.openjdk_x86-64_windows_testList_2\jdkbinary\j2sdk-image' \
[2024-12-05T09:43:27.072Z] -Dcompile.jdk='c:\jenkins\workspace\Test_openjdk17_hs_extended.openjdk_x86-64_windows_testList_2\jdkbinary\j2sdk-image' \
[2024-12-05T09:43:27.072Z] -Dtest.timeout.factor=8.0 \
[2024-12-05T09:43:27.072Z] -Dtest.nativepath='c:\jenkins\workspace\Test_openjdk17_hs_extended.openjdk_x86-64_windows_testList_2\jdkbinary\openjdk-test-image\jdk\jtreg\native' \
[2024-12-05T09:43:27.072Z] -Dtest.root='C:\Jenkins\workspace\Test_openjdk17_hs_extended.openjdk_x86-64_windows_testList_2\aqa-tests\openjdk\openjdk-jdk\test\jdk' \
[2024-12-05T09:43:27.072Z] -Dtest.name=java/beans/PropertyEditor/TestColorClassNull.java \
[2024-12-05T09:43:27.072Z] -Dtest.file='C:\Jenkins\workspace\Test_openjdk17_hs_extended.openjdk_x86-64_windows_testList_2\aqa-tests\openjdk\openjdk-jdk\test\jdk\java\beans\PropertyEditor\TestColorClassNull.java' \
[2024-12-05T09:43:27.072Z] -Dtest.src='C:\Jenkins\workspace\Test_openjdk17_hs_extended.openjdk_x86-64_windows_testList_2\aqa-tests\openjdk\openjdk-jdk\test\jdk\java\beans\PropertyEditor' \
[2024-12-05T09:43:27.072Z] -Dtest.src.path='C:\Jenkins\workspace\Test_openjdk17_hs_extended.openjdk_x86-64_windows_testList_2\aqa-tests\openjdk\openjdk-jdk\test\jdk\java\beans\PropertyEditor' \
[2024-12-05T09:43:27.072Z] -Dtest.classes='C:\Jenkins\workspace\Test_openjdk17_hs_extended.openjdk_x86-64_windows_testList_2\aqa-tests\TKG\output_17333892671188\jdk_beans_0\work\classes\1\java\beans\PropertyEditor\TestColorClassNull.d' \
[2024-12-05T09:43:27.072Z] -Dtest.class.path='C:\Jenkins\workspace\Test_openjdk17_hs_extended.openjdk_x86-64_windows_testList_2\aqa-tests\TKG\output_17333892671188\jdk_beans_0\work\classes\1\java\beans\PropertyEditor\TestColorClassNull.d' \
[2024-12-05T09:43:27.072Z] -Dtest.modules='java.compiler java.desktop jdk.compiler' \
[2024-12-05T09:43:27.072Z] --add-modules java.compiler,java.desktop,jdk.compiler \
[2024-12-05T09:43:27.072Z] -ea \
[2024-12-05T09:43:27.072Z] -esa \
[2024-12-05T09:43:27.072Z] -Xmx512m \
[2024-12-05T09:43:27.072Z] -XX:+UseCompressedOops \
[2024-12-05T09:43:27.072Z] '-Djava.library.path=c:\jenkins\workspace\Test_openjdk17_hs_extended.openjdk_x86-64_windows_testList_2\jdkbinary\openjdk-test-image\jdk\jtreg\native' \
[2024-12-05T09:43:27.072Z] com.sun.javatest.regtest.agent.MainWrapper 'C:\Jenkins\workspace\Test_openjdk17_hs_extended.openjdk_x86-64_windows_testList_2\aqa-tests\TKG\output_17333892671188\jdk_beans_0\work\java\beans\PropertyEditor\TestColorClassNull.d\main.0.jta'
[2024-12-05T09:43:27.072Z]
[2024-12-05T09:43:27.072Z] TEST RESULT: Failed. Execution failed: `main' threw exception: java.lang.Error: could not find editor for class java.awt.Color
[2024-12-05T09:43:27.072Z] --------------------------------------------------
[2024-12-05T09:43:27.072Z] TEST: java/beans/PropertyEditor/TestColorClassValue.java
[2024-12-05T09:43:27.072Z] TEST JDK: c:\jenkins\workspace\Test_openjdk17_hs_extended.openjdk_x86-64_windows_testList_2\jdkbinary\j2sdk-image
[2024-12-05T09:43:27.072Z]
[2024-12-05T09:43:27.072Z] ACTION: build -- Passed. Build successful
[2024-12-05T09:43:27.072Z] REASON: Named class compiled on demand
[2024-12-05T09:43:27.072Z] TIME: 2.738 seconds
[2024-12-05T09:43:27.072Z] messages:
[2024-12-05T09:43:27.072Z] command: build TestColorClassValue
[2024-12-05T09:43:27.072Z] reason: Named class compiled on demand
[2024-12-05T09:43:27.072Z] started: Thu Dec 05 09:43:23 UTC 2024
[2024-12-05T09:43:27.072Z] Test directory:
[2024-12-05T09:43:27.072Z] compile: TestColorClassValue
[2024-12-05T09:43:27.072Z] finished: Thu Dec 05 09:43:26 UTC 2024
[2024-12-05T09:43:27.072Z] elapsed time (seconds): 2.738
[2024-12-05T09:43:27.072Z]
[2024-12-05T09:43:27.072Z] ACTION: compile -- Passed. Compilation successful
[2024-12-05T09:43:27.072Z] REASON: .class file out of date or does not exist
[2024-12-05T09:43:27.072Z] TIME: 2.737 seconds
[2024-12-05T09:43:27.072Z] messages:
[2024-12-05T09:43:27.072Z] command: compile C:\Jenkins\workspace\Test_openjdk17_hs_extended.openjdk_x86-64_windows_testList_2\aqa-tests\openjdk\openjdk-jdk\test\jdk\java\beans\PropertyEditor\TestColorClassValue.java
[2024-12-05T09:43:27.072Z] reason: .class file out of date or does not exist
[2024-12-05T09:43:27.072Z] started: Thu Dec 05 09:43:23 UTC 2024
[2024-12-05T09:43:27.072Z] Additional options from @modules: --add-modules java.compiler,java.desktop,jdk.compiler
[2024-12-05T09:43:27.072Z] Mode: othervm
[2024-12-05T09:43:27.072Z] finished: Thu Dec 05 09:43:26 UTC 2024
[2024-12-05T09:43:27.072Z] elapsed time (seconds): 2.737
[2024-12-05T09:43:27.072Z] configuration:
[2024-12-05T09:43:27.072Z] javac compilation environment
[2024-12-05T09:43:27.072Z] add modules: java.compiler java.desktop jdk.compiler
[2024-12-05T09:43:27.072Z] source path: C:\Jenkins\workspace\Test_openjdk17_hs_extended.openjdk_x86-64_windows_testList_2\aqa-tests\openjdk\openjdk-jdk\test\jdk\java\beans\PropertyEditor
[2024-12-05T09:43:27.072Z] class path: C:\Jenkins\workspace\Test_openjdk17_hs_extended.openjdk_x86-64_windows_testList_2\aqa-tests\openjdk\openjdk-jdk\test\jdk\java\beans\PropertyEditor
[2024-12-05T09:43:27.072Z] C:\Jenkins\workspace\Test_openjdk17_hs_extended.openjdk_x86-64_windows_testList_2\aqa-tests\TKG\output_17333892671188\jdk_beans_0\work\classes\2\java\beans\PropertyEditor\TestColorClassValue.d
[2024-12-05T09:43:27.072Z]
[2024-12-05T09:43:27.072Z] rerun:
[2024-12-05T09:43:27.072Z] cd 'C:\Jenkins\workspace\Test_openjdk17_hs_extended.openjdk_x86-64_windows_testList_2\aqa-tests\TKG\output_17333892671188\jdk_beans_0\work\java\beans\PropertyEditor\TestColorClassValue' && \
[2024-12-05T09:43:27.072Z] PATH='C:\Program Files\Java\jdk-17.0.8.1+1\bin;C:\cygwin64\bin;C:\Windows\system32;C:\Windows;C:\Windows\System32\Wbem;C:\Windows\System32\WindowsPowerShell\v1.0;C:\Windows\System32\OpenSSH;C:\Program Files\dotnet;C:\Users\adoptopenjdk\AppData\Local\Microsoft\WindowsApps;C:\Strawberry\perl\bin;C:\Program Files\Git\cmd;C:\openjdk\jdk-8\bin;C:\apache-ant\apache-ant-1.10.15\bin;C:\Program Files (x86)\IncrediBuild;C:\Program Files (x86)\Windows Kits\10\Windows Performance Toolkit;C:\rust\bin;C:\Program Files\IcedTeaWEB\bin;C:\Program Files\Microsoft SQL Server\110\Tools\Binn;C:\Program Files (x86)\Microsoft SDKs\TypeScript\1.0;C:\Program Files\Microsoft SQL Server\120\Tools\Binn;C:\Users\jenkins\AppData\Local\Microsoft\WindowsApps' \
[2024-12-05T09:43:27.072Z] SystemDrive=C: \
[2024-12-05T09:43:27.072Z] SystemRoot='C:\Windows' \
[2024-12-05T09:43:27.072Z] TEMP='C:\Users\jenkins\AppData\Local\Temp\3' \
[2024-12-05T09:43:27.072Z] TMP='C:\Users\jenkins\AppData\Local\Temp\3' \
[2024-12-05T09:43:27.072Z] windir='C:\Windows' \
[2024-12-05T09:43:27.072Z] 'c:\jenkins\workspace\Test_openjdk17_hs_extended.openjdk_x86-64_windows_testList_2\jdkbinary\j2sdk-image\bin\javac' \
[2024-12-05T09:43:27.072Z] -J-ea \
[2024-12-05T09:43:27.072Z] -J-esa \
[2024-12-05T09:43:27.072Z] -J-Xmx512m \
[2024-12-05T09:43:27.072Z] -J-XX:+UseCompressedOops \
[2024-12-05T09:43:27.072Z] -J-Dtest.vm.opts='-ea -esa -Xmx512m -XX:+UseCompressedOops' \
[2024-12-05T09:43:27.072Z] -J-Dtest.tool.vm.opts='-J-ea -J-esa -J-Xmx512m -J-XX:+UseCompressedOops' \
[2024-12-05T09:43:27.072Z] -J-Dtest.compiler.opts= \
[2024-12-05T09:43:27.072Z] -J-Dtest.java.opts= \
[2024-12-05T09:43:27.072Z] -J-Dtest.jdk='c:\jenkins\workspace\Test_openjdk17_hs_extended.openjdk_x86-64_windows_testList_2\jdkbinary\j2sdk-image' \
[2024-12-05T09:43:27.072Z] -J-Dcompile.jdk='c:\jenkins\workspace\Test_openjdk17_hs_extended.openjdk_x86-64_windows_testList_2\jdkbinary\j2sdk-image' \
[2024-12-05T09:43:27.072Z] -J-Dtest.timeout.factor=8.0 \
[2024-12-05T09:43:27.072Z] -J-Dtest.nativepath='c:\jenkins\workspace\Test_openjdk17_hs_extended.openjdk_x86-64_windows_testList_2\jdkbinary\openjdk-test-image\jdk\jtreg\native' \
[2024-12-05T09:43:27.072Z] -J-Dtest.root='C:\Jenkins\workspace\Test_openjdk17_hs_extended.openjdk_x86-64_windows_testList_2\aqa-tests\openjdk\openjdk-jdk\test\jdk' \
[2024-12-05T09:43:27.072Z] -J-Dtest.name=java/beans/PropertyEditor/TestColorClassValue.java \
[2024-12-05T09:43:27.072Z] -J-Dtest.file='C:\Jenkins\workspace\Test_openjdk17_hs_extended.openjdk_x86-64_windows_testList_2\aqa-tests\openjdk\openjdk-jdk\test\jdk\java\beans\PropertyEditor\TestColorClassValue.java' \
[2024-12-05T09:43:27.072Z] -J-Dtest.src='C:\Jenkins\workspace\Test_openjdk17_hs_extended.openjdk_x86-64_windows_testList_2\aqa-tests\openjdk\openjdk-jdk\test\jdk\java\beans\PropertyEditor' \
[2024-12-05T09:43:27.072Z] -J-Dtest.src.path='C:\Jenkins\workspace\Test_openjdk17_hs_extended.openjdk_x86-64_windows_testList_2\aqa-tests\openjdk\openjdk-jdk\test\jdk\java\beans\PropertyEditor' \
[2024-12-05T09:43:27.072Z] -J-Dtest.classes='C:\Jenkins\workspace\Test_openjdk17_hs_extended.openjdk_x86-64_windows_testList_2\aqa-tests\TKG\output_17333892671188\jdk_beans_0\work\classes\2\java\beans\PropertyEditor\TestColorClassValue.d' \
[2024-12-05T09:43:27.072Z] -J-Dtest.class.path='C:\Jenkins\workspace\Test_openjdk17_hs_extended.openjdk_x86-64_windows_testList_2\aqa-tests\TKG\output_17333892671188\jdk_beans_0\work\classes\2\java\beans\PropertyEditor\TestColorClassValue.d' \
[2024-12-05T09:43:27.072Z] -J-Dtest.modules='java.compiler java.desktop jdk.compiler' \
[2024-12-05T09:43:27.072Z] --add-modules java.compiler,java.desktop,jdk.compiler \
[2024-12-05T09:43:27.072Z] -d 'C:\Jenkins\workspace\Test_openjdk17_hs_extended.openjdk_x86-64_windows_testList_2\aqa-tests\TKG\output_17333892671188\jdk_beans_0\work\classes\2\java\beans\PropertyEditor\TestColorClassValue.d' \
[2024-12-05T09:43:27.072Z] -sourcepath 'C:\Jenkins\workspace\Test_openjdk17_hs_extended.openjdk_x86-64_windows_testList_2\aqa-tests\openjdk\openjdk-jdk\test\jdk\java\beans\PropertyEditor' \
[2024-12-05T09:43:27.072Z] -classpath 'C:\Jenkins\workspace\Test_openjdk17_hs_extended.openjdk_x86-64_windows_testList_2\aqa-tests\openjdk\openjdk-jdk\test\jdk\java\beans\PropertyEditor;C:\Jenkins\workspace\Test_openjdk17_hs_extended.openjdk_x86-64_windows_testList_2\aqa-tests\TKG\output_17333892671188\jdk_beans_0\work\classes\2\java\beans\PropertyEditor\TestColorClassValue.d' 'C:\Jenkins\workspace\Test_openjdk17_hs_extended.openjdk_x86-64_windows_testList_2\aqa-tests\openjdk\openjdk-jdk\test\jdk\java\beans\PropertyEditor\TestColorClassValue.java'
[2024-12-05T09:43:27.072Z] STDOUT:
[2024-12-05T09:43:27.072Z] STDERR:
[2024-12-05T09:43:27.072Z] Note: C:\Jenkins\workspace\Test_openjdk17_hs_extended.openjdk_x86-64_windows_testList_2\aqa-tests\openjdk\openjdk-jdk\test\jdk\java\beans\PropertyEditor\TestEditor.java uses unchecked or unsafe operations.
[2024-12-05T09:43:27.072Z] Note: Recompile with -Xlint:unchecked for details.
[2024-12-05T09:43:27.072Z]
[2024-12-05T09:43:27.072Z] ACTION: main -- Failed. Execution failed: `main' threw exception: java.lang.Error: could not find editor for class java.awt.Color
[2024-12-05T09:43:27.072Z] REASON: Assumed action based on file name: run main TestColorClassValue
[2024-12-05T09:43:27.072Z] TIME: 0.455 seconds
[2024-12-05T09:43:27.072Z] messages:
[2024-12-05T09:43:27.072Z] command: main TestColorClassValue
[2024-12-05T09:43:27.072Z] reason: Assumed action based on file name: run main TestColorClassValue
[2024-12-05T09:43:27.072Z] started: Thu Dec 05 09:43:26 UTC 2024
[2024-12-05T09:43:27.072Z] Mode: othervm
[2024-12-05T09:43:27.072Z] Additional options from @modules: --add-modules java.compiler,java.desktop,jdk.compiler
[2024-12-05T09:43:27.072Z] finished: Thu Dec 05 09:43:26 UTC 2024
[2024-12-05T09:43:27.072Z] elapsed time (seconds): 0.455
[2024-12-05T09:43:27.072Z] configuration:
[2024-12-05T09:43:27.072Z] Boot Layer
[2024-12-05T09:43:27.072Z] add modules: java.compiler java.desktop jdk.compiler
[2024-12-05T09:43:27.072Z]
[2024-12-05T09:43:27.072Z] STDOUT:
[2024-12-05T09:43:27.072Z] Property class: class java.awt.Color
[2024-12-05T09:43:27.072Z] STDERR:
[2024-12-05T09:43:27.072Z] java.lang.Error: could not find editor for class java.awt.Color
[2024-12-05T09:43:27.072Z] at TestEditor.<init>(TestEditor.java:35)
[2024-12-05T09:43:27.072Z] at TestColorClassValue.main(TestColorClassValue.java:39)
[2024-12-05T09:43:27.072Z] at java.base/jdk.internal.reflect.NativeMethodAccessorImpl.invoke0(Native Method)
[2024-12-05T09:43:27.072Z] at java.base/jdk.internal.reflect.NativeMethodAccessorImpl.invoke(NativeMethodAccessorImpl.java:77)
[2024-12-05T09:43:27.072Z] at java.base/jdk.internal.reflect.DelegatingMethodAccessorImpl.invoke(DelegatingMethodAccessorImpl.java:43)
[2024-12-05T09:43:27.072Z] at java.base/java.lang.reflect.Method.invoke(Method.java:569)
[2024-12-05T09:43:27.072Z] at com.sun.javatest.regtest.agent.MainWrapper$MainTask.run(MainWrapper.java:138)
[2024-12-05T09:43:27.072Z] at java.base/java.lang.Thread.run(Thread.java:840)
[2024-12-05T09:43:27.072Z]
[2024-12-05T09:43:27.072Z] JavaTest Message: Test threw exception: java.lang.Error: could not find editor for class java.awt.Color
[2024-12-05T09:43:27.072Z] JavaTest Message: shutting down test
[2024-12-05T09:43:27.072Z]
[2024-12-05T09:43:27.072Z] STATUS:Failed.`main' threw exception: java.lang.Error: could not find editor for class java.awt.Color
[2024-12-05T09:43:27.072Z] rerun:
[2024-12-05T09:43:27.072Z] cd 'C:\Jenkins\workspace\Test_openjdk17_hs_extended.openjdk_x86-64_windows_testList_2\aqa-tests\TKG\output_17333892671188\jdk_beans_0\work\java\beans\PropertyEditor\TestColorClassValue' && \
[2024-12-05T09:43:27.072Z] PATH='C:\Program Files\Java\jdk-17.0.8.1+1\bin;C:\cygwin64\bin;C:\Windows\system32;C:\Windows;C:\Windows\System32\Wbem;C:\Windows\System32\WindowsPowerShell\v1.0;C:\Windows\System32\OpenSSH;C:\Program Files\dotnet;C:\Users\adoptopenjdk\AppData\Local\Microsoft\WindowsApps;C:\Strawberry\perl\bin;C:\Program Files\Git\cmd;C:\openjdk\jdk-8\bin;C:\apache-ant\apache-ant-1.10.15\bin;C:\Program Files (x86)\IncrediBuild;C:\Program Files (x86)\Windows Kits\10\Windows Performance Toolkit;C:\rust\bin;C:\Program Files\IcedTeaWEB\bin;C:\Program Files\Microsoft SQL Server\110\Tools\Binn;C:\Program Files (x86)\Microsoft SDKs\TypeScript\1.0;C:\Program Files\Microsoft SQL Server\120\Tools\Binn;C:\Users\jenkins\AppData\Local\Microsoft\WindowsApps' \
[2024-12-05T09:43:27.072Z] SystemDrive=C: \
[2024-12-05T09:43:27.072Z] SystemRoot='C:\Windows' \
[2024-12-05T09:43:27.072Z] TEMP='C:\Users\jenkins\AppData\Local\Temp\3' \
[2024-12-05T09:43:27.072Z] TMP='C:\Users\jenkins\AppData\Local\Temp\3' \
[2024-12-05T09:43:27.072Z] windir='C:\Windows' \
[2024-12-05T09:43:27.072Z] CLASSPATH='C:\Jenkins\workspace\Test_openjdk17_hs_extended.openjdk_x86-64_windows_testList_2\aqa-tests\TKG\output_17333892671188\jdk_beans_0\work\classes\2\java\beans\PropertyEditor\TestColorClassValue.d;C:\Jenkins\workspace\Test_openjdk17_hs_extended.openjdk_x86-64_windows_testList_2\aqa-tests\openjdk\openjdk-jdk\test\jdk\java\beans\PropertyEditor;C:\Jenkins\workspace\Test_openjdk17_hs_extended.openjdk_x86-64_windows_testList_2\jvmtest\openjdk\jtreg\lib\javatest.jar;C:\Jenkins\workspace\Test_openjdk17_hs_extended.openjdk_x86-64_windows_testList_2\jvmtest\openjdk\jtreg\lib\jtreg.jar' \
[2024-12-05T09:43:27.073Z] 'c:\jenkins\workspace\Test_openjdk17_hs_extended.openjdk_x86-64_windows_testList_2\jdkbinary\j2sdk-image\bin\java' \
[2024-12-05T09:43:27.073Z] -Dtest.vm.opts='-ea -esa -Xmx512m -XX:+UseCompressedOops' \
[2024-12-05T09:43:27.073Z] -Dtest.tool.vm.opts='-J-ea -J-esa -J-Xmx512m -J-XX:+UseCompressedOops' \
[2024-12-05T09:43:27.073Z] -Dtest.compiler.opts= \
[2024-12-05T09:43:27.073Z] -Dtest.java.opts= \
[2024-12-05T09:43:27.073Z] -Dtest.jdk='c:\jenkins\workspace\Test_openjdk17_hs_extended.openjdk_x86-64_windows_testList_2\jdkbinary\j2sdk-image' \
[2024-12-05T09:43:27.073Z] -Dcompile.jdk='c:\jenkins\workspace\Test_openjdk17_hs_extended.openjdk_x86-64_windows_testList_2\jdkbinary\j2sdk-image' \
[2024-12-05T09:43:27.073Z] -Dtest.timeout.factor=8.0 \
[2024-12-05T09:43:27.073Z] -Dtest.nativepath='c:\jenkins\workspace\Test_openjdk17_hs_extended.openjdk_x86-64_windows_testList_2\jdkbinary\openjdk-test-image\jdk\jtreg\native' \
[2024-12-05T09:43:27.073Z] -Dtest.root='C:\Jenkins\workspace\Test_openjdk17_hs_extended.openjdk_x86-64_windows_testList_2\aqa-tests\openjdk\openjdk-jdk\test\jdk' \
[2024-12-05T09:43:27.073Z] -Dtest.name=java/beans/PropertyEditor/TestColorClassValue.java \
[2024-12-05T09:43:27.073Z] -Dtest.file='C:\Jenkins\workspace\Test_openjdk17_hs_extended.openjdk_x86-64_windows_testList_2\aqa-tests\openjdk\openjdk-jdk\test\jdk\java\beans\PropertyEditor\TestColorClassValue.java' \
[2024-12-05T09:43:27.073Z] -Dtest.src='C:\Jenkins\workspace\Test_openjdk17_hs_extended.openjdk_x86-64_windows_testList_2\aqa-tests\openjdk\openjdk-jdk\test\jdk\java\beans\PropertyEditor' \
[2024-12-05T09:43:27.073Z] -Dtest.src.path='C:\Jenkins\workspace\Test_openjdk17_hs_extended.openjdk_x86-64_windows_testList_2\aqa-tests\openjdk\openjdk-jdk\test\jdk\java\beans\PropertyEditor' \
[2024-12-05T09:43:27.073Z] -Dtest.classes='C:\Jenkins\workspace\Test_openjdk17_hs_extended.openjdk_x86-64_windows_testList_2\aqa-tests\TKG\output_17333892671188\jdk_beans_0\work\classes\2\java\beans\PropertyEditor\TestColorClassValue.d' \
[2024-12-05T09:43:27.073Z] -Dtest.class.path='C:\Jenkins\workspace\Test_openjdk17_hs_extended.openjdk_x86-64_windows_testList_2\aqa-tests\TKG\output_17333892671188\jdk_beans_0\work\classes\2\java\beans\PropertyEditor\TestColorClassValue.d' \
[2024-12-05T09:43:27.073Z] -Dtest.modules='java.compiler java.desktop jdk.compiler' \
[2024-12-05T09:43:27.073Z] --add-modules java.compiler,java.desktop,jdk.compiler \
[2024-12-05T09:43:27.073Z] -ea \
[2024-12-05T09:43:27.073Z] -esa \
[2024-12-05T09:43:27.073Z] -Xmx512m \
[2024-12-05T09:43:27.073Z] -XX:+UseCompressedOops \
[2024-12-05T09:43:27.074Z] '-Djava.library.path=c:\jenkins\workspace\Test_openjdk17_hs_extended.openjdk_x86-64_windows_testList_2\jdkbinary\openjdk-test-image\jdk\jtreg\native' \
[2024-12-05T09:43:27.074Z] com.sun.javatest.regtest.agent.MainWrapper 'C:\Jenkins\workspace\Test_openjdk17_hs_extended.openjdk_x86-64_windows_testList_2\aqa-tests\TKG\output_17333892671188\jdk_beans_0\work\java\beans\PropertyEditor\TestColorClassValue.d\main.0.jta'
[2024-12-05T09:43:27.074Z]
[2024-12-05T09:43:27.074Z] TEST RESULT: Failed. Execution failed: `main' threw exception: java.lang.Error: could not find editor for class java.awt.Color
[2024-12-05T09:43:27.074Z] --------------------------------------------------
[2024-12-05T09:44:00.404Z] TEST: java/beans/PropertyEditor/TestFontClass.java
[2024-12-05T09:44:00.405Z] TEST JDK: c:\jenkins\workspace\Test_openjdk17_hs_extended.openjdk_x86-64_windows_testList_2\jdkbinary\j2sdk-image
[2024-12-05T09:44:00.405Z]
[2024-12-05T09:44:00.405Z] ACTION: build -- Passed. Build successful
[2024-12-05T09:44:00.405Z] REASON: Named class compiled on demand
[2024-12-05T09:44:00.405Z] TIME: 2.294 seconds
[2024-12-05T09:44:00.405Z] messages:
[2024-12-05T09:44:00.405Z] command: build TestFontClass
[2024-12-05T09:44:00.405Z] reason: Named class compiled on demand
[2024-12-05T09:44:00.405Z] started: Thu Dec 05 09:43:54 UTC 2024
[2024-12-05T09:44:00.405Z] Test directory:
[2024-12-05T09:44:00.405Z] compile: TestFontClass
[2024-12-05T09:44:00.405Z] finished: Thu Dec 05 09:43:56 UTC 2024
[2024-12-05T09:44:00.405Z] elapsed time (seconds): 2.294
[2024-12-05T09:44:00.405Z]
[2024-12-05T09:44:00.405Z] ACTION: compile -- Passed. Compilation successful
[2024-12-05T09:44:00.405Z] REASON: .class file out of date or does not exist
[2024-12-05T09:44:00.405Z] TIME: 2.292 seconds
[2024-12-05T09:44:00.405Z] messages:
[2024-12-05T09:44:00.405Z] command: compile C:\Jenkins\workspace\Test_openjdk17_hs_extended.openjdk_x86-64_windows_testList_2\aqa-tests\openjdk\openjdk-jdk\test\jdk\java\beans\PropertyEditor\TestFontClass.java
[2024-12-05T09:44:00.405Z] reason: .class file out of date or does not exist
[2024-12-05T09:44:00.405Z] started: Thu Dec 05 09:43:54 UTC 2024
[2024-12-05T09:44:00.405Z] Additional options from @modules: --add-modules java.compiler,java.desktop,jdk.compiler
[2024-12-05T09:44:00.405Z] Mode: othervm
[2024-12-05T09:44:00.405Z] finished: Thu Dec 05 09:43:56 UTC 2024
[2024-12-05T09:44:00.405Z] elapsed time (seconds): 2.292
[2024-12-05T09:44:00.405Z] configuration:
[2024-12-05T09:44:00.405Z] javac compilation environment
[2024-12-05T09:44:00.405Z] add modules: java.compiler java.desktop jdk.compiler
[2024-12-05T09:44:00.405Z] source path: C:\Jenkins\workspace\Test_openjdk17_hs_extended.openjdk_x86-64_windows_testList_2\aqa-tests\openjdk\openjdk-jdk\test\jdk\java\beans\PropertyEditor
[2024-12-05T09:44:00.405Z] class path: C:\Jenkins\workspace\Test_openjdk17_hs_extended.openjdk_x86-64_windows_testList_2\aqa-tests\openjdk\openjdk-jdk\test\jdk\java\beans\PropertyEditor
[2024-12-05T09:44:00.405Z] C:\Jenkins\workspace\Test_openjdk17_hs_extended.openjdk_x86-64_windows_testList_2\aqa-tests\TKG\output_17333892671188\jdk_beans_0\work\classes\0\java\beans\PropertyEditor\TestFontClass.d
[2024-12-05T09:44:00.405Z]
[2024-12-05T09:44:00.405Z] rerun:
[2024-12-05T09:44:00.405Z] cd 'C:\Jenkins\workspace\Test_openjdk17_hs_extended.openjdk_x86-64_windows_testList_2\aqa-tests\TKG\output_17333892671188\jdk_beans_0\work\java\beans\PropertyEditor\TestFontClass' && \
[2024-12-05T09:44:00.405Z] PATH='C:\Program Files\Java\jdk-17.0.8.1+1\bin;C:\cygwin64\bin;C:\Windows\system32;C:\Windows;C:\Windows\System32\Wbem;C:\Windows\System32\WindowsPowerShell\v1.0;C:\Windows\System32\OpenSSH;C:\Program Files\dotnet;C:\Users\adoptopenjdk\AppData\Local\Microsoft\WindowsApps;C:\Strawberry\perl\bin;C:\Program Files\Git\cmd;C:\openjdk\jdk-8\bin;C:\apache-ant\apache-ant-1.10.15\bin;C:\Program Files (x86)\IncrediBuild;C:\Program Files (x86)\Windows Kits\10\Windows Performance Toolkit;C:\rust\bin;C:\Program Files\IcedTeaWEB\bin;C:\Program Files\Microsoft SQL Server\110\Tools\Binn;C:\Program Files (x86)\Microsoft SDKs\TypeScript\1.0;C:\Program Files\Microsoft SQL Server\120\Tools\Binn;C:\Users\jenkins\AppData\Local\Microsoft\WindowsApps' \
[2024-12-05T09:44:00.405Z] SystemDrive=C: \
[2024-12-05T09:44:00.405Z] SystemRoot='C:\Windows' \
[2024-12-05T09:44:00.405Z] TEMP='C:\Users\jenkins\AppData\Local\Temp\3' \
[2024-12-05T09:44:00.405Z] TMP='C:\Users\jenkins\AppData\Local\Temp\3' \
[2024-12-05T09:44:00.405Z] windir='C:\Windows' \
[2024-12-05T09:44:00.405Z] 'c:\jenkins\workspace\Test_openjdk17_hs_extended.openjdk_x86-64_windows_testList_2\jdkbinary\j2sdk-image\bin\javac' \
[2024-12-05T09:44:00.405Z] -J-ea \
[2024-12-05T09:44:00.405Z] -J-esa \
[2024-12-05T09:44:00.405Z] -J-Xmx512m \
[2024-12-05T09:44:00.405Z] -J-XX:+UseCompressedOops \
[2024-12-05T09:44:00.405Z] -J-Dtest.vm.opts='-ea -esa -Xmx512m -XX:+UseCompressedOops' \
[2024-12-05T09:44:00.405Z] -J-Dtest.tool.vm.opts='-J-ea -J-esa -J-Xmx512m -J-XX:+UseCompressedOops' \
[2024-12-05T09:44:00.405Z] -J-Dtest.compiler.opts= \
[2024-12-05T09:44:00.405Z] -J-Dtest.java.opts= \
[2024-12-05T09:44:00.405Z] -J-Dtest.jdk='c:\jenkins\workspace\Test_openjdk17_hs_extended.openjdk_x86-64_windows_testList_2\jdkbinary\j2sdk-image' \
[2024-12-05T09:44:00.405Z] -J-Dcompile.jdk='c:\jenkins\workspace\Test_openjdk17_hs_extended.openjdk_x86-64_windows_testList_2\jdkbinary\j2sdk-image' \
[2024-12-05T09:44:00.405Z] -J-Dtest.timeout.factor=8.0 \
[2024-12-05T09:44:00.405Z] -J-Dtest.nativepath='c:\jenkins\workspace\Test_openjdk17_hs_extended.openjdk_x86-64_windows_testList_2\jdkbinary\openjdk-test-image\jdk\jtreg\native' \
[2024-12-05T09:44:00.405Z] -J-Dtest.root='C:\Jenkins\workspace\Test_openjdk17_hs_extended.openjdk_x86-64_windows_testList_2\aqa-tests\openjdk\openjdk-jdk\test\jdk' \
[2024-12-05T09:44:00.405Z] -J-Dtest.name=java/beans/PropertyEditor/TestFontClass.java \
[2024-12-05T09:44:00.405Z] -J-Dtest.file='C:\Jenkins\workspace\Test_openjdk17_hs_extended.openjdk_x86-64_windows_testList_2\aqa-tests\openjdk\openjdk-jdk\test\jdk\java\beans\PropertyEditor\TestFontClass.java' \
[2024-12-05T09:44:00.405Z] -J-Dtest.src='C:\Jenkins\workspace\Test_openjdk17_hs_extended.openjdk_x86-64_windows_testList_2\aqa-tests\openjdk\openjdk-jdk\test\jdk\java\beans\PropertyEditor' \
[2024-12-05T09:44:00.405Z] -J-Dtest.src.path='C:\Jenkins\workspace\Test_openjdk17_hs_extended.openjdk_x86-64_windows_testList_2\aqa-tests\openjdk\openjdk-jdk\test\jdk\java\beans\PropertyEditor' \
[2024-12-05T09:44:00.405Z] -J-Dtest.classes='C:\Jenkins\workspace\Test_openjdk17_hs_extended.openjdk_x86-64_windows_testList_2\aqa-tests\TKG\output_17333892671188\jdk_beans_0\work\classes\0\java\beans\PropertyEditor\TestFontClass.d' \
[2024-12-05T09:44:00.405Z] -J-Dtest.class.path='C:\Jenkins\workspace\Test_openjdk17_hs_extended.openjdk_x86-64_windows_testList_2\aqa-tests\TKG\output_17333892671188\jdk_beans_0\work\classes\0\java\beans\PropertyEditor\TestFontClass.d' \
[2024-12-05T09:44:00.405Z] -J-Dtest.modules='java.compiler java.desktop jdk.compiler' \
[2024-12-05T09:44:00.405Z] --add-modules java.compiler,java.desktop,jdk.compiler \
[2024-12-05T09:44:00.405Z] -d 'C:\Jenkins\workspace\Test_openjdk17_hs_extended.openjdk_x86-64_windows_testList_2\aqa-tests\TKG\output_17333892671188\jdk_beans_0\work\classes\0\java\beans\PropertyEditor\TestFontClass.d' \
[2024-12-05T09:44:00.405Z] -sourcepath 'C:\Jenkins\workspace\Test_openjdk17_hs_extended.openjdk_x86-64_windows_testList_2\aqa-tests\openjdk\openjdk-jdk\test\jdk\java\beans\PropertyEditor' \
[2024-12-05T09:44:00.406Z] -classpath 'C:\Jenkins\workspace\Test_openjdk17_hs_extended.openjdk_x86-64_windows_testList_2\aqa-tests\openjdk\openjdk-jdk\test\jdk\java\beans\PropertyEditor;C:\Jenkins\workspace\Test_openjdk17_hs_extended.openjdk_x86-64_windows_testList_2\aqa-tests\TKG\output_17333892671188\jdk_beans_0\work\classes\0\java\beans\PropertyEditor\TestFontClass.d' 'C:\Jenkins\workspace\Test_openjdk17_hs_extended.openjdk_x86-64_windows_testList_2\aqa-tests\openjdk\openjdk-jdk\test\jdk\java\beans\PropertyEditor\TestFontClass.java'
[2024-12-05T09:44:00.406Z] STDOUT:
[2024-12-05T09:44:00.406Z] STDERR:
[2024-12-05T09:44:00.406Z] C:\Jenkins\workspace\Test_openjdk17_hs_extended.openjdk_x86-64_windows_testList_2\aqa-tests\openjdk\openjdk-jdk\test\jdk\java\beans\PropertyEditor\TestFontClass.java:40: warning: [removal] SecurityManager in java.lang has been deprecated and marked for removal
[2024-12-05T09:44:00.406Z] System.setSecurityManager(new SecurityManager());
[2024-12-05T09:44:00.406Z] ^
[2024-12-05T09:44:00.406Z] C:\Jenkins\workspace\Test_openjdk17_hs_extended.openjdk_x86-64_windows_testList_2\aqa-tests\openjdk\openjdk-jdk\test\jdk\java\beans\PropertyEditor\TestFontClass.java:40: warning: [removal] setSecurityManager(SecurityManager) in System has been deprecated and marked for removal
[2024-12-05T09:44:00.406Z] System.setSecurityManager(new SecurityManager());
[2024-12-05T09:44:00.406Z] ^
[2024-12-05T09:44:00.406Z] Note: C:\Jenkins\workspace\Test_openjdk17_hs_extended.openjdk_x86-64_windows_testList_2\aqa-tests\openjdk\openjdk-jdk\test\jdk\java\beans\PropertyEditor\TestEditor.java uses unchecked or unsafe operations.
[2024-12-05T09:44:00.406Z] Note: Recompile with -Xlint:unchecked for details.
[2024-12-05T09:44:00.406Z] 2 warnings
[2024-12-05T09:44:00.406Z]
[2024-12-05T09:44:00.406Z] ACTION: main -- Failed. Execution failed: `main' threw exception: java.lang.Error: could not find editor for class java.awt.Font
[2024-12-05T09:44:00.406Z] REASON: User specified action: run main/othervm -Djava.security.manager=allow TestFontClass
[2024-12-05T09:44:00.406Z] TIME: 0.687 seconds
[2024-12-05T09:44:00.406Z] messages:
[2024-12-05T09:44:00.406Z] command: main -Djava.security.manager=allow TestFontClass
[2024-12-05T09:44:00.406Z] reason: User specified action: run main/othervm -Djava.security.manager=allow TestFontClass
[2024-12-05T09:44:00.406Z] started: Thu Dec 05 09:43:56 UTC 2024
[2024-12-05T09:44:00.406Z] Mode: othervm [/othervm specified]
[2024-12-05T09:44:00.406Z] Additional options from @modules: --add-modules java.compiler,java.desktop,jdk.compiler
[2024-12-05T09:44:00.406Z] finished: Thu Dec 05 09:43:57 UTC 2024
[2024-12-05T09:44:00.406Z] elapsed time (seconds): 0.687
[2024-12-05T09:44:00.406Z] configuration:
[2024-12-05T09:44:00.406Z] Boot Layer
[2024-12-05T09:44:00.406Z] add modules: java.compiler java.desktop jdk.compiler
[2024-12-05T09:44:00.406Z]
[2024-12-05T09:44:00.406Z] STDOUT:
[2024-12-05T09:44:00.406Z] Property class: class java.awt.Font
[2024-12-05T09:44:00.406Z] STDERR:
[2024-12-05T09:44:00.406Z] WARNING: A terminally deprecated method in java.lang.System has been called
[2024-12-05T09:44:00.406Z] WARNING: System::setSecurityManager has been called by TestFontClass (file:/C:/Jenkins/workspace/Test_openjdk17_hs_extended.openjdk_x86-64_windows_testList_2/aqa-tests/TKG/output_17333892671188/jdk_beans_0/work/classes/0/java/beans/PropertyEditor/TestFontClass.d/)
[2024-12-05T09:44:00.406Z] WARNING: Please consider reporting this to the maintainers of TestFontClass
[2024-12-05T09:44:00.406Z] WARNING: System::setSecurityManager will be removed in a future release
[2024-12-05T09:44:00.406Z] java.lang.Error: could not find editor for class java.awt.Font
[2024-12-05T09:44:00.406Z] at TestEditor.<init>(TestEditor.java:35)
[2024-12-05T09:44:00.406Z] at TestFontClass.main(TestFontClass.java:41)
[2024-12-05T09:44:00.406Z] at java.base/jdk.internal.reflect.NativeMethodAccessorImpl.invoke0(Native Method)
[2024-12-05T09:44:00.406Z] at java.base/jdk.internal.reflect.NativeMethodAccessorImpl.invoke(NativeMethodAccessorImpl.java:77)
[2024-12-05T09:44:00.406Z] at java.base/jdk.internal.reflect.DelegatingMethodAccessorImpl.invoke(DelegatingMethodAccessorImpl.java:43)
[2024-12-05T09:44:00.406Z] at java.base/java.lang.reflect.Method.invoke(Method.java:569)
[2024-12-05T09:44:00.406Z] at com.sun.javatest.regtest.agent.MainWrapper$MainTask.run(MainWrapper.java:138)
[2024-12-05T09:44:00.406Z] at java.base/java.lang.Thread.run(Thread.java:840)
[2024-12-05T09:44:00.406Z]
[2024-12-05T09:44:00.406Z] JavaTest Message: Test threw exception: java.lang.Error: could not find editor for class java.awt.Font
[2024-12-05T09:44:00.406Z] JavaTest Message: shutting down test
[2024-12-05T09:44:00.406Z]
[2024-12-05T09:44:00.406Z] STATUS:Failed.`main' threw exception: java.lang.Error: could not find editor for class java.awt.Font
[2024-12-05T09:44:00.406Z] rerun:
[2024-12-05T09:44:00.406Z] cd 'C:\Jenkins\workspace\Test_openjdk17_hs_extended.openjdk_x86-64_windows_testList_2\aqa-tests\TKG\output_17333892671188\jdk_beans_0\work\java\beans\PropertyEditor\TestFontClass' && \
[2024-12-05T09:44:00.406Z] PATH='C:\Program Files\Java\jdk-17.0.8.1+1\bin;C:\cygwin64\bin;C:\Windows\system32;C:\Windows;C:\Windows\System32\Wbem;C:\Windows\System32\WindowsPowerShell\v1.0;C:\Windows\System32\OpenSSH;C:\Program Files\dotnet;C:\Users\adoptopenjdk\AppData\Local\Microsoft\WindowsApps;C:\Strawberry\perl\bin;C:\Program Files\Git\cmd;C:\openjdk\jdk-8\bin;C:\apache-ant\apache-ant-1.10.15\bin;C:\Program Files (x86)\IncrediBuild;C:\Program Files (x86)\Windows Kits\10\Windows Performance Toolkit;C:\rust\bin;C:\Program Files\IcedTeaWEB\bin;C:\Program Files\Microsoft SQL Server\110\Tools\Binn;C:\Program Files (x86)\Microsoft SDKs\TypeScript\1.0;C:\Program Files\Microsoft SQL Server\120\Tools\Binn;C:\Users\jenkins\AppData\Local\Microsoft\WindowsApps' \
[2024-12-05T09:44:00.406Z] SystemDrive=C: \
[2024-12-05T09:44:00.406Z] SystemRoot='C:\Windows' \
[2024-12-05T09:44:00.406Z] TEMP='C:\Users\jenkins\AppData\Local\Temp\3' \
[2024-12-05T09:44:00.406Z] TMP='C:\Users\jenkins\AppData\Local\Temp\3' \
[2024-12-05T09:44:00.406Z] windir='C:\Windows' \
[2024-12-05T09:44:00.406Z] CLASSPATH='C:\Jenkins\workspace\Test_openjdk17_hs_extended.openjdk_x86-64_windows_testList_2\aqa-tests\TKG\output_17333892671188\jdk_beans_0\work\classes\0\java\beans\PropertyEditor\TestFontClass.d;C:\Jenkins\workspace\Test_openjdk17_hs_extended.openjdk_x86-64_windows_testList_2\aqa-tests\openjdk\openjdk-jdk\test\jdk\java\beans\PropertyEditor;C:\Jenkins\workspace\Test_openjdk17_hs_extended.openjdk_x86-64_windows_testList_2\jvmtest\openjdk\jtreg\lib\javatest.jar;C:\Jenkins\workspace\Test_openjdk17_hs_extended.openjdk_x86-64_windows_testList_2\jvmtest\openjdk\jtreg\lib\jtreg.jar' \
[2024-12-05T09:44:00.406Z] 'c:\jenkins\workspace\Test_openjdk17_hs_extended.openjdk_x86-64_windows_testList_2\jdkbinary\j2sdk-image\bin\java' \
[2024-12-05T09:44:00.406Z] -Dtest.vm.opts='-ea -esa -Xmx512m -XX:+UseCompressedOops' \
[2024-12-05T09:44:00.406Z] -Dtest.tool.vm.opts='-J-ea -J-esa -J-Xmx512m -J-XX:+UseCompressedOops' \
[2024-12-05T09:44:00.406Z] -Dtest.compiler.opts= \
[2024-12-05T09:44:00.406Z] -Dtest.java.opts= \
[2024-12-05T09:44:00.406Z] -Dtest.jdk='c:\jenkins\workspace\Test_openjdk17_hs_extended.openjdk_x86-64_windows_testList_2\jdkbinary\j2sdk-image' \
[2024-12-05T09:44:00.406Z] -Dcompile.jdk='c:\jenkins\workspace\Test_openjdk17_hs_extended.openjdk_x86-64_windows_testList_2\jdkbinary\j2sdk-image' \
[2024-12-05T09:44:00.406Z] -Dtest.timeout.factor=8.0 \
[2024-12-05T09:44:00.406Z] -Dtest.nativepath='c:\jenkins\workspace\Test_openjdk17_hs_extended.openjdk_x86-64_windows_testList_2\jdkbinary\openjdk-test-image\jdk\jtreg\native' \
[2024-12-05T09:44:00.406Z] -Dtest.root='C:\Jenkins\workspace\Test_openjdk17_hs_extended.openjdk_x86-64_windows_testList_2\aqa-tests\openjdk\openjdk-jdk\test\jdk' \
[2024-12-05T09:44:00.407Z] -Dtest.name=java/beans/PropertyEditor/TestFontClass.java \
[2024-12-05T09:44:00.407Z] -Dtest.file='C:\Jenkins\workspace\Test_openjdk17_hs_extended.openjdk_x86-64_windows_testList_2\aqa-tests\openjdk\openjdk-jdk\test\jdk\java\beans\PropertyEditor\TestFontClass.java' \
[2024-12-05T09:44:00.407Z] -Dtest.src='C:\Jenkins\workspace\Test_openjdk17_hs_extended.openjdk_x86-64_windows_testList_2\aqa-tests\openjdk\openjdk-jdk\test\jdk\java\beans\PropertyEditor' \
[2024-12-05T09:44:00.407Z] -Dtest.src.path='C:\Jenkins\workspace\Test_openjdk17_hs_extended.openjdk_x86-64_windows_testList_2\aqa-tests\openjdk\openjdk-jdk\test\jdk\java\beans\PropertyEditor' \
[2024-12-05T09:44:00.407Z] -Dtest.classes='C:\Jenkins\workspace\Test_openjdk17_hs_extended.openjdk_x86-64_windows_testList_2\aqa-tests\TKG\output_17333892671188\jdk_beans_0\work\classes\0\java\beans\PropertyEditor\TestFontClass.d' \
[2024-12-05T09:44:00.407Z] -Dtest.class.path='C:\Jenkins\workspace\Test_openjdk17_hs_extended.openjdk_x86-64_windows_testList_2\aqa-tests\TKG\output_17333892671188\jdk_beans_0\work\classes\0\java\beans\PropertyEditor\TestFontClass.d' \
[2024-12-05T09:44:00.407Z] -Dtest.modules='java.compiler java.desktop jdk.compiler' \
[2024-12-05T09:44:00.407Z] --add-modules java.compiler,java.desktop,jdk.compiler \
[2024-12-05T09:44:00.407Z] -ea \
[2024-12-05T09:44:00.407Z] -esa \
[2024-12-05T09:44:00.407Z] -Xmx512m \
[2024-12-05T09:44:00.407Z] -XX:+UseCompressedOops \
[2024-12-05T09:44:00.407Z] '-Djava.library.path=c:\jenkins\workspace\Test_openjdk17_hs_extended.openjdk_x86-64_windows_testList_2\jdkbinary\openjdk-test-image\jdk\jtreg\native' \
[2024-12-05T09:44:00.407Z] -Djava.security.manager=allow \
[2024-12-05T09:44:00.407Z] com.sun.javatest.regtest.agent.MainWrapper 'C:\Jenkins\workspace\Test_openjdk17_hs_extended.openjdk_x86-64_windows_testList_2\aqa-tests\TKG\output_17333892671188\jdk_beans_0\work\java\beans\PropertyEditor\TestFontClass.d\main.0.jta'
[2024-12-05T09:44:00.407Z]
[2024-12-05T09:44:00.407Z] TEST RESULT: Failed. Execution failed: `main' threw exception: java.lang.Error: could not find editor for class java.awt.Font
[2024-12-05T09:44:00.407Z] --------------------------------------------------
[2024-12-05T09:44:00.407Z] TEST: java/beans/PropertyEditor/TestFontClassNull.java
[2024-12-05T09:44:00.407Z] TEST JDK: c:\jenkins\workspace\Test_openjdk17_hs_extended.openjdk_x86-64_windows_testList_2\jdkbinary\j2sdk-image
[2024-12-05T09:44:00.407Z]
[2024-12-05T09:44:00.407Z] ACTION: build -- Passed. Build successful
[2024-12-05T09:44:00.407Z] REASON: Named class compiled on demand
[2024-12-05T09:44:00.407Z] TIME: 2.149 seconds
[2024-12-05T09:44:00.407Z] messages:
[2024-12-05T09:44:00.407Z] command: build TestFontClassNull
[2024-12-05T09:44:00.407Z] reason: Named class compiled on demand
[2024-12-05T09:44:00.407Z] started: Thu Dec 05 09:43:56 UTC 2024
[2024-12-05T09:44:00.407Z] Test directory:
[2024-12-05T09:44:00.407Z] compile: TestFontClassNull
[2024-12-05T09:44:00.407Z] finished: Thu Dec 05 09:43:58 UTC 2024
[2024-12-05T09:44:00.407Z] elapsed time (seconds): 2.149
[2024-12-05T09:44:00.407Z]
[2024-12-05T09:44:00.407Z] ACTION: compile -- Passed. Compilation successful
[2024-12-05T09:44:00.407Z] REASON: .class file out of date or does not exist
[2024-12-05T09:44:00.407Z] TIME: 2.147 seconds
[2024-12-05T09:44:00.407Z] messages:
[2024-12-05T09:44:00.407Z] command: compile C:\Jenkins\workspace\Test_openjdk17_hs_extended.openjdk_x86-64_windows_testList_2\aqa-tests\openjdk\openjdk-jdk\test\jdk\java\beans\PropertyEditor\TestFontClassNull.java
[2024-12-05T09:44:00.407Z] reason: .class file out of date or does not exist
[2024-12-05T09:44:00.407Z] started: Thu Dec 05 09:43:56 UTC 2024
[2024-12-05T09:44:00.407Z] Additional options from @modules: --add-modules java.compiler,java.desktop,jdk.compiler
[2024-12-05T09:44:00.407Z] Mode: othervm
[2024-12-05T09:44:00.407Z] finished: Thu Dec 05 09:43:58 UTC 2024
[2024-12-05T09:44:00.407Z] elapsed time (seconds): 2.147
[2024-12-05T09:44:00.407Z] configuration:
[2024-12-05T09:44:00.407Z] javac compilation environment
[2024-12-05T09:44:00.407Z] add modules: java.compiler java.desktop jdk.compiler
[2024-12-05T09:44:00.407Z] source path: C:\Jenkins\workspace\Test_openjdk17_hs_extended.openjdk_x86-64_windows_testList_2\aqa-tests\openjdk\openjdk-jdk\test\jdk\java\beans\PropertyEditor
[2024-12-05T09:44:00.407Z] class path: C:\Jenkins\workspace\Test_openjdk17_hs_extended.openjdk_x86-64_windows_testList_2\aqa-tests\openjdk\openjdk-jdk\test\jdk\java\beans\PropertyEditor
[2024-12-05T09:44:00.407Z] C:\Jenkins\workspace\Test_openjdk17_hs_extended.openjdk_x86-64_windows_testList_2\aqa-tests\TKG\output_17333892671188\jdk_beans_0\work\classes\2\java\beans\PropertyEditor\TestFontClassNull.d
[2024-12-05T09:44:00.407Z]
[2024-12-05T09:44:00.407Z] rerun:
[2024-12-05T09:44:00.407Z] cd 'C:\Jenkins\workspace\Test_openjdk17_hs_extended.openjdk_x86-64_windows_testList_2\aqa-tests\TKG\output_17333892671188\jdk_beans_0\work\java\beans\PropertyEditor\TestFontClassNull' && \
[2024-12-05T09:44:00.407Z] PATH='C:\Program Files\Java\jdk-17.0.8.1+1\bin;C:\cygwin64\bin;C:\Windows\system32;C:\Windows;C:\Windows\System32\Wbem;C:\Windows\System32\WindowsPowerShell\v1.0;C:\Windows\System32\OpenSSH;C:\Program Files\dotnet;C:\Users\adoptopenjdk\AppData\Local\Microsoft\WindowsApps;C:\Strawberry\perl\bin;C:\Program Files\Git\cmd;C:\openjdk\jdk-8\bin;C:\apache-ant\apache-ant-1.10.15\bin;C:\Program Files (x86)\IncrediBuild;C:\Program Files (x86)\Windows Kits\10\Windows Performance Toolkit;C:\rust\bin;C:\Program Files\IcedTeaWEB\bin;C:\Program Files\Microsoft SQL Server\110\Tools\Binn;C:\Program Files (x86)\Microsoft SDKs\TypeScript\1.0;C:\Program Files\Microsoft SQL Server\120\Tools\Binn;C:\Users\jenkins\AppData\Local\Microsoft\WindowsApps' \
[2024-12-05T09:44:00.407Z] SystemDrive=C: \
[2024-12-05T09:44:00.407Z] SystemRoot='C:\Windows' \
[2024-12-05T09:44:00.407Z] TEMP='C:\Users\jenkins\AppData\Local\Temp\3' \
[2024-12-05T09:44:00.407Z] TMP='C:\Users\jenkins\AppData\Local\Temp\3' \
[2024-12-05T09:44:00.407Z] windir='C:\Windows' \
[2024-12-05T09:44:00.407Z] 'c:\jenkins\workspace\Test_openjdk17_hs_extended.openjdk_x86-64_windows_testList_2\jdkbinary\j2sdk-image\bin\javac' \
[2024-12-05T09:44:00.407Z] -J-ea \
[2024-12-05T09:44:00.407Z] -J-esa \
[2024-12-05T09:44:00.407Z] -J-Xmx512m \
[2024-12-05T09:44:00.407Z] -J-XX:+UseCompressedOops \
[2024-12-05T09:44:00.407Z] -J-Dtest.vm.opts='-ea -esa -Xmx512m -XX:+UseCompressedOops' \
[2024-12-05T09:44:00.407Z] -J-Dtest.tool.vm.opts='-J-ea -J-esa -J-Xmx512m -J-XX:+UseCompressedOops' \
[2024-12-05T09:44:00.407Z] -J-Dtest.compiler.opts= \
[2024-12-05T09:44:00.407Z] -J-Dtest.java.opts= \
[2024-12-05T09:44:00.407Z] -J-Dtest.jdk='c:\jenkins\workspace\Test_openjdk17_hs_extended.openjdk_x86-64_windows_testList_2\jdkbinary\j2sdk-image' \
[2024-12-05T09:44:00.407Z] -J-Dcompile.jdk='c:\jenkins\workspace\Test_openjdk17_hs_extended.openjdk_x86-64_windows_testList_2\jdkbinary\j2sdk-image' \
[2024-12-05T09:44:00.407Z] -J-Dtest.timeout.factor=8.0 \
[2024-12-05T09:44:00.407Z] -J-Dtest.nativepath='c:\jenkins\workspace\Test_openjdk17_hs_extended.openjdk_x86-64_windows_testList_2\jdkbinary\openjdk-test-image\jdk\jtreg\native' \
[2024-12-05T09:44:00.407Z] -J-Dtest.root='C:\Jenkins\workspace\Test_openjdk17_hs_extended.openjdk_x86-64_windows_testList_2\aqa-tests\openjdk\openjdk-jdk\test\jdk' \
[2024-12-05T09:44:00.407Z] -J-Dtest.name=java/beans/PropertyEditor/TestFontClassNull.java \
[2024-12-05T09:44:00.407Z] -J-Dtest.file='C:\Jenkins\workspace\Test_openjdk17_hs_extended.openjdk_x86-64_windows_testList_2\aqa-tests\openjdk\openjdk-jdk\test\jdk\java\beans\PropertyEditor\TestFontClassNull.java' \
[2024-12-05T09:44:00.407Z] -J-Dtest.src='C:\Jenkins\workspace\Test_openjdk17_hs_extended.openjdk_x86-64_windows_testList_2\aqa-tests\openjdk\openjdk-jdk\test\jdk\java\beans\PropertyEditor' \
[2024-12-05T09:44:00.407Z] -J-Dtest.src.path='C:\Jenkins\workspace\Test_openjdk17_hs_extended.openjdk_x86-64_windows_testList_2\aqa-tests\openjdk\openjdk-jdk\test\jdk\java\beans\PropertyEditor' \
[2024-12-05T09:44:00.407Z] -J-Dtest.classes='C:\Jenkins\workspace\Test_openjdk17_hs_extended.openjdk_x86-64_windows_testList_2\aqa-tests\TKG\output_17333892671188\jdk_beans_0\work\classes\2\java\beans\PropertyEditor\TestFontClassNull.d' \
[2024-12-05T09:44:00.408Z] -J-Dtest.class.path='C:\Jenkins\workspace\Test_openjdk17_hs_extended.openjdk_x86-64_windows_testList_2\aqa-tests\TKG\output_17333892671188\jdk_beans_0\work\classes\2\java\beans\PropertyEditor\TestFontClassNull.d' \
[2024-12-05T09:44:00.408Z] -J-Dtest.modules='java.compiler java.desktop jdk.compiler' \
[2024-12-05T09:44:00.408Z] --add-modules java.compiler,java.desktop,jdk.compiler \
[2024-12-05T09:44:00.408Z] -d 'C:\Jenkins\workspace\Test_openjdk17_hs_extended.openjdk_x86-64_windows_testList_2\aqa-tests\TKG\output_17333892671188\jdk_beans_0\work\classes\2\java\beans\PropertyEditor\TestFontClassNull.d' \
[2024-12-05T09:44:00.408Z] -sourcepath 'C:\Jenkins\workspace\Test_openjdk17_hs_extended.openjdk_x86-64_windows_testList_2\aqa-tests\openjdk\openjdk-jdk\test\jdk\java\beans\PropertyEditor' \
[2024-12-05T09:44:00.408Z] -classpath 'C:\Jenkins\workspace\Test_openjdk17_hs_extended.openjdk_x86-64_windows_testList_2\aqa-tests\openjdk\openjdk-jdk\test\jdk\java\beans\PropertyEditor;C:\Jenkins\workspace\Test_openjdk17_hs_extended.openjdk_x86-64_windows_testList_2\aqa-tests\TKG\output_17333892671188\jdk_beans_0\work\classes\2\java\beans\PropertyEditor\TestFontClassNull.d' 'C:\Jenkins\workspace\Test_openjdk17_hs_extended.openjdk_x86-64_windows_testList_2\aqa-tests\openjdk\openjdk-jdk\test\jdk\java\beans\PropertyEditor\TestFontClassNull.java'
[2024-12-05T09:44:00.408Z] STDOUT:
[2024-12-05T09:44:00.408Z] STDERR:
[2024-12-05T09:44:00.408Z] Note: C:\Jenkins\workspace\Test_openjdk17_hs_extended.openjdk_x86-64_windows_testList_2\aqa-tests\openjdk\openjdk-jdk\test\jdk\java\beans\PropertyEditor\TestEditor.java uses unchecked or unsafe operations.
[2024-12-05T09:44:00.408Z] Note: Recompile with -Xlint:unchecked for details.
[2024-12-05T09:44:00.408Z]
[2024-12-05T09:44:00.408Z] ACTION: main -- Failed. Execution failed: `main' threw exception: java.lang.Error: could not find editor for class java.awt.Font
[2024-12-05T09:44:00.408Z] REASON: Assumed action based on file name: run main TestFontClassNull
[2024-12-05T09:44:00.408Z] TIME: 0.695 seconds
[2024-12-05T09:44:00.408Z] messages:
[2024-12-05T09:44:00.408Z] command: main TestFontClassNull
[2024-12-05T09:44:00.408Z] reason: Assumed action based on file name: run main TestFontClassNull
[2024-12-05T09:44:00.408Z] started: Thu Dec 05 09:43:58 UTC 2024
[2024-12-05T09:44:00.408Z] Mode: othervm
[2024-12-05T09:44:00.408Z] Additional options from @modules: --add-modules java.compiler,java.desktop,jdk.compiler
[2024-12-05T09:44:00.408Z] finished: Thu Dec 05 09:43:59 UTC 2024
[2024-12-05T09:44:00.408Z] elapsed time (seconds): 0.695
[2024-12-05T09:44:00.408Z] configuration:
[2024-12-05T09:44:00.408Z] Boot Layer
[2024-12-05T09:44:00.408Z] add modules: java.compiler java.desktop jdk.compiler
[2024-12-05T09:44:00.408Z]
[2024-12-05T09:44:00.408Z] STDOUT:
[2024-12-05T09:44:00.408Z] Property class: class java.awt.Font
[2024-12-05T09:44:00.408Z] STDERR:
[2024-12-05T09:44:00.408Z] java.lang.Error: could not find editor for class java.awt.Font
[2024-12-05T09:44:00.408Z] at TestEditor.<init>(TestEditor.java:35)
[2024-12-05T09:44:00.408Z] at TestFontClassNull.main(TestFontClassNull.java:39)
[2024-12-05T09:44:00.408Z] at java.base/jdk.internal.reflect.NativeMethodAccessorImpl.invoke0(Native Method)
[2024-12-05T09:44:00.408Z] at java.base/jdk.internal.reflect.NativeMethodAccessorImpl.invoke(NativeMethodAccessorImpl.java:77)
[2024-12-05T09:44:00.408Z] at java.base/jdk.internal.reflect.DelegatingMethodAccessorImpl.invoke(DelegatingMethodAccessorImpl.java:43)
[2024-12-05T09:44:00.408Z] at java.base/java.lang.reflect.Method.invoke(Method.java:569)
[2024-12-05T09:44:00.408Z] at com.sun.javatest.regtest.agent.MainWrapper$MainTask.run(MainWrapper.java:138)
[2024-12-05T09:44:00.408Z] at java.base/java.lang.Thread.run(Thread.java:840)
[2024-12-05T09:44:00.408Z]
[2024-12-05T09:44:00.408Z] JavaTest Message: Test threw exception: java.lang.Error: could not find editor for class java.awt.Font
[2024-12-05T09:44:00.408Z] JavaTest Message: shutting down test
[2024-12-05T09:44:00.408Z]
[2024-12-05T09:44:00.408Z] STATUS:Failed.`main' threw exception: java.lang.Error: could not find editor for class java.awt.Font
[2024-12-05T09:44:00.408Z] rerun:
[2024-12-05T09:44:00.408Z] cd 'C:\Jenkins\workspace\Test_openjdk17_hs_extended.openjdk_x86-64_windows_testList_2\aqa-tests\TKG\output_17333892671188\jdk_beans_0\work\java\beans\PropertyEditor\TestFontClassNull' && \
[2024-12-05T09:44:00.408Z] PATH='C:\Program Files\Java\jdk-17.0.8.1+1\bin;C:\cygwin64\bin;C:\Windows\system32;C:\Windows;C:\Windows\System32\Wbem;C:\Windows\System32\WindowsPowerShell\v1.0;C:\Windows\System32\OpenSSH;C:\Program Files\dotnet;C:\Users\adoptopenjdk\AppData\Local\Microsoft\WindowsApps;C:\Strawberry\perl\bin;C:\Program Files\Git\cmd;C:\openjdk\jdk-8\bin;C:\apache-ant\apache-ant-1.10.15\bin;C:\Program Files (x86)\IncrediBuild;C:\Program Files (x86)\Windows Kits\10\Windows Performance Toolkit;C:\rust\bin;C:\Program Files\IcedTeaWEB\bin;C:\Program Files\Microsoft SQL Server\110\Tools\Binn;C:\Program Files (x86)\Microsoft SDKs\TypeScript\1.0;C:\Program Files\Microsoft SQL Server\120\Tools\Binn;C:\Users\jenkins\AppData\Local\Microsoft\WindowsApps' \
[2024-12-05T09:44:00.408Z] SystemDrive=C: \
[2024-12-05T09:44:00.408Z] SystemRoot='C:\Windows' \
[2024-12-05T09:44:00.408Z] TEMP='C:\Users\jenkins\AppData\Local\Temp\3' \
[2024-12-05T09:44:00.408Z] TMP='C:\Users\jenkins\AppData\Local\Temp\3' \
[2024-12-05T09:44:00.408Z] windir='C:\Windows' \
[2024-12-05T09:44:00.408Z] CLASSPATH='C:\Jenkins\workspace\Test_openjdk17_hs_extended.openjdk_x86-64_windows_testList_2\aqa-tests\TKG\output_17333892671188\jdk_beans_0\work\classes\2\java\beans\PropertyEditor\TestFontClassNull.d;C:\Jenkins\workspace\Test_openjdk17_hs_extended.openjdk_x86-64_windows_testList_2\aqa-tests\openjdk\openjdk-jdk\test\jdk\java\beans\PropertyEditor;C:\Jenkins\workspace\Test_openjdk17_hs_extended.openjdk_x86-64_windows_testList_2\jvmtest\openjdk\jtreg\lib\javatest.jar;C:\Jenkins\workspace\Test_openjdk17_hs_extended.openjdk_x86-64_windows_testList_2\jvmtest\openjdk\jtreg\lib\jtreg.jar' \
[2024-12-05T09:44:00.408Z] 'c:\jenkins\workspace\Test_openjdk17_hs_extended.openjdk_x86-64_windows_testList_2\jdkbinary\j2sdk-image\bin\java' \
[2024-12-05T09:44:00.408Z] -Dtest.vm.opts='-ea -esa -Xmx512m -XX:+UseCompressedOops' \
[2024-12-05T09:44:00.408Z] -Dtest.tool.vm.opts='-J-ea -J-esa -J-Xmx512m -J-XX:+UseCompressedOops' \
[2024-12-05T09:44:00.408Z] -Dtest.compiler.opts= \
[2024-12-05T09:44:00.408Z] -Dtest.java.opts= \
[2024-12-05T09:44:00.408Z] -Dtest.jdk='c:\jenkins\workspace\Test_openjdk17_hs_extended.openjdk_x86-64_windows_testList_2\jdkbinary\j2sdk-image' \
[2024-12-05T09:44:00.408Z] -Dcompile.jdk='c:\jenkins\workspace\Test_openjdk17_hs_extended.openjdk_x86-64_windows_testList_2\jdkbinary\j2sdk-image' \
[2024-12-05T09:44:00.408Z] -Dtest.timeout.factor=8.0 \
[2024-12-05T09:44:00.408Z] -Dtest.nativepath='c:\jenkins\workspace\Test_openjdk17_hs_extended.openjdk_x86-64_windows_testList_2\jdkbinary\openjdk-test-image\jdk\jtreg\native' \
[2024-12-05T09:44:00.408Z] -Dtest.root='C:\Jenkins\workspace\Test_openjdk17_hs_extended.openjdk_x86-64_windows_testList_2\aqa-tests\openjdk\openjdk-jdk\test\jdk' \
[2024-12-05T09:44:00.408Z] -Dtest.name=java/beans/PropertyEditor/TestFontClassNull.java \
[2024-12-05T09:44:00.408Z] -Dtest.file='C:\Jenkins\workspace\Test_openjdk17_hs_extended.openjdk_x86-64_windows_testList_2\aqa-tests\openjdk\openjdk-jdk\test\jdk\java\beans\PropertyEditor\TestFontClassNull.java' \
[2024-12-05T09:44:00.409Z] -Dtest.src='C:\Jenkins\workspace\Test_openjdk17_hs_extended.openjdk_x86-64_windows_testList_2\aqa-tests\openjdk\openjdk-jdk\test\jdk\java\beans\PropertyEditor' \
[2024-12-05T09:44:00.409Z] -Dtest.src.path='C:\Jenkins\workspace\Test_openjdk17_hs_extended.openjdk_x86-64_windows_testList_2\aqa-tests\openjdk\openjdk-jdk\test\jdk\java\beans\PropertyEditor' \
[2024-12-05T09:44:00.409Z] -Dtest.classes='C:\Jenkins\workspace\Test_openjdk17_hs_extended.openjdk_x86-64_windows_testList_2\aqa-tests\TKG\output_17333892671188\jdk_beans_0\work\classes\2\java\beans\PropertyEditor\TestFontClassNull.d' \
[2024-12-05T09:44:00.409Z] -Dtest.class.path='C:\Jenkins\workspace\Test_openjdk17_hs_extended.openjdk_x86-64_windows_testList_2\aqa-tests\TKG\output_17333892671188\jdk_beans_0\work\classes\2\java\beans\PropertyEditor\TestFontClassNull.d' \
[2024-12-05T09:44:00.409Z] -Dtest.modules='java.compiler java.desktop jdk.compiler' \
[2024-12-05T09:44:00.409Z] --add-modules java.compiler,java.desktop,jdk.compiler \
[2024-12-05T09:44:00.409Z] -ea \
[2024-12-05T09:44:00.409Z] -esa \
[2024-12-05T09:44:00.409Z] -Xmx512m \
[2024-12-05T09:44:00.409Z] -XX:+UseCompressedOops \
[2024-12-05T09:44:00.409Z] '-Djava.library.path=c:\jenkins\workspace\Test_openjdk17_hs_extended.openjdk_x86-64_windows_testList_2\jdkbinary\openjdk-test-image\jdk\jtreg\native' \
[2024-12-05T09:44:00.409Z] com.sun.javatest.regtest.agent.MainWrapper 'C:\Jenkins\workspace\Test_openjdk17_hs_extended.openjdk_x86-64_windows_testList_2\aqa-tests\TKG\output_17333892671188\jdk_beans_0\work\java\beans\PropertyEditor\TestFontClassNull.d\main.0.jta'
[2024-12-05T09:44:00.409Z]
[2024-12-05T09:44:00.409Z] TEST RESULT: Failed. Execution failed: `main' threw exception: java.lang.Error: could not find editor for class java.awt.Font
[2024-12-05T09:44:00.409Z] --------------------------------------------------
[2024-12-05T09:44:00.409Z] TEST: java/beans/PropertyEditor/TestFontClassJava.java
[2024-12-05T09:44:00.409Z] TEST JDK: c:\jenkins\workspace\Test_openjdk17_hs_extended.openjdk_x86-64_windows_testList_2\jdkbinary\j2sdk-image
[2024-12-05T09:44:00.409Z]
[2024-12-05T09:44:00.409Z] ACTION: build -- Passed. Build successful
[2024-12-05T09:44:00.409Z] REASON: Named class compiled on demand
[2024-12-05T09:44:00.409Z] TIME: 2.475 seconds
[2024-12-05T09:44:00.409Z] messages:
[2024-12-05T09:44:00.409Z] command: build TestFontClassJava
[2024-12-05T09:44:00.409Z] reason: Named class compiled on demand
[2024-12-05T09:44:00.409Z] started: Thu Dec 05 09:43:56 UTC 2024
[2024-12-05T09:44:00.409Z] Test directory:
[2024-12-05T09:44:00.409Z] compile: TestFontClassJava
[2024-12-05T09:44:00.409Z] finished: Thu Dec 05 09:43:58 UTC 2024
[2024-12-05T09:44:00.409Z] elapsed time (seconds): 2.475
[2024-12-05T09:44:00.409Z]
[2024-12-05T09:44:00.409Z] ACTION: compile -- Passed. Compilation successful
[2024-12-05T09:44:00.409Z] REASON: .class file out of date or does not exist
[2024-12-05T09:44:00.409Z] TIME: 2.452 seconds
[2024-12-05T09:44:00.409Z] messages:
[2024-12-05T09:44:00.409Z] command: compile C:\Jenkins\workspace\Test_openjdk17_hs_extended.openjdk_x86-64_windows_testList_2\aqa-tests\openjdk\openjdk-jdk\test\jdk\java\beans\PropertyEditor\TestFontClassJava.java
[2024-12-05T09:44:00.409Z] reason: .class file out of date or does not exist
[2024-12-05T09:44:00.409Z] started: Thu Dec 05 09:43:56 UTC 2024
[2024-12-05T09:44:00.409Z] Additional options from @modules: --add-modules java.compiler,java.desktop,jdk.compiler
[2024-12-05T09:44:00.409Z] Mode: othervm
[2024-12-05T09:44:00.409Z] finished: Thu Dec 05 09:43:58 UTC 2024
[2024-12-05T09:44:00.409Z] elapsed time (seconds): 2.452
[2024-12-05T09:44:00.409Z] configuration:
[2024-12-05T09:44:00.409Z] javac compilation environment
[2024-12-05T09:44:00.409Z] add modules: java.compiler java.desktop jdk.compiler
[2024-12-05T09:44:00.409Z] source path: C:\Jenkins\workspace\Test_openjdk17_hs_extended.openjdk_x86-64_windows_testList_2\aqa-tests\openjdk\openjdk-jdk\test\jdk\java\beans\PropertyEditor
[2024-12-05T09:44:00.409Z] class path: C:\Jenkins\workspace\Test_openjdk17_hs_extended.openjdk_x86-64_windows_testList_2\aqa-tests\openjdk\openjdk-jdk\test\jdk\java\beans\PropertyEditor
[2024-12-05T09:44:00.409Z] C:\Jenkins\workspace\Test_openjdk17_hs_extended.openjdk_x86-64_windows_testList_2\aqa-tests\TKG\output_17333892671188\jdk_beans_0\work\classes\1\java\beans\PropertyEditor\TestFontClassJava.d
[2024-12-05T09:44:00.409Z]
[2024-12-05T09:44:00.409Z] rerun:
[2024-12-05T09:44:00.409Z] cd 'C:\Jenkins\workspace\Test_openjdk17_hs_extended.openjdk_x86-64_windows_testList_2\aqa-tests\TKG\output_17333892671188\jdk_beans_0\work\java\beans\PropertyEditor\TestFontClassJava' && \
[2024-12-05T09:44:00.409Z] PATH='C:\Program Files\Java\jdk-17.0.8.1+1\bin;C:\cygwin64\bin;C:\Windows\system32;C:\Windows;C:\Windows\System32\Wbem;C:\Windows\System32\WindowsPowerShell\v1.0;C:\Windows\System32\OpenSSH;C:\Program Files\dotnet;C:\Users\adoptopenjdk\AppData\Local\Microsoft\WindowsApps;C:\Strawberry\perl\bin;C:\Program Files\Git\cmd;C:\openjdk\jdk-8\bin;C:\apache-ant\apache-ant-1.10.15\bin;C:\Program Files (x86)\IncrediBuild;C:\Program Files (x86)\Windows Kits\10\Windows Performance Toolkit;C:\rust\bin;C:\Program Files\IcedTeaWEB\bin;C:\Program Files\Microsoft SQL Server\110\Tools\Binn;C:\Program Files (x86)\Microsoft SDKs\TypeScript\1.0;C:\Program Files\Microsoft SQL Server\120\Tools\Binn;C:\Users\jenkins\AppData\Local\Microsoft\WindowsApps' \
[2024-12-05T09:44:00.409Z] SystemDrive=C: \
[2024-12-05T09:44:00.409Z] SystemRoot='C:\Windows' \
[2024-12-05T09:44:00.409Z] TEMP='C:\Users\jenkins\AppData\Local\Temp\3' \
[2024-12-05T09:44:00.409Z] TMP='C:\Users\jenkins\AppData\Local\Temp\3' \
[2024-12-05T09:44:00.409Z] windir='C:\Windows' \
[2024-12-05T09:44:00.409Z] 'c:\jenkins\workspace\Test_openjdk17_hs_extended.openjdk_x86-64_windows_testList_2\jdkbinary\j2sdk-image\bin\javac' \
[2024-12-05T09:44:00.409Z] -J-ea \
[2024-12-05T09:44:00.409Z] -J-esa \
[2024-12-05T09:44:00.409Z] -J-Xmx512m \
[2024-12-05T09:44:00.409Z] -J-XX:+UseCompressedOops \
[2024-12-05T09:44:00.409Z] -J-Dtest.vm.opts='-ea -esa -Xmx512m -XX:+UseCompressedOops' \
[2024-12-05T09:44:00.409Z] -J-Dtest.tool.vm.opts='-J-ea -J-esa -J-Xmx512m -J-XX:+UseCompressedOops' \
[2024-12-05T09:44:00.409Z] -J-Dtest.compiler.opts= \
[2024-12-05T09:44:00.409Z] -J-Dtest.java.opts= \
[2024-12-05T09:44:00.409Z] -J-Dtest.jdk='c:\jenkins\workspace\Test_openjdk17_hs_extended.openjdk_x86-64_windows_testList_2\jdkbinary\j2sdk-image' \
[2024-12-05T09:44:00.409Z] -J-Dcompile.jdk='c:\jenkins\workspace\Test_openjdk17_hs_extended.openjdk_x86-64_windows_testList_2\jdkbinary\j2sdk-image' \
[2024-12-05T09:44:00.409Z] -J-Dtest.timeout.factor=8.0 \
[2024-12-05T09:44:00.409Z] -J-Dtest.nativepath='c:\jenkins\workspace\Test_openjdk17_hs_extended.openjdk_x86-64_windows_testList_2\jdkbinary\openjdk-test-image\jdk\jtreg\native' \
[2024-12-05T09:44:00.409Z] -J-Dtest.root='C:\Jenkins\workspace\Test_openjdk17_hs_extended.openjdk_x86-64_windows_testList_2\aqa-tests\openjdk\openjdk-jdk\test\jdk' \
[2024-12-05T09:44:00.410Z] -J-Dtest.name=java/beans/PropertyEditor/TestFontClassJava.java \
[2024-12-05T09:44:00.410Z] -J-Dtest.file='C:\Jenkins\workspace\Test_openjdk17_hs_extended.openjdk_x86-64_windows_testList_2\aqa-tests\openjdk\openjdk-jdk\test\jdk\java\beans\PropertyEditor\TestFontClassJava.java' \
[2024-12-05T09:44:00.410Z] -J-Dtest.src='C:\Jenkins\workspace\Test_openjdk17_hs_extended.openjdk_x86-64_windows_testList_2\aqa-tests\openjdk\openjdk-jdk\test\jdk\java\beans\PropertyEditor' \
[2024-12-05T09:44:00.410Z] -J-Dtest.src.path='C:\Jenkins\workspace\Test_openjdk17_hs_extended.openjdk_x86-64_windows_testList_2\aqa-tests\openjdk\openjdk-jdk\test\jdk\java\beans\PropertyEditor' \
[2024-12-05T09:44:00.410Z] -J-Dtest.classes='C:\Jenkins\workspace\Test_openjdk17_hs_extended.openjdk_x86-64_windows_testList_2\aqa-tests\TKG\output_17333892671188\jdk_beans_0\work\classes\1\java\beans\PropertyEditor\TestFontClassJava.d' \
[2024-12-05T09:44:00.410Z] -J-Dtest.class.path='C:\Jenkins\workspace\Test_openjdk17_hs_extended.openjdk_x86-64_windows_testList_2\aqa-tests\TKG\output_17333892671188\jdk_beans_0\work\classes\1\java\beans\PropertyEditor\TestFontClassJava.d' \
[2024-12-05T09:44:00.410Z] -J-Dtest.modules='java.compiler java.desktop jdk.compiler' \
[2024-12-05T09:44:00.410Z] --add-modules java.compiler,java.desktop,jdk.compiler \
[2024-12-05T09:44:00.410Z] -d 'C:\Jenkins\workspace\Test_openjdk17_hs_extended.openjdk_x86-64_windows_testList_2\aqa-tests\TKG\output_17333892671188\jdk_beans_0\work\classes\1\java\beans\PropertyEditor\TestFontClassJava.d' \
[2024-12-05T09:44:00.410Z] -sourcepath 'C:\Jenkins\workspace\Test_openjdk17_hs_extended.openjdk_x86-64_windows_testList_2\aqa-tests\openjdk\openjdk-jdk\test\jdk\java\beans\PropertyEditor' \
[2024-12-05T09:44:00.410Z] -classpath 'C:\Jenkins\workspace\Test_openjdk17_hs_extended.openjdk_x86-64_windows_testList_2\aqa-tests\openjdk\openjdk-jdk\test\jdk\java\beans\PropertyEditor;C:\Jenkins\workspace\Test_openjdk17_hs_extended.openjdk_x86-64_windows_testList_2\aqa-tests\TKG\output_17333892671188\jdk_beans_0\work\classes\1\java\beans\PropertyEditor\TestFontClassJava.d' 'C:\Jenkins\workspace\Test_openjdk17_hs_extended.openjdk_x86-64_windows_testList_2\aqa-tests\openjdk\openjdk-jdk\test\jdk\java\beans\PropertyEditor\TestFontClassJava.java'
[2024-12-05T09:44:00.410Z] STDOUT:
[2024-12-05T09:44:00.410Z] STDERR:
[2024-12-05T09:44:00.410Z] Note: C:\Jenkins\workspace\Test_openjdk17_hs_extended.openjdk_x86-64_windows_testList_2\aqa-tests\openjdk\openjdk-jdk\test\jdk\java\beans\PropertyEditor\TestEditor.java uses unchecked or unsafe operations.
[2024-12-05T09:44:00.410Z] Note: Recompile with -Xlint:unchecked for details.
[2024-12-05T09:44:00.410Z]
[2024-12-05T09:44:00.410Z] ACTION: main -- Failed. Execution failed: `main' threw exception: java.lang.Error: could not find editor for class java.awt.Font
[2024-12-05T09:44:00.410Z] REASON: Assumed action based on file name: run main TestFontClassJava
[2024-12-05T09:44:00.410Z] TIME: 0.942 seconds
[2024-12-05T09:44:00.410Z] messages:
[2024-12-05T09:44:00.410Z] command: main TestFontClassJava
[2024-12-05T09:44:00.410Z] reason: Assumed action based on file name: run main TestFontClassJava
[2024-12-05T09:44:00.410Z] started: Thu Dec 05 09:43:58 UTC 2024
[2024-12-05T09:44:00.410Z] Mode: othervm
[2024-12-05T09:44:00.410Z] Additional options from @modules: --add-modules java.compiler,java.desktop,jdk.compiler
[2024-12-05T09:44:00.410Z] finished: Thu Dec 05 09:43:59 UTC 2024
[2024-12-05T09:44:00.410Z] elapsed time (seconds): 0.942
[2024-12-05T09:44:00.410Z] configuration:
[2024-12-05T09:44:00.410Z] Boot Layer
[2024-12-05T09:44:00.410Z] add modules: java.compiler java.desktop jdk.compiler
[2024-12-05T09:44:00.410Z]
[2024-12-05T09:44:00.410Z] STDOUT:
[2024-12-05T09:44:00.410Z] Property class: class java.awt.Font
[2024-12-05T09:44:00.410Z] STDERR:
[2024-12-05T09:44:00.410Z] java.lang.Error: could not find editor for class java.awt.Font
[2024-12-05T09:44:00.410Z] at TestEditor.<init>(TestEditor.java:35)
[2024-12-05T09:44:00.410Z] at TestFontClassJava.main(TestFontClassJava.java:39)
[2024-12-05T09:44:00.410Z] at java.base/jdk.internal.reflect.NativeMethodAccessorImpl.invoke0(Native Method)
[2024-12-05T09:44:00.410Z] at java.base/jdk.internal.reflect.NativeMethodAccessorImpl.invoke(NativeMethodAccessorImpl.java:77)
[2024-12-05T09:44:00.410Z] at java.base/jdk.internal.reflect.DelegatingMethodAccessorImpl.invoke(DelegatingMethodAccessorImpl.java:43)
[2024-12-05T09:44:00.410Z] at java.base/java.lang.reflect.Method.invoke(Method.java:569)
[2024-12-05T09:44:00.410Z] at com.sun.javatest.regtest.agent.MainWrapper$MainTask.run(MainWrapper.java:138)
[2024-12-05T09:44:00.410Z] at java.base/java.lang.Thread.run(Thread.java:840)
[2024-12-05T09:44:00.410Z]
[2024-12-05T09:44:00.410Z] JavaTest Message: Test threw exception: java.lang.Error: could not find editor for class java.awt.Font
[2024-12-05T09:44:00.410Z] JavaTest Message: shutting down test
[2024-12-05T09:44:00.410Z]
[2024-12-05T09:44:00.410Z] STATUS:Failed.`main' threw exception: java.lang.Error: could not find editor for class java.awt.Font
[2024-12-05T09:44:00.410Z] rerun:
[2024-12-05T09:44:00.410Z] cd 'C:\Jenkins\workspace\Test_openjdk17_hs_extended.openjdk_x86-64_windows_testList_2\aqa-tests\TKG\output_17333892671188\jdk_beans_0\work\java\beans\PropertyEditor\TestFontClassJava' && \
[2024-12-05T09:44:00.410Z] PATH='C:\Program Files\Java\jdk-17.0.8.1+1\bin;C:\cygwin64\bin;C:\Windows\system32;C:\Windows;C:\Windows\System32\Wbem;C:\Windows\System32\WindowsPowerShell\v1.0;C:\Windows\System32\OpenSSH;C:\Program Files\dotnet;C:\Users\adoptopenjdk\AppData\Local\Microsoft\WindowsApps;C:\Strawberry\perl\bin;C:\Program Files\Git\cmd;C:\openjdk\jdk-8\bin;C:\apache-ant\apache-ant-1.10.15\bin;C:\Program Files (x86)\IncrediBuild;C:\Program Files (x86)\Windows Kits\10\Windows Performance Toolkit;C:\rust\bin;C:\Program Files\IcedTeaWEB\bin;C:\Program Files\Microsoft SQL Server\110\Tools\Binn;C:\Program Files (x86)\Microsoft SDKs\TypeScript\1.0;C:\Program Files\Microsoft SQL Server\120\Tools\Binn;C:\Users\jenkins\AppData\Local\Microsoft\WindowsApps' \
[2024-12-05T09:44:00.410Z] SystemDrive=C: \
[2024-12-05T09:44:00.410Z] SystemRoot='C:\Windows' \
[2024-12-05T09:44:00.410Z] TEMP='C:\Users\jenkins\AppData\Local\Temp\3' \
[2024-12-05T09:44:00.410Z] TMP='C:\Users\jenkins\AppData\Local\Temp\3' \
[2024-12-05T09:44:00.410Z] windir='C:\Windows' \
[2024-12-05T09:44:00.410Z] CLASSPATH='C:\Jenkins\workspace\Test_openjdk17_hs_extended.openjdk_x86-64_windows_testList_2\aqa-tests\TKG\output_17333892671188\jdk_beans_0\work\classes\1\java\beans\PropertyEditor\TestFontClassJava.d;C:\Jenkins\workspace\Test_openjdk17_hs_extended.openjdk_x86-64_windows_testList_2\aqa-tests\openjdk\openjdk-jdk\test\jdk\java\beans\PropertyEditor;C:\Jenkins\workspace\Test_openjdk17_hs_extended.openjdk_x86-64_windows_testList_2\jvmtest\openjdk\jtreg\lib\javatest.jar;C:\Jenkins\workspace\Test_openjdk17_hs_extended.openjdk_x86-64_windows_testList_2\jvmtest\openjdk\jtreg\lib\jtreg.jar' \
[2024-12-05T09:44:00.410Z] 'c:\jenkins\workspace\Test_openjdk17_hs_extended.openjdk_x86-64_windows_testList_2\jdkbinary\j2sdk-image\bin\java' \
[2024-12-05T09:44:00.410Z] -Dtest.vm.opts='-ea -esa -Xmx512m -XX:+UseCompressedOops' \
[2024-12-05T09:44:00.410Z] -Dtest.tool.vm.opts='-J-ea -J-esa -J-Xmx512m -J-XX:+UseCompressedOops' \
[2024-12-05T09:44:00.410Z] -Dtest.compiler.opts= \
[2024-12-05T09:44:00.410Z] -Dtest.java.opts= \
[2024-12-05T09:44:00.410Z] -Dtest.jdk='c:\jenkins\workspace\Test_openjdk17_hs_extended.openjdk_x86-64_windows_testList_2\jdkbinary\j2sdk-image' \
[2024-12-05T09:44:00.410Z] -Dcompile.jdk='c:\jenkins\workspace\Test_openjdk17_hs_extended.openjdk_x86-64_windows_testList_2\jdkbinary\j2sdk-image' \
[2024-12-05T09:44:00.410Z] -Dtest.timeout.factor=8.0 \
[2024-12-05T09:44:00.410Z] -Dtest.nativepath='c:\jenkins\workspace\Test_openjdk17_hs_extended.openjdk_x86-64_windows_testList_2\jdkbinary\openjdk-test-image\jdk\jtreg\native' \
[2024-12-05T09:44:00.410Z] -Dtest.root='C:\Jenkins\workspace\Test_openjdk17_hs_extended.openjdk_x86-64_windows_testList_2\aqa-tests\openjdk\openjdk-jdk\test\jdk' \
[2024-12-05T09:44:00.410Z] -Dtest.name=java/beans/PropertyEditor/TestFontClassJava.java \
[2024-12-05T09:44:00.410Z] -Dtest.file='C:\Jenkins\workspace\Test_openjdk17_hs_extended.openjdk_x86-64_windows_testList_2\aqa-tests\openjdk\openjdk-jdk\test\jdk\java\beans\PropertyEditor\TestFontClassJava.java' \
[2024-12-05T09:44:00.411Z] -Dtest.src='C:\Jenkins\workspace\Test_openjdk17_hs_extended.openjdk_x86-64_windows_testList_2\aqa-tests\openjdk\openjdk-jdk\test\jdk\java\beans\PropertyEditor' \
[2024-12-05T09:44:00.411Z] -Dtest.src.path='C:\Jenkins\workspace\Test_openjdk17_hs_extended.openjdk_x86-64_windows_testList_2\aqa-tests\openjdk\openjdk-jdk\test\jdk\java\beans\PropertyEditor' \
[2024-12-05T09:44:00.411Z] -Dtest.classes='C:\Jenkins\workspace\Test_openjdk17_hs_extended.openjdk_x86-64_windows_testList_2\aqa-tests\TKG\output_17333892671188\jdk_beans_0\work\classes\1\java\beans\PropertyEditor\TestFontClassJava.d' \
[2024-12-05T09:44:00.411Z] -Dtest.class.path='C:\Jenkins\workspace\Test_openjdk17_hs_extended.openjdk_x86-64_windows_testList_2\aqa-tests\TKG\output_17333892671188\jdk_beans_0\work\classes\1\java\beans\PropertyEditor\TestFontClassJava.d' \
[2024-12-05T09:44:00.411Z] -Dtest.modules='java.compiler java.desktop jdk.compiler' \
[2024-12-05T09:44:00.411Z] --add-modules java.compiler,java.desktop,jdk.compiler \
[2024-12-05T09:44:00.411Z] -ea \
[2024-12-05T09:44:00.411Z] -esa \
[2024-12-05T09:44:00.411Z] -Xmx512m \
[2024-12-05T09:44:00.411Z] -XX:+UseCompressedOops \
[2024-12-05T09:44:00.411Z] '-Djava.library.path=c:\jenkins\workspace\Test_openjdk17_hs_extended.openjdk_x86-64_windows_testList_2\jdkbinary\openjdk-test-image\jdk\jtreg\native' \
[2024-12-05T09:44:00.411Z] com.sun.javatest.regtest.agent.MainWrapper 'C:\Jenkins\workspace\Test_openjdk17_hs_extended.openjdk_x86-64_windows_testList_2\aqa-tests\TKG\output_17333892671188\jdk_beans_0\work\java\beans\PropertyEditor\TestFontClassJava.d\main.0.jta'
[2024-12-05T09:44:00.411Z]
[2024-12-05T09:44:00.411Z] TEST RESULT: Failed. Execution failed: `main' threw exception: java.lang.Error: could not find editor for class java.awt.Font
[2024-12-05T09:44:00.411Z] --------------------------------------------------
[2024-12-05T09:44:00.411Z] TEST: java/beans/PropertyEditor/TestFontClassValue.java
[2024-12-05T09:44:00.411Z] TEST JDK: c:\jenkins\workspace\Test_openjdk17_hs_extended.openjdk_x86-64_windows_testList_2\jdkbinary\j2sdk-image
[2024-12-05T09:44:00.411Z]
[2024-12-05T09:44:00.411Z] ACTION: build -- Passed. Build successful
[2024-12-05T09:44:00.411Z] REASON: Named class compiled on demand
[2024-12-05T09:44:00.411Z] TIME: 2.507 seconds
[2024-12-05T09:44:00.411Z] messages:
[2024-12-05T09:44:00.411Z] command: build TestFontClassValue
[2024-12-05T09:44:00.411Z] reason: Named class compiled on demand
[2024-12-05T09:44:00.411Z] started: Thu Dec 05 09:43:57 UTC 2024
[2024-12-05T09:44:00.411Z] Test directory:
[2024-12-05T09:44:00.411Z] compile: TestFontClassValue
[2024-12-05T09:44:00.411Z] finished: Thu Dec 05 09:43:59 UTC 2024
[2024-12-05T09:44:00.411Z] elapsed time (seconds): 2.507
[2024-12-05T09:44:00.411Z]
[2024-12-05T09:44:00.411Z] ACTION: compile -- Passed. Compilation successful
[2024-12-05T09:44:00.411Z] REASON: .class file out of date or does not exist
[2024-12-05T09:44:00.411Z] TIME: 2.506 seconds
[2024-12-05T09:44:00.411Z] messages:
[2024-12-05T09:44:00.411Z] command: compile C:\Jenkins\workspace\Test_openjdk17_hs_extended.openjdk_x86-64_windows_testList_2\aqa-tests\openjdk\openjdk-jdk\test\jdk\java\beans\PropertyEditor\TestFontClassValue.java
[2024-12-05T09:44:00.411Z] reason: .class file out of date or does not exist
[2024-12-05T09:44:00.411Z] started: Thu Dec 05 09:43:57 UTC 2024
[2024-12-05T09:44:00.411Z] Additional options from @modules: --add-modules java.compiler,java.desktop,jdk.compiler
[2024-12-05T09:44:00.411Z] Mode: othervm
[2024-12-05T09:44:00.411Z] finished: Thu Dec 05 09:43:59 UTC 2024
[2024-12-05T09:44:00.411Z] elapsed time (seconds): 2.506
[2024-12-05T09:44:00.411Z] configuration:
[2024-12-05T09:44:00.411Z] javac compilation environment
[2024-12-05T09:44:00.411Z] add modules: java.compiler java.desktop jdk.compiler
[2024-12-05T09:44:00.411Z] source path: C:\Jenkins\workspace\Test_openjdk17_hs_extended.openjdk_x86-64_windows_testList_2\aqa-tests\openjdk\openjdk-jdk\test\jdk\java\beans\PropertyEditor
[2024-12-05T09:44:00.411Z] class path: C:\Jenkins\workspace\Test_openjdk17_hs_extended.openjdk_x86-64_windows_testList_2\aqa-tests\openjdk\openjdk-jdk\test\jdk\java\beans\PropertyEditor
[2024-12-05T09:44:00.411Z] C:\Jenkins\workspace\Test_openjdk17_hs_extended.openjdk_x86-64_windows_testList_2\aqa-tests\TKG\output_17333892671188\jdk_beans_0\work\classes\0\java\beans\PropertyEditor\TestFontClassValue.d
[2024-12-05T09:44:00.411Z]
[2024-12-05T09:44:00.411Z] rerun:
[2024-12-05T09:44:00.411Z] cd 'C:\Jenkins\workspace\Test_openjdk17_hs_extended.openjdk_x86-64_windows_testList_2\aqa-tests\TKG\output_17333892671188\jdk_beans_0\work\java\beans\PropertyEditor\TestFontClassValue' && \
[2024-12-05T09:44:00.411Z] PATH='C:\Program Files\Java\jdk-17.0.8.1+1\bin;C:\cygwin64\bin;C:\Windows\system32;C:\Windows;C:\Windows\System32\Wbem;C:\Windows\System32\WindowsPowerShell\v1.0;C:\Windows\System32\OpenSSH;C:\Program Files\dotnet;C:\Users\adoptopenjdk\AppData\Local\Microsoft\WindowsApps;C:\Strawberry\perl\bin;C:\Program Files\Git\cmd;C:\openjdk\jdk-8\bin;C:\apache-ant\apache-ant-1.10.15\bin;C:\Program Files (x86)\IncrediBuild;C:\Program Files (x86)\Windows Kits\10\Windows Performance Toolkit;C:\rust\bin;C:\Program Files\IcedTeaWEB\bin;C:\Program Files\Microsoft SQL Server\110\Tools\Binn;C:\Program Files (x86)\Microsoft SDKs\TypeScript\1.0;C:\Program Files\Microsoft SQL Server\120\Tools\Binn;C:\Users\jenkins\AppData\Local\Microsoft\WindowsApps' \
[2024-12-05T09:44:00.411Z] SystemDrive=C: \
[2024-12-05T09:44:00.411Z] SystemRoot='C:\Windows' \
[2024-12-05T09:44:00.411Z] TEMP='C:\Users\jenkins\AppData\Local\Temp\3' \
[2024-12-05T09:44:00.411Z] TMP='C:\Users\jenkins\AppData\Local\Temp\3' \
[2024-12-05T09:44:00.411Z] windir='C:\Windows' \
[2024-12-05T09:44:00.411Z] 'c:\jenkins\workspace\Test_openjdk17_hs_extended.openjdk_x86-64_windows_testList_2\jdkbinary\j2sdk-image\bin\javac' \
[2024-12-05T09:44:00.411Z] -J-ea \
[2024-12-05T09:44:00.411Z] -J-esa \
[2024-12-05T09:44:00.411Z] -J-Xmx512m \
[2024-12-05T09:44:00.411Z] -J-XX:+UseCompressedOops \
[2024-12-05T09:44:00.411Z] -J-Dtest.vm.opts='-ea -esa -Xmx512m -XX:+UseCompressedOops' \
[2024-12-05T09:44:00.411Z] -J-Dtest.tool.vm.opts='-J-ea -J-esa -J-Xmx512m -J-XX:+UseCompressedOops' \
[2024-12-05T09:44:00.411Z] -J-Dtest.compiler.opts= \
[2024-12-05T09:44:00.411Z] -J-Dtest.java.opts= \
[2024-12-05T09:44:00.411Z] -J-Dtest.jdk='c:\jenkins\workspace\Test_openjdk17_hs_extended.openjdk_x86-64_windows_testList_2\jdkbinary\j2sdk-image' \
[2024-12-05T09:44:00.411Z] -J-Dcompile.jdk='c:\jenkins\workspace\Test_openjdk17_hs_extended.openjdk_x86-64_windows_testList_2\jdkbinary\j2sdk-image' \
[2024-12-05T09:44:00.411Z] -J-Dtest.timeout.factor=8.0 \
[2024-12-05T09:44:00.411Z] -J-Dtest.nativepath='c:\jenkins\workspace\Test_openjdk17_hs_extended.openjdk_x86-64_windows_testList_2\jdkbinary\openjdk-test-image\jdk\jtreg\native' \
[2024-12-05T09:44:00.411Z] -J-Dtest.root='C:\Jenkins\workspace\Test_openjdk17_hs_extended.openjdk_x86-64_windows_testList_2\aqa-tests\openjdk\openjdk-jdk\test\jdk' \
[2024-12-05T09:44:00.411Z] -J-Dtest.name=java/beans/PropertyEditor/TestFontClassValue.java \
[2024-12-05T09:44:00.411Z] -J-Dtest.file='C:\Jenkins\workspace\Test_openjdk17_hs_extended.openjdk_x86-64_windows_testList_2\aqa-tests\openjdk\openjdk-jdk\test\jdk\java\beans\PropertyEditor\TestFontClassValue.java' \
[2024-12-05T09:44:00.411Z] -J-Dtest.src='C:\Jenkins\workspace\Test_openjdk17_hs_extended.openjdk_x86-64_windows_testList_2\aqa-tests\openjdk\openjdk-jdk\test\jdk\java\beans\PropertyEditor' \
[2024-12-05T09:44:00.411Z] -J-Dtest.src.path='C:\Jenkins\workspace\Test_openjdk17_hs_extended.openjdk_x86-64_windows_testList_2\aqa-tests\openjdk\openjdk-jdk\test\jdk\java\beans\PropertyEditor' \
[2024-12-05T09:44:00.411Z] -J-Dtest.classes='C:\Jenkins\workspace\Test_openjdk17_hs_extended.openjdk_x86-64_windows_testList_2\aqa-tests\TKG\output_17333892671188\jdk_beans_0\work\classes\0\java\beans\PropertyEditor\TestFontClassValue.d' \
[2024-12-05T09:44:00.411Z] -J-Dtest.class.path='C:\Jenkins\workspace\Test_openjdk17_hs_extended.openjdk_x86-64_windows_testList_2\aqa-tests\TKG\output_17333892671188\jdk_beans_0\work\classes\0\java\beans\PropertyEditor\TestFontClassValue.d' \
[2024-12-05T09:44:00.411Z] -J-Dtest.modules='java.compiler java.desktop jdk.compiler' \
[2024-12-05T09:44:00.411Z] --add-modules java.compiler,java.desktop,jdk.compiler \
[2024-12-05T09:44:00.411Z] -d 'C:\Jenkins\workspace\Test_openjdk17_hs_extended.openjdk_x86-64_windows_testList_2\aqa-tests\TKG\output_17333892671188\jdk_beans_0\work\classes\0\java\beans\PropertyEditor\TestFontClassValue.d' \
[2024-12-05T09:44:00.411Z] -sourcepath 'C:\Jenkins\workspace\Test_openjdk17_hs_extended.openjdk_x86-64_windows_testList_2\aqa-tests\openjdk\openjdk-jdk\test\jdk\java\beans\PropertyEditor' \
[2024-12-05T09:44:00.411Z] -classpath 'C:\Jenkins\workspace\Test_openjdk17_hs_extended.openjdk_x86-64_windows_testList_2\aqa-tests\openjdk\openjdk-jdk\test\jdk\java\beans\PropertyEditor;C:\Jenkins\workspace\Test_openjdk17_hs_extended.openjdk_x86-64_windows_testList_2\aqa-tests\TKG\output_17333892671188\jdk_beans_0\work\classes\0\java\beans\PropertyEditor\TestFontClassValue.d' 'C:\Jenkins\workspace\Test_openjdk17_hs_extended.openjdk_x86-64_windows_testList_2\aqa-tests\openjdk\openjdk-jdk\test\jdk\java\beans\PropertyEditor\TestFontClassValue.java'
[2024-12-05T09:44:00.411Z] STDOUT:
[2024-12-05T09:44:00.411Z] STDERR:
[2024-12-05T09:44:00.411Z] Note: C:\Jenkins\workspace\Test_openjdk17_hs_extended.openjdk_x86-64_windows_testList_2\aqa-tests\openjdk\openjdk-jdk\test\jdk\java\beans\PropertyEditor\TestEditor.java uses unchecked or unsafe operations.
[2024-12-05T09:44:00.411Z] Note: Recompile with -Xlint:unchecked for details.
[2024-12-05T09:44:00.411Z]
[2024-12-05T09:44:00.411Z] ACTION: main -- Failed. Execution failed: `main' threw exception: java.lang.Error: could not find editor for class java.awt.Font
[2024-12-05T09:44:00.411Z] REASON: Assumed action based on file name: run main TestFontClassValue
[2024-12-05T09:44:00.411Z] TIME: 0.65 seconds
[2024-12-05T09:44:00.411Z] messages:
[2024-12-05T09:44:00.411Z] command: main TestFontClassValue
[2024-12-05T09:44:00.411Z] reason: Assumed action based on file name: run main TestFontClassValue
[2024-12-05T09:44:00.411Z] started: Thu Dec 05 09:43:59 UTC 2024
[2024-12-05T09:44:00.411Z] Mode: othervm
[2024-12-05T09:44:00.412Z] Additional options from @modules: --add-modules java.compiler,java.desktop,jdk.compiler
[2024-12-05T09:44:00.412Z] finished: Thu Dec 05 09:44:00 UTC 2024
[2024-12-05T09:44:00.412Z] elapsed time (seconds): 0.65
[2024-12-05T09:44:00.412Z] configuration:
[2024-12-05T09:44:00.412Z] Boot Layer
[2024-12-05T09:44:00.412Z] add modules: java.compiler java.desktop jdk.compiler
[2024-12-05T09:44:00.412Z]
[2024-12-05T09:44:00.412Z] STDOUT:
[2024-12-05T09:44:00.412Z] Property class: class java.awt.Font
[2024-12-05T09:44:00.412Z] STDERR:
[2024-12-05T09:44:00.412Z] java.lang.Error: could not find editor for class java.awt.Font
[2024-12-05T09:44:00.412Z] at TestEditor.<init>(TestEditor.java:35)
[2024-12-05T09:44:00.412Z] at TestFontClassValue.main(TestFontClassValue.java:39)
[2024-12-05T09:44:00.412Z] at java.base/jdk.internal.reflect.NativeMethodAccessorImpl.invoke0(Native Method)
[2024-12-05T09:44:00.412Z] at java.base/jdk.internal.reflect.NativeMethodAccessorImpl.invoke(NativeMethodAccessorImpl.java:77)
[2024-12-05T09:44:00.412Z] at java.base/jdk.internal.reflect.DelegatingMethodAccessorImpl.invoke(DelegatingMethodAccessorImpl.java:43)
[2024-12-05T09:44:00.412Z] at java.base/java.lang.reflect.Method.invoke(Method.java:569)
[2024-12-05T09:44:00.412Z] at com.sun.javatest.regtest.agent.MainWrapper$MainTask.run(MainWrapper.java:138)
[2024-12-05T09:44:00.412Z] at java.base/java.lang.Thread.run(Thread.java:840)
[2024-12-05T09:44:00.412Z]
[2024-12-05T09:44:00.412Z] JavaTest Message: Test threw exception: java.lang.Error: could not find editor for class java.awt.Font
[2024-12-05T09:44:00.412Z] JavaTest Message: shutting down test
[2024-12-05T09:44:00.412Z]
[2024-12-05T09:44:00.412Z] STATUS:Failed.`main' threw exception: java.lang.Error: could not find editor for class java.awt.Font
[2024-12-05T09:44:00.412Z] rerun:
[2024-12-05T09:44:00.412Z] cd 'C:\Jenkins\workspace\Test_openjdk17_hs_extended.openjdk_x86-64_windows_testList_2\aqa-tests\TKG\output_17333892671188\jdk_beans_0\work\java\beans\PropertyEditor\TestFontClassValue' && \
[2024-12-05T09:44:00.412Z] PATH='C:\Program Files\Java\jdk-17.0.8.1+1\bin;C:\cygwin64\bin;C:\Windows\system32;C:\Windows;C:\Windows\System32\Wbem;C:\Windows\System32\WindowsPowerShell\v1.0;C:\Windows\System32\OpenSSH;C:\Program Files\dotnet;C:\Users\adoptopenjdk\AppData\Local\Microsoft\WindowsApps;C:\Strawberry\perl\bin;C:\Program Files\Git\cmd;C:\openjdk\jdk-8\bin;C:\apache-ant\apache-ant-1.10.15\bin;C:\Program Files (x86)\IncrediBuild;C:\Program Files (x86)\Windows Kits\10\Windows Performance Toolkit;C:\rust\bin;C:\Program Files\IcedTeaWEB\bin;C:\Program Files\Microsoft SQL Server\110\Tools\Binn;C:\Program Files (x86)\Microsoft SDKs\TypeScript\1.0;C:\Program Files\Microsoft SQL Server\120\Tools\Binn;C:\Users\jenkins\AppData\Local\Microsoft\WindowsApps' \
[2024-12-05T09:44:00.412Z] SystemDrive=C: \
[2024-12-05T09:44:00.412Z] SystemRoot='C:\Windows' \
[2024-12-05T09:44:00.412Z] TEMP='C:\Users\jenkins\AppData\Local\Temp\3' \
[2024-12-05T09:44:00.412Z] TMP='C:\Users\jenkins\AppData\Local\Temp\3' \
[2024-12-05T09:44:00.412Z] windir='C:\Windows' \
[2024-12-05T09:44:00.412Z] CLASSPATH='C:\Jenkins\workspace\Test_openjdk17_hs_extended.openjdk_x86-64_windows_testList_2\aqa-tests\TKG\output_17333892671188\jdk_beans_0\work\classes\0\java\beans\PropertyEditor\TestFontClassValue.d;C:\Jenkins\workspace\Test_openjdk17_hs_extended.openjdk_x86-64_windows_testList_2\aqa-tests\openjdk\openjdk-jdk\test\jdk\java\beans\PropertyEditor;C:\Jenkins\workspace\Test_openjdk17_hs_extended.openjdk_x86-64_windows_testList_2\jvmtest\openjdk\jtreg\lib\javatest.jar;C:\Jenkins\workspace\Test_openjdk17_hs_extended.openjdk_x86-64_windows_testList_2\jvmtest\openjdk\jtreg\lib\jtreg.jar' \
[2024-12-05T09:44:00.412Z] 'c:\jenkins\workspace\Test_openjdk17_hs_extended.openjdk_x86-64_windows_testList_2\jdkbinary\j2sdk-image\bin\java' \
[2024-12-05T09:44:00.412Z] -Dtest.vm.opts='-ea -esa -Xmx512m -XX:+UseCompressedOops' \
[2024-12-05T09:44:00.412Z] -Dtest.tool.vm.opts='-J-ea -J-esa -J-Xmx512m -J-XX:+UseCompressedOops' \
[2024-12-05T09:44:00.412Z] -Dtest.compiler.opts= \
[2024-12-05T09:44:00.412Z] -Dtest.java.opts= \
[2024-12-05T09:44:00.412Z] -Dtest.jdk='c:\jenkins\workspace\Test_openjdk17_hs_extended.openjdk_x86-64_windows_testList_2\jdkbinary\j2sdk-image' \
[2024-12-05T09:44:00.412Z] -Dcompile.jdk='c:\jenkins\workspace\Test_openjdk17_hs_extended.openjdk_x86-64_windows_testList_2\jdkbinary\j2sdk-image' \
[2024-12-05T09:44:00.412Z] -Dtest.timeout.factor=8.0 \
[2024-12-05T09:44:00.412Z] -Dtest.nativepath='c:\jenkins\workspace\Test_openjdk17_hs_extended.openjdk_x86-64_windows_testList_2\jdkbinary\openjdk-test-image\jdk\jtreg\native' \
[2024-12-05T09:44:00.412Z] -Dtest.root='C:\Jenkins\workspace\Test_openjdk17_hs_extended.openjdk_x86-64_windows_testList_2\aqa-tests\openjdk\openjdk-jdk\test\jdk' \
[2024-12-05T09:44:00.412Z] -Dtest.name=java/beans/PropertyEditor/TestFontClassValue.java \
[2024-12-05T09:44:00.412Z] -Dtest.file='C:\Jenkins\workspace\Test_openjdk17_hs_extended.openjdk_x86-64_windows_testList_2\aqa-tests\openjdk\openjdk-jdk\test\jdk\java\beans\PropertyEditor\TestFontClassValue.java' \
[2024-12-05T09:44:00.412Z] -Dtest.src='C:\Jenkins\workspace\Test_openjdk17_hs_extended.openjdk_x86-64_windows_testList_2\aqa-tests\openjdk\openjdk-jdk\test\jdk\java\beans\PropertyEditor' \
[2024-12-05T09:44:00.412Z] -Dtest.src.path='C:\Jenkins\workspace\Test_openjdk17_hs_extended.openjdk_x86-64_windows_testList_2\aqa-tests\openjdk\openjdk-jdk\test\jdk\java\beans\PropertyEditor' \
[2024-12-05T09:44:00.412Z] -Dtest.classes='C:\Jenkins\workspace\Test_openjdk17_hs_extended.openjdk_x86-64_windows_testList_2\aqa-tests\TKG\output_17333892671188\jdk_beans_0\work\classes\0\java\beans\PropertyEditor\TestFontClassValue.d' \
[2024-12-05T09:44:00.412Z] -Dtest.class.path='C:\Jenkins\workspace\Test_openjdk17_hs_extended.openjdk_x86-64_windows_testList_2\aqa-tests\TKG\output_17333892671188\jdk_beans_0\work\classes\0\java\beans\PropertyEditor\TestFontClassValue.d' \
[2024-12-05T09:44:00.412Z] -Dtest.modules='java.compiler java.desktop jdk.compiler' \
[2024-12-05T09:44:00.412Z] --add-modules java.compiler,java.desktop,jdk.compiler \
[2024-12-05T09:44:00.412Z] -ea \
[2024-12-05T09:44:00.413Z] -esa \
[2024-12-05T09:44:00.413Z] -Xmx512m \
[2024-12-05T09:44:00.413Z] -XX:+UseCompressedOops \
[2024-12-05T09:44:00.413Z] '-Djava.library.path=c:\jenkins\workspace\Test_openjdk17_hs_extended.openjdk_x86-64_windows_testList_2\jdkbinary\openjdk-test-image\jdk\jtreg\native' \
[2024-12-05T09:44:00.413Z] com.sun.javatest.regtest.agent.MainWrapper 'C:\Jenkins\workspace\Test_openjdk17_hs_extended.openjdk_x86-64_windows_testList_2\aqa-tests\TKG\output_17333892671188\jdk_beans_0\work\java\beans\PropertyEditor\TestFontClassValue.d\main.0.jta'
[2024-12-05T09:44:00.413Z]
[2024-12-05T09:44:00.413Z] TEST RESULT: Failed. Execution failed: `main' threw exception: java.lang.Error: could not find editor for class java.awt.Font
[2024-12-05T09:44:00.413Z] --------------------------------------------------
[2024-12-05T09:46:09.284Z] TEST: java/beans/XMLEncoder/java_awt_ScrollPane.java
[2024-12-05T09:46:09.284Z] TEST JDK: c:\jenkins\workspace\Test_openjdk17_hs_extended.openjdk_x86-64_windows_testList_2\jdkbinary\j2sdk-image
[2024-12-05T09:46:09.284Z]
[2024-12-05T09:46:09.284Z] ACTION: build -- Passed. Build successful
[2024-12-05T09:46:09.284Z] REASON: Named class compiled on demand
[2024-12-05T09:46:09.284Z] TIME: 2.672 seconds
[2024-12-05T09:46:09.284Z] messages:
[2024-12-05T09:46:09.284Z] command: build java_awt_ScrollPane
[2024-12-05T09:46:09.284Z] reason: Named class compiled on demand
[2024-12-05T09:46:09.284Z] started: Thu Dec 05 09:46:05 UTC 2024
[2024-12-05T09:46:09.284Z] Test directory:
[2024-12-05T09:46:09.284Z] compile: java_awt_ScrollPane
[2024-12-05T09:46:09.284Z] finished: Thu Dec 05 09:46:08 UTC 2024
[2024-12-05T09:46:09.284Z] elapsed time (seconds): 2.672
[2024-12-05T09:46:09.284Z]
[2024-12-05T09:46:09.284Z] ACTION: compile -- Passed. Compilation successful
[2024-12-05T09:46:09.284Z] REASON: .class file out of date or does not exist
[2024-12-05T09:46:09.284Z] TIME: 2.671 seconds
[2024-12-05T09:46:09.284Z] messages:
[2024-12-05T09:46:09.284Z] command: compile C:\Jenkins\workspace\Test_openjdk17_hs_extended.openjdk_x86-64_windows_testList_2\aqa-tests\openjdk\openjdk-jdk\test\jdk\java\beans\XMLEncoder\java_awt_ScrollPane.java
[2024-12-05T09:46:09.284Z] reason: .class file out of date or does not exist
[2024-12-05T09:46:09.284Z] started: Thu Dec 05 09:46:05 UTC 2024
[2024-12-05T09:46:09.284Z] Additional options from @modules: --add-modules java.desktop
[2024-12-05T09:46:09.284Z] Mode: othervm
[2024-12-05T09:46:09.284Z] finished: Thu Dec 05 09:46:08 UTC 2024
[2024-12-05T09:46:09.284Z] elapsed time (seconds): 2.671
[2024-12-05T09:46:09.284Z] configuration:
[2024-12-05T09:46:09.284Z] javac compilation environment
[2024-12-05T09:46:09.284Z] add modules: java.desktop
[2024-12-05T09:46:09.284Z] source path: C:\Jenkins\workspace\Test_openjdk17_hs_extended.openjdk_x86-64_windows_testList_2\aqa-tests\openjdk\openjdk-jdk\test\jdk\java\beans\XMLEncoder
[2024-12-05T09:46:09.284Z] class path: C:\Jenkins\workspace\Test_openjdk17_hs_extended.openjdk_x86-64_windows_testList_2\aqa-tests\openjdk\openjdk-jdk\test\jdk\java\beans\XMLEncoder
[2024-12-05T09:46:09.284Z] C:\Jenkins\workspace\Test_openjdk17_hs_extended.openjdk_x86-64_windows_testList_2\aqa-tests\TKG\output_17333892671188\jdk_beans_0\work\classes\0\java\beans\XMLEncoder\java_awt_ScrollPane.d
[2024-12-05T09:46:09.284Z]
[2024-12-05T09:46:09.284Z] rerun:
[2024-12-05T09:46:09.284Z] cd 'C:\Jenkins\workspace\Test_openjdk17_hs_extended.openjdk_x86-64_windows_testList_2\aqa-tests\TKG\output_17333892671188\jdk_beans_0\work\java\beans\XMLEncoder\java_awt_ScrollPane' && \
[2024-12-05T09:46:09.284Z] PATH='C:\Program Files\Java\jdk-17.0.8.1+1\bin;C:\cygwin64\bin;C:\Windows\system32;C:\Windows;C:\Windows\System32\Wbem;C:\Windows\System32\WindowsPowerShell\v1.0;C:\Windows\System32\OpenSSH;C:\Program Files\dotnet;C:\Users\adoptopenjdk\AppData\Local\Microsoft\WindowsApps;C:\Strawberry\perl\bin;C:\Program Files\Git\cmd;C:\openjdk\jdk-8\bin;C:\apache-ant\apache-ant-1.10.15\bin;C:\Program Files (x86)\IncrediBuild;C:\Program Files (x86)\Windows Kits\10\Windows Performance Toolkit;C:\rust\bin;C:\Program Files\IcedTeaWEB\bin;C:\Program Files\Microsoft SQL Server\110\Tools\Binn;C:\Program Files (x86)\Microsoft SDKs\TypeScript\1.0;C:\Program Files\Microsoft SQL Server\120\Tools\Binn;C:\Users\jenkins\AppData\Local\Microsoft\WindowsApps' \
[2024-12-05T09:46:09.284Z] SystemDrive=C: \
[2024-12-05T09:46:09.284Z] SystemRoot='C:\Windows' \
[2024-12-05T09:46:09.284Z] TEMP='C:\Users\jenkins\AppData\Local\Temp\3' \
[2024-12-05T09:46:09.284Z] TMP='C:\Users\jenkins\AppData\Local\Temp\3' \
[2024-12-05T09:46:09.284Z] windir='C:\Windows' \
[2024-12-05T09:46:09.284Z] 'c:\jenkins\workspace\Test_openjdk17_hs_extended.openjdk_x86-64_windows_testList_2\jdkbinary\j2sdk-image\bin\javac' \
[2024-12-05T09:46:09.284Z] -J-ea \
[2024-12-05T09:46:09.284Z] -J-esa \
[2024-12-05T09:46:09.284Z] -J-Xmx512m \
[2024-12-05T09:46:09.284Z] -J-XX:+UseCompressedOops \
[2024-12-05T09:46:09.284Z] -J-Dtest.vm.opts='-ea -esa -Xmx512m -XX:+UseCompressedOops' \
[2024-12-05T09:46:09.284Z] -J-Dtest.tool.vm.opts='-J-ea -J-esa -J-Xmx512m -J-XX:+UseCompressedOops' \
[2024-12-05T09:46:09.284Z] -J-Dtest.compiler.opts= \
[2024-12-05T09:46:09.284Z] -J-Dtest.java.opts= \
[2024-12-05T09:46:09.284Z] -J-Dtest.jdk='c:\jenkins\workspace\Test_openjdk17_hs_extended.openjdk_x86-64_windows_testList_2\jdkbinary\j2sdk-image' \
[2024-12-05T09:46:09.284Z] -J-Dcompile.jdk='c:\jenkins\workspace\Test_openjdk17_hs_extended.openjdk_x86-64_windows_testList_2\jdkbinary\j2sdk-image' \
[2024-12-05T09:46:09.284Z] -J-Dtest.timeout.factor=8.0 \
[2024-12-05T09:46:09.284Z] -J-Dtest.nativepath='c:\jenkins\workspace\Test_openjdk17_hs_extended.openjdk_x86-64_windows_testList_2\jdkbinary\openjdk-test-image\jdk\jtreg\native' \
[2024-12-05T09:46:09.284Z] -J-Dtest.root='C:\Jenkins\workspace\Test_openjdk17_hs_extended.openjdk_x86-64_windows_testList_2\aqa-tests\openjdk\openjdk-jdk\test\jdk' \
[2024-12-05T09:46:09.284Z] -J-Dtest.name=java/beans/XMLEncoder/java_awt_ScrollPane.java \
[2024-12-05T09:46:09.284Z] -J-Dtest.file='C:\Jenkins\workspace\Test_openjdk17_hs_extended.openjdk_x86-64_windows_testList_2\aqa-tests\openjdk\openjdk-jdk\test\jdk\java\beans\XMLEncoder\java_awt_ScrollPane.java' \
[2024-12-05T09:46:09.284Z] -J-Dtest.src='C:\Jenkins\workspace\Test_openjdk17_hs_extended.openjdk_x86-64_windows_testList_2\aqa-tests\openjdk\openjdk-jdk\test\jdk\java\beans\XMLEncoder' \
[2024-12-05T09:46:09.284Z] -J-Dtest.src.path='C:\Jenkins\workspace\Test_openjdk17_hs_extended.openjdk_x86-64_windows_testList_2\aqa-tests\openjdk\openjdk-jdk\test\jdk\java\beans\XMLEncoder' \
[2024-12-05T09:46:09.284Z] -J-Dtest.classes='C:\Jenkins\workspace\Test_openjdk17_hs_extended.openjdk_x86-64_windows_testList_2\aqa-tests\TKG\output_17333892671188\jdk_beans_0\work\classes\0\java\beans\XMLEncoder\java_awt_ScrollPane.d' \
[2024-12-05T09:46:09.284Z] -J-Dtest.class.path='C:\Jenkins\workspace\Test_openjdk17_hs_extended.openjdk_x86-64_windows_testList_2\aqa-tests\TKG\output_17333892671188\jdk_beans_0\work\classes\0\java\beans\XMLEncoder\java_awt_ScrollPane.d' \
[2024-12-05T09:46:09.284Z] -J-Dtest.modules=java.desktop \
[2024-12-05T09:46:09.284Z] --add-modules java.desktop \
[2024-12-05T09:46:09.284Z] -d 'C:\Jenkins\workspace\Test_openjdk17_hs_extended.openjdk_x86-64_windows_testList_2\aqa-tests\TKG\output_17333892671188\jdk_beans_0\work\classes\0\java\beans\XMLEncoder\java_awt_ScrollPane.d' \
[2024-12-05T09:46:09.284Z] -sourcepath 'C:\Jenkins\workspace\Test_openjdk17_hs_extended.openjdk_x86-64_windows_testList_2\aqa-tests\openjdk\openjdk-jdk\test\jdk\java\beans\XMLEncoder' \
[2024-12-05T09:46:09.284Z] -classpath 'C:\Jenkins\workspace\Test_openjdk17_hs_extended.openjdk_x86-64_windows_testList_2\aqa-tests\openjdk\openjdk-jdk\test\jdk\java\beans\XMLEncoder;C:\Jenkins\workspace\Test_openjdk17_hs_extended.openjdk_x86-64_windows_testList_2\aqa-tests\TKG\output_17333892671188\jdk_beans_0\work\classes\0\java\beans\XMLEncoder\java_awt_ScrollPane.d' 'C:\Jenkins\workspace\Test_openjdk17_hs_extended.openjdk_x86-64_windows_testList_2\aqa-tests\openjdk\openjdk-jdk\test\jdk\java\beans\XMLEncoder\java_awt_ScrollPane.java'
[2024-12-05T09:46:09.284Z] STDOUT:
[2024-12-05T09:46:09.284Z] STDERR:
[2024-12-05T09:46:09.284Z] C:\Jenkins\workspace\Test_openjdk17_hs_extended.openjdk_x86-64_windows_testList_2\aqa-tests\openjdk\openjdk-jdk\test\jdk\java\beans\XMLEncoder\AbstractTest.java:118: warning: [removal] SecurityManager in java.lang has been deprecated and marked for removal
[2024-12-05T09:46:09.284Z] System.setSecurityManager(new SecurityManager());
[2024-12-05T09:46:09.284Z] ^
[2024-12-05T09:46:09.284Z] C:\Jenkins\workspace\Test_openjdk17_hs_extended.openjdk_x86-64_windows_testList_2\aqa-tests\openjdk\openjdk-jdk\test\jdk\java\beans\XMLEncoder\AbstractTest.java:118: warning: [removal] setSecurityManager(SecurityManager) in System has been deprecated and marked for removal
[2024-12-05T09:46:09.284Z] System.setSecurityManager(new SecurityManager());
[2024-12-05T09:46:09.284Z] ^
[2024-12-05T09:46:09.284Z] Note: Some input files use unchecked or unsafe operations.
[2024-12-05T09:46:09.284Z] Note: Recompile with -Xlint:unchecked for details.
[2024-12-05T09:46:09.284Z] 2 warnings
[2024-12-05T09:46:09.284Z]
[2024-12-05T09:46:09.284Z] ACTION: main -- Failed. Execution failed: `main' threw exception: java.awt.HeadlessException: The application does not have desktop access, but this program performed an operation which requires it.
[2024-12-05T09:46:09.284Z] REASON: User specified action: run main/othervm -Djava.security.manager=allow java_awt_ScrollPane
[2024-12-05T09:46:09.284Z] TIME: 0.575 seconds
[2024-12-05T09:46:09.284Z] messages:
[2024-12-05T09:46:09.284Z] command: main -Djava.security.manager=allow java_awt_ScrollPane
[2024-12-05T09:46:09.284Z] reason: User specified action: run main/othervm -Djava.security.manager=allow java_awt_ScrollPane
[2024-12-05T09:46:09.284Z] started: Thu Dec 05 09:46:08 UTC 2024
[2024-12-05T09:46:09.284Z] Mode: othervm [/othervm specified]
[2024-12-05T09:46:09.284Z] Additional options from @modules: --add-modules java.desktop
[2024-12-05T09:46:09.284Z] finished: Thu Dec 05 09:46:09 UTC 2024
[2024-12-05T09:46:09.284Z] elapsed time (seconds): 0.575
[2024-12-05T09:46:09.284Z] configuration:
[2024-12-05T09:46:09.284Z] Boot Layer
[2024-12-05T09:46:09.284Z] add modules: java.desktop
[2024-12-05T09:46:09.284Z]
[2024-12-05T09:46:09.284Z] STDOUT:
[2024-12-05T09:46:09.284Z] STDERR:
[2024-12-05T09:46:09.284Z] java.awt.HeadlessException:
[2024-12-05T09:46:09.284Z] The application does not have desktop access,
[2024-12-05T09:46:09.284Z] but this program performed an operation which requires it.
[2024-12-05T09:46:09.284Z] at java.desktop/java.awt.GraphicsEnvironment.checkHeadless(GraphicsEnvironment.java:164)
[2024-12-05T09:46:09.284Z] at java.desktop/java.awt.ScrollPane.<init>(ScrollPane.java:210)
[2024-12-05T09:46:09.284Z] at java_awt_ScrollPane.getObject(java_awt_ScrollPane.java:41)
[2024-12-05T09:46:09.284Z] at java_awt_ScrollPane.getObject(java_awt_ScrollPane.java:35)
[2024-12-05T09:46:09.284Z] at AbstractTest.test(AbstractTest.java:100)
[2024-12-05T09:46:09.284Z] at java_awt_ScrollPane.main(java_awt_ScrollPane.java:37)
[2024-12-05T09:46:09.284Z] at java.base/jdk.internal.reflect.NativeMethodAccessorImpl.invoke0(Native Method)
[2024-12-05T09:46:09.285Z] at java.base/jdk.internal.reflect.NativeMethodAccessorImpl.invoke(NativeMethodAccessorImpl.java:77)
[2024-12-05T09:46:09.285Z] at java.base/jdk.internal.reflect.DelegatingMethodAccessorImpl.invoke(DelegatingMethodAccessorImpl.java:43)
[2024-12-05T09:46:09.285Z] at java.base/java.lang.reflect.Method.invoke(Method.java:569)
[2024-12-05T09:46:09.285Z] at com.sun.javatest.regtest.agent.MainWrapper$MainTask.run(MainWrapper.java:138)
[2024-12-05T09:46:09.285Z] at java.base/java.lang.Thread.run(Thread.java:840)
[2024-12-05T09:46:09.285Z]
[2024-12-05T09:46:09.285Z] JavaTest Message: Test threw exception: java.awt.HeadlessException:
[2024-12-05T09:46:09.285Z] The application does not have desktop access,
[2024-12-05T09:46:09.285Z] but this program performed an operation which requires it.
[2024-12-05T09:46:09.285Z] JavaTest Message: shutting down test
[2024-12-05T09:46:09.285Z]
[2024-12-05T09:46:09.285Z] STATUS:Failed.`main' threw exception: java.awt.HeadlessException: The application does not have desktop access, but this program performed an operation which requires it.
[2024-12-05T09:46:09.285Z] rerun:
[2024-12-05T09:46:09.285Z] cd 'C:\Jenkins\workspace\Test_openjdk17_hs_extended.openjdk_x86-64_windows_testList_2\aqa-tests\TKG\output_17333892671188\jdk_beans_0\work\java\beans\XMLEncoder\java_awt_ScrollPane' && \
[2024-12-05T09:46:09.285Z] PATH='C:\Program Files\Java\jdk-17.0.8.1+1\bin;C:\cygwin64\bin;C:\Windows\system32;C:\Windows;C:\Windows\System32\Wbem;C:\Windows\System32\WindowsPowerShell\v1.0;C:\Windows\System32\OpenSSH;C:\Program Files\dotnet;C:\Users\adoptopenjdk\AppData\Local\Microsoft\WindowsApps;C:\Strawberry\perl\bin;C:\Program Files\Git\cmd;C:\openjdk\jdk-8\bin;C:\apache-ant\apache-ant-1.10.15\bin;C:\Program Files (x86)\IncrediBuild;C:\Program Files (x86)\Windows Kits\10\Windows Performance Toolkit;C:\rust\bin;C:\Program Files\IcedTeaWEB\bin;C:\Program Files\Microsoft SQL Server\110\Tools\Binn;C:\Program Files (x86)\Microsoft SDKs\TypeScript\1.0;C:\Program Files\Microsoft SQL Server\120\Tools\Binn;C:\Users\jenkins\AppData\Local\Microsoft\WindowsApps' \
[2024-12-05T09:46:09.285Z] SystemDrive=C: \
[2024-12-05T09:46:09.285Z] SystemRoot='C:\Windows' \
[2024-12-05T09:46:09.285Z] TEMP='C:\Users\jenkins\AppData\Local\Temp\3' \
[2024-12-05T09:46:09.285Z] TMP='C:\Users\jenkins\AppData\Local\Temp\3' \
[2024-12-05T09:46:09.285Z] windir='C:\Windows' \
[2024-12-05T09:46:09.285Z] CLASSPATH='C:\Jenkins\workspace\Test_openjdk17_hs_extended.openjdk_x86-64_windows_testList_2\aqa-tests\TKG\output_17333892671188\jdk_beans_0\work\classes\0\java\beans\XMLEncoder\java_awt_ScrollPane.d;C:\Jenkins\workspace\Test_openjdk17_hs_extended.openjdk_x86-64_windows_testList_2\aqa-tests\openjdk\openjdk-jdk\test\jdk\java\beans\XMLEncoder;C:\Jenkins\workspace\Test_openjdk17_hs_extended.openjdk_x86-64_windows_testList_2\jvmtest\openjdk\jtreg\lib\javatest.jar;C:\Jenkins\workspace\Test_openjdk17_hs_extended.openjdk_x86-64_windows_testList_2\jvmtest\openjdk\jtreg\lib\jtreg.jar' \
[2024-12-05T09:46:09.285Z] 'c:\jenkins\workspace\Test_openjdk17_hs_extended.openjdk_x86-64_windows_testList_2\jdkbinary\j2sdk-image\bin\java' \
[2024-12-05T09:46:09.285Z] -Dtest.vm.opts='-ea -esa -Xmx512m -XX:+UseCompressedOops' \
[2024-12-05T09:46:09.285Z] -Dtest.tool.vm.opts='-J-ea -J-esa -J-Xmx512m -J-XX:+UseCompressedOops' \
[2024-12-05T09:46:09.285Z] -Dtest.compiler.opts= \
[2024-12-05T09:46:09.285Z] -Dtest.java.opts= \
[2024-12-05T09:46:09.285Z] -Dtest.jdk='c:\jenkins\workspace\Test_openjdk17_hs_extended.openjdk_x86-64_windows_testList_2\jdkbinary\j2sdk-image' \
[2024-12-05T09:46:09.285Z] -Dcompile.jdk='c:\jenkins\workspace\Test_openjdk17_hs_extended.openjdk_x86-64_windows_testList_2\jdkbinary\j2sdk-image' \
[2024-12-05T09:46:09.285Z] -Dtest.timeout.factor=8.0 \
[2024-12-05T09:46:09.285Z] -Dtest.nativepath='c:\jenkins\workspace\Test_openjdk17_hs_extended.openjdk_x86-64_windows_testList_2\jdkbinary\openjdk-test-image\jdk\jtreg\native' \
[2024-12-05T09:46:09.285Z] -Dtest.root='C:\Jenkins\workspace\Test_openjdk17_hs_extended.openjdk_x86-64_windows_testList_2\aqa-tests\openjdk\openjdk-jdk\test\jdk' \
[2024-12-05T09:46:09.285Z] -Dtest.name=java/beans/XMLEncoder/java_awt_ScrollPane.java \
[2024-12-05T09:46:09.285Z] -Dtest.file='C:\Jenkins\workspace\Test_openjdk17_hs_extended.openjdk_x86-64_windows_testList_2\aqa-tests\openjdk\openjdk-jdk\test\jdk\java\beans\XMLEncoder\java_awt_ScrollPane.java' \
[2024-12-05T09:46:09.285Z] -Dtest.src='C:\Jenkins\workspace\Test_openjdk17_hs_extended.openjdk_x86-64_windows_testList_2\aqa-tests\openjdk\openjdk-jdk\test\jdk\java\beans\XMLEncoder' \
[2024-12-05T09:46:09.285Z] -Dtest.src.path='C:\Jenkins\workspace\Test_openjdk17_hs_extended.openjdk_x86-64_windows_testList_2\aqa-tests\openjdk\openjdk-jdk\test\jdk\java\beans\XMLEncoder' \
[2024-12-05T09:46:09.285Z] -Dtest.classes='C:\Jenkins\workspace\Test_openjdk17_hs_extended.openjdk_x86-64_windows_testList_2\aqa-tests\TKG\output_17333892671188\jdk_beans_0\work\classes\0\java\beans\XMLEncoder\java_awt_ScrollPane.d' \
[2024-12-05T09:46:09.285Z] -Dtest.class.path='C:\Jenkins\workspace\Test_openjdk17_hs_extended.openjdk_x86-64_windows_testList_2\aqa-tests\TKG\output_17333892671188\jdk_beans_0\work\classes\0\java\beans\XMLEncoder\java_awt_ScrollPane.d' \
[2024-12-05T09:46:09.285Z] -Dtest.modules=java.desktop \
[2024-12-05T09:46:09.285Z] --add-modules java.desktop \
[2024-12-05T09:46:09.285Z] -ea \
[2024-12-05T09:46:09.285Z] -esa \
[2024-12-05T09:46:09.285Z] -Xmx512m \
[2024-12-05T09:46:09.285Z] -XX:+UseCompressedOops \
[2024-12-05T09:46:09.285Z] '-Djava.library.path=c:\jenkins\workspace\Test_openjdk17_hs_extended.openjdk_x86-64_windows_testList_2\jdkbinary\openjdk-test-image\jdk\jtreg\native' \
[2024-12-05T09:46:09.285Z] -Djava.security.manager=allow \
[2024-12-05T09:46:09.285Z] com.sun.javatest.regtest.agent.MainWrapper 'C:\Jenkins\workspace\Test_openjdk17_hs_extended.openjdk_x86-64_windows_testList_2\aqa-tests\TKG\output_17333892671188\jdk_beans_0\work\java\beans\XMLEncoder\java_awt_ScrollPane.d\main.0.jta'
[2024-12-05T09:46:09.285Z]
[2024-12-05T09:46:09.285Z] TEST RESULT: Failed. Execution failed: `main' threw exception: java.awt.HeadlessException: The application does not have desktop access, but this program performed an operation which requires it.
[2024-12-05T09:46:09.285Z] --------------------------------------------------
[2024-12-05T09:48:48.717Z] Test results: passed: 355; failed: 10
[2024-12-05T09:52:41.995Z] Report written to C:\Jenkins\workspace\Test_openjdk17_hs_extended.openjdk_x86-64_windows_testList_2\aqa-tests\TKG\output_17333892671188\jdk_beans_0\report\html\report.html
[2024-12-05T09:52:41.995Z] Results written to C:\Jenkins\workspace\Test_openjdk17_hs_extended.openjdk_x86-64_windows_testList_2\aqa-tests\TKG\output_17333892671188\jdk_beans_0\work
[2024-12-05T09:52:41.995Z] Error: Some tests failed or other problems occurred.
[2024-12-05T09:52:41.995Z] -----------------------------------
[2024-12-05T09:52:41.995Z] jdk_beans_0_FAILED
[2024-12-05T09:52:41.995Z] -----------------------------------
[2024-12-05T09:52:41.995Z]
[2024-12-05T09:52:41.995Z] TEST TEARDOWN:
[2024-12-05T09:52:41.995Z] Nothing to be done for teardown.
[2024-12-05T09:52:41.995Z] jdk_beans_0 Finish Time: Thu Dec 5 09:52:28 2024 Epoch Time (ms): 1733392348188