jdk_security3_0
[2025-01-07T23:55:01.369Z] Running test jdk_security3_0 ...
[2025-01-07T23:55:01.369Z] ===============================================
[2025-01-07T23:55:01.369Z] jdk_security3_0 Start Time: Tue Jan 7 23:54:59 2025 Epoch Time (ms): 1736294099268
[2025-01-07T23:55:01.369Z] variation: Mode150
[2025-01-07T23:55:01.369Z] JVM_OPTIONS: -XX:+UseCompressedOops
[2025-01-07T23:55:01.369Z] { \
[2025-01-07T23:55:01.369Z] echo ""; echo "TEST SETUP:"; \
[2025-01-07T23:55:01.369Z] echo "Nothing to be done for setup."; \
[2025-01-07T23:55:01.369Z] mkdir -p "/home/jenkins/workspace/Test_openjdk8_hs_extended.openjdk_x86-64_linux_testList_1/aqa-tests/TKG/../TKG/output_17362909043282/jdk_security3_0"; \
[2025-01-07T23:55:01.369Z] cd "/home/jenkins/workspace/Test_openjdk8_hs_extended.openjdk_x86-64_linux_testList_1/aqa-tests/TKG/../TKG/output_17362909043282/jdk_security3_0"; \
[2025-01-07T23:55:01.369Z] echo ""; echo "TESTING:"; \
[2025-01-07T23:55:01.369Z] "/home/jenkins/workspace/Test_openjdk8_hs_extended.openjdk_x86-64_linux_testList_1/jdkbinary/j2sdk-image/bin/java" -Xmx512m -jar "/home/jenkins/workspace/Test_openjdk8_hs_extended.openjdk_x86-64_linux_testList_1/aqa-tests/TKG/../../jvmtest/openjdk/jtreg/lib/jtreg.jar" \
[2025-01-07T23:55:01.369Z] -agentvm -a -ea -esa -v:fail,error,time,nopass -retain:fail,error,*.dmp,javacore.*,heapdump.*,*.trc -ignore:quiet -timeoutFactor:8 -xml:verify -concurrency:3 -vmoptions:"-Xmx512m -XX:+UseCompressedOops " \
[2025-01-07T23:55:01.369Z] \
[2025-01-07T23:55:01.369Z] -w ""/home/jenkins/workspace/Test_openjdk8_hs_extended.openjdk_x86-64_linux_testList_1/aqa-tests/TKG/../TKG/output_17362909043282/jdk_security3_0"/work" \
[2025-01-07T23:55:01.369Z] -r ""/home/jenkins/workspace/Test_openjdk8_hs_extended.openjdk_x86-64_linux_testList_1/aqa-tests/TKG/../TKG/output_17362909043282/jdk_security3_0"/report" \
[2025-01-07T23:55:01.369Z] -jdk:"/home/jenkins/workspace/Test_openjdk8_hs_extended.openjdk_x86-64_linux_testList_1/jdkbinary/j2sdk-image" \
[2025-01-07T23:55:01.369Z] -exclude:"/home/jenkins/workspace/Test_openjdk8_hs_extended.openjdk_x86-64_linux_testList_1/aqa-tests/TKG/../openjdk/openjdk-jdk/jdk/test/ProblemList.txt" \
[2025-01-07T23:55:01.369Z] -exclude:"/home/jenkins/workspace/Test_openjdk8_hs_extended.openjdk_x86-64_linux_testList_1/aqa-tests/TKG/../../jvmtest/openjdk/excludes/ProblemList_openjdk8.txt" \
[2025-01-07T23:55:01.369Z] \
[2025-01-07T23:55:01.369Z] \
[2025-01-07T23:55:01.369Z] "/home/jenkins/workspace/Test_openjdk8_hs_extended.openjdk_x86-64_linux_testList_1/aqa-tests/TKG/../openjdk/openjdk-jdk/jdk/test:jdk_security3"; \
[2025-01-07T23:55:01.369Z] if [ $? -eq 0 ]; then echo "-----------------------------------"; echo "jdk_security3_0""_PASSED"; echo "-----------------------------------"; cd /home/jenkins/workspace/Test_openjdk8_hs_extended.openjdk_x86-64_linux_testList_1/aqa-tests/TKG/..; else echo "-----------------------------------"; echo "jdk_security3_0""_FAILED"; echo "-----------------------------------"; fi; \
[2025-01-07T23:55:01.369Z] echo ""; echo "TEST TEARDOWN:"; \
[2025-01-07T23:55:01.369Z] echo "Nothing to be done for teardown."; \
[2025-01-07T23:55:01.369Z] } 2>&1 | tee -a "/home/jenkins/workspace/Test_openjdk8_hs_extended.openjdk_x86-64_linux_testList_1/aqa-tests/TKG/../TKG/output_17362909043282/TestTargetResult";
[2025-01-07T23:55:01.369Z]
[2025-01-07T23:55:01.369Z] TEST SETUP:
[2025-01-07T23:55:01.369Z] Nothing to be done for setup.
[2025-01-07T23:55:01.369Z]
[2025-01-07T23:55:01.369Z] TESTING:
[2025-01-07T23:55:01.369Z] Directory "/home/jenkins/workspace/Test_openjdk8_hs_extended.openjdk_x86-64_linux_testList_1/aqa-tests/TKG/../TKG/output_17362909043282/jdk_security3_0/work" not found: creating
[2025-01-07T23:55:01.369Z] Directory "/home/jenkins/workspace/Test_openjdk8_hs_extended.openjdk_x86-64_linux_testList_1/aqa-tests/TKG/../TKG/output_17362909043282/jdk_security3_0/report" not found: creating
[2025-01-07T23:55:03.197Z] XML output with verification to /home/jenkins/workspace/Test_openjdk8_hs_extended.openjdk_x86-64_linux_testList_1/aqa-tests/TKG/output_17362909043282/jdk_security3_0/work
[2025-01-08T00:18:00.859Z] --------------------------------------------------
[2025-01-08T00:18:00.859Z] TEST: sun/security/pkcs11/Provider/Login.sh
[2025-01-08T00:18:00.859Z] TEST JDK: /home/jenkins/workspace/Test_openjdk8_hs_extended.openjdk_x86-64_linux_testList_1/jdkbinary/j2sdk-image
[2025-01-08T00:18:00.859Z]
[2025-01-08T00:18:00.859Z] ACTION: shell -- Failed. Execution failed: exit code 1
[2025-01-08T00:18:00.859Z] REASON: User specified action: run shell Login.sh
[2025-01-08T00:18:00.859Z] TIME: 14.572 seconds
[2025-01-08T00:18:00.859Z] messages:
[2025-01-08T00:18:00.859Z] command: shell Login.sh
[2025-01-08T00:18:00.859Z] reason: User specified action: run shell Login.sh
[2025-01-08T00:18:00.859Z] elapsed time (seconds): 14.572
[2025-01-08T00:18:00.859Z] STDOUT:
[2025-01-08T00:18:00.859Z] TESTSRC=/home/jenkins/workspace/Test_openjdk8_hs_extended.openjdk_x86-64_linux_testList_1/aqa-tests/openjdk/openjdk-jdk/jdk/test/sun/security/pkcs11/Provider
[2025-01-08T00:18:00.859Z] TESTCLASSES=/home/jenkins/workspace/Test_openjdk8_hs_extended.openjdk_x86-64_linux_testList_1/aqa-tests/TKG/output_17362909043282/jdk_security3_0/work/classes/0/sun/security/pkcs11/Provider
[2025-01-08T00:18:00.859Z] TESTJAVA=/home/jenkins/workspace/Test_openjdk8_hs_extended.openjdk_x86-64_linux_testList_1/jdkbinary/j2sdk-image
[2025-01-08T00:18:00.859Z] COMPILEJAVA=/home/jenkins/workspace/Test_openjdk8_hs_extended.openjdk_x86-64_linux_testList_1/jdkbinary/j2sdk-image
[2025-01-08T00:18:00.859Z]
[2025-01-08T00:18:00.859Z] libsoftokn3 version = 3.105. ECC Basic.
[2025-01-08T00:18:00.859Z] Beginning test run Login...
[2025-01-08T00:18:00.859Z] STDERR:
[2025-01-08T00:18:00.859Z] Note: /home/jenkins/workspace/Test_openjdk8_hs_extended.openjdk_x86-64_linux_testList_1/aqa-tests/openjdk/openjdk-jdk/jdk/test/sun/security/pkcs11/Provider/Login.java uses or overrides a deprecated API.
[2025-01-08T00:18:00.859Z] Note: Recompile with -Xlint:deprecation for details.
[2025-01-08T00:18:00.859Z] Note: /home/jenkins/workspace/Test_openjdk8_hs_extended.openjdk_x86-64_linux_testList_1/aqa-tests/openjdk/openjdk-jdk/jdk/test/sun/security/pkcs11/Provider/../PKCS11Test.java uses unchecked or unsafe operations.
[2025-01-08T00:18:00.859Z] Note: Recompile with -Xlint:unchecked for details.
[2025-01-08T00:18:00.859Z] Exception in thread "main" java.lang.reflect.InvocationTargetException
[2025-01-08T00:18:00.859Z] at sun.reflect.NativeConstructorAccessorImpl.newInstance0(Native Method)
[2025-01-08T00:18:00.859Z] at sun.reflect.NativeConstructorAccessorImpl.newInstance(NativeConstructorAccessorImpl.java:62)
[2025-01-08T00:18:00.859Z] at sun.reflect.DelegatingConstructorAccessorImpl.newInstance(DelegatingConstructorAccessorImpl.java:45)
[2025-01-08T00:18:00.859Z] at java.lang.reflect.Constructor.newInstance(Constructor.java:423)
[2025-01-08T00:18:00.859Z] at PKCS11Test.getSunPKCS11(PKCS11Test.java:108)
[2025-01-08T00:18:00.859Z] at PKCS11Test.testNSS(PKCS11Test.java:486)
[2025-01-08T00:18:00.859Z] at PKCS11Test.main(PKCS11Test.java:156)
[2025-01-08T00:18:00.859Z] at PKCS11Test.main(PKCS11Test.java:137)
[2025-01-08T00:18:00.859Z] at Login.main(Login.java:39)
[2025-01-08T00:18:00.859Z] Caused by: java.security.ProviderException: Initialization failed
[2025-01-08T00:18:00.859Z] at sun.security.pkcs11.SunPKCS11.<init>(SunPKCS11.java:376)
[2025-01-08T00:18:00.859Z] at sun.security.pkcs11.SunPKCS11.<init>(SunPKCS11.java:103)
[2025-01-08T00:18:00.859Z] ... 9 more
[2025-01-08T00:18:00.859Z] Caused by: sun.security.pkcs11.wrapper.PKCS11Exception: 0xCE534351
[2025-01-08T00:18:00.859Z] at sun.security.pkcs11.wrapper.PKCS11.C_Initialize(Native Method)
[2025-01-08T00:18:00.859Z] at sun.security.pkcs11.wrapper.PKCS11$SynchronizedPKCS11.C_Initialize(PKCS11.java:1627)
[2025-01-08T00:18:00.859Z] at sun.security.pkcs11.wrapper.PKCS11.getInstance(PKCS11.java:163)
[2025-01-08T00:18:00.859Z] at sun.security.pkcs11.SunPKCS11.<init>(SunPKCS11.java:330)
[2025-01-08T00:18:00.859Z] ... 10 more
[2025-01-08T00:18:00.859Z] rerun:
[2025-01-08T00:18:00.859Z] cd /home/jenkins/workspace/Test_openjdk8_hs_extended.openjdk_x86-64_linux_testList_1/aqa-tests/TKG/output_17362909043282/jdk_security3_0/work/scratch/1 && \
[2025-01-08T00:18:00.859Z] DISPLAY=:0 \
[2025-01-08T00:18:00.859Z] HOME=/home/jenkins \
[2025-01-08T00:18:00.859Z] LANG=C.UTF-8 \
[2025-01-08T00:18:00.859Z] PATH=/bin:/usr/bin:/usr/sbin \
[2025-01-08T00:18:00.859Z] TESTFILE=/home/jenkins/workspace/Test_openjdk8_hs_extended.openjdk_x86-64_linux_testList_1/aqa-tests/openjdk/openjdk-jdk/jdk/test/sun/security/pkcs11/Provider/Login.sh \
[2025-01-08T00:18:00.859Z] TESTSRC=/home/jenkins/workspace/Test_openjdk8_hs_extended.openjdk_x86-64_linux_testList_1/aqa-tests/openjdk/openjdk-jdk/jdk/test/sun/security/pkcs11/Provider \
[2025-01-08T00:18:00.859Z] TESTSRCPATH=/home/jenkins/workspace/Test_openjdk8_hs_extended.openjdk_x86-64_linux_testList_1/aqa-tests/openjdk/openjdk-jdk/jdk/test/sun/security/pkcs11/Provider \
[2025-01-08T00:18:00.859Z] TESTCLASSES=/home/jenkins/workspace/Test_openjdk8_hs_extended.openjdk_x86-64_linux_testList_1/aqa-tests/TKG/output_17362909043282/jdk_security3_0/work/classes/0/sun/security/pkcs11/Provider \
[2025-01-08T00:18:00.859Z] TESTCLASSPATH=/home/jenkins/workspace/Test_openjdk8_hs_extended.openjdk_x86-64_linux_testList_1/aqa-tests/TKG/output_17362909043282/jdk_security3_0/work/classes/0/sun/security/pkcs11/Provider \
[2025-01-08T00:18:00.859Z] COMPILEJAVA=/home/jenkins/workspace/Test_openjdk8_hs_extended.openjdk_x86-64_linux_testList_1/jdkbinary/j2sdk-image \
[2025-01-08T00:18:00.859Z] TESTJAVA=/home/jenkins/workspace/Test_openjdk8_hs_extended.openjdk_x86-64_linux_testList_1/jdkbinary/j2sdk-image \
[2025-01-08T00:18:00.859Z] TESTVMOPTS='-ea -esa -Xmx512m -XX:+UseCompressedOops' \
[2025-01-08T00:18:00.859Z] TESTTOOLVMOPTS='-J-ea -J-esa -J-Xmx512m -J-XX:+UseCompressedOops' \
[2025-01-08T00:18:00.859Z] TESTJAVACOPTS= \
[2025-01-08T00:18:00.859Z] TESTJAVAOPTS= \
[2025-01-08T00:18:00.859Z] TESTTIMEOUTFACTOR=8.0 \
[2025-01-08T00:18:00.859Z] TESTROOT=/home/jenkins/workspace/Test_openjdk8_hs_extended.openjdk_x86-64_linux_testList_1/aqa-tests/openjdk/openjdk-jdk/jdk/test \
[2025-01-08T00:18:00.859Z] FS=/ \
[2025-01-08T00:18:00.859Z] PS=: \
[2025-01-08T00:18:00.859Z] NULL=/dev/null \
[2025-01-08T00:18:00.859Z] sh \
[2025-01-08T00:18:00.859Z] /home/jenkins/workspace/Test_openjdk8_hs_extended.openjdk_x86-64_linux_testList_1/aqa-tests/openjdk/openjdk-jdk/jdk/test/sun/security/pkcs11/Provider/Login.sh
[2025-01-08T00:18:00.859Z]
[2025-01-08T00:18:00.859Z] TEST RESULT: Failed. Execution failed: exit code 1
[2025-01-08T00:18:00.859Z] --------------------------------------------------
[2025-01-08T00:18:11.431Z] TEST: sun/security/pkcs11/Secmod/AddPrivateKey.java
[2025-01-08T00:18:11.431Z] TEST JDK: /home/jenkins/workspace/Test_openjdk8_hs_extended.openjdk_x86-64_linux_testList_1/jdkbinary/j2sdk-image
[2025-01-08T00:18:11.431Z]
[2025-01-08T00:18:11.431Z] ACTION: build -- Passed. Build successful
[2025-01-08T00:18:11.431Z] REASON: Named class compiled on demand
[2025-01-08T00:18:11.431Z] TIME: 1.209 seconds
[2025-01-08T00:18:11.431Z] messages:
[2025-01-08T00:18:11.431Z] command: build AddPrivateKey
[2025-01-08T00:18:11.431Z] reason: Named class compiled on demand
[2025-01-08T00:18:11.431Z] Test directory:
[2025-01-08T00:18:11.431Z] compile: AddPrivateKey
[2025-01-08T00:18:11.431Z] elapsed time (seconds): 1.209
[2025-01-08T00:18:11.431Z]
[2025-01-08T00:18:11.431Z] ACTION: compile -- Passed. Compilation successful
[2025-01-08T00:18:11.431Z] REASON: .class file out of date or does not exist
[2025-01-08T00:18:11.431Z] TIME: 1.209 seconds
[2025-01-08T00:18:11.431Z] messages:
[2025-01-08T00:18:11.431Z] command: compile -XDignore.symbol.file=true /home/jenkins/workspace/Test_openjdk8_hs_extended.openjdk_x86-64_linux_testList_1/aqa-tests/openjdk/openjdk-jdk/jdk/test/sun/security/pkcs11/Secmod/AddPrivateKey.java
[2025-01-08T00:18:11.431Z] reason: .class file out of date or does not exist
[2025-01-08T00:18:11.431Z] Mode: agentvm
[2025-01-08T00:18:11.431Z] Agent id: 1
[2025-01-08T00:18:11.431Z] elapsed time (seconds): 1.209
[2025-01-08T00:18:11.431Z] configuration:
[2025-01-08T00:18:11.431Z] Boot Layer (javac runtime environment)
[2025-01-08T00:18:11.431Z] class path: /home/jenkins/workspace/Test_openjdk8_hs_extended.openjdk_x86-64_linux_testList_1/jdkbinary/j2sdk-image/lib/tools.jar
[2025-01-08T00:18:11.431Z] /home/jenkins/workspace/Test_openjdk8_hs_extended.openjdk_x86-64_linux_testList_1/jvmtest/openjdk/jtreg/lib/javatest.jar
[2025-01-08T00:18:11.431Z] /home/jenkins/workspace/Test_openjdk8_hs_extended.openjdk_x86-64_linux_testList_1/jvmtest/openjdk/jtreg/lib/jtreg.jar
[2025-01-08T00:18:11.431Z]
[2025-01-08T00:18:11.431Z] javac compilation environment
[2025-01-08T00:18:11.431Z] source path: /home/jenkins/workspace/Test_openjdk8_hs_extended.openjdk_x86-64_linux_testList_1/aqa-tests/openjdk/openjdk-jdk/jdk/test/sun/security/pkcs11/Secmod
[2025-01-08T00:18:11.431Z] /home/jenkins/workspace/Test_openjdk8_hs_extended.openjdk_x86-64_linux_testList_1/aqa-tests/openjdk/openjdk-jdk/jdk/test/sun/security/pkcs11
[2025-01-08T00:18:11.431Z] class path: /home/jenkins/workspace/Test_openjdk8_hs_extended.openjdk_x86-64_linux_testList_1/aqa-tests/openjdk/openjdk-jdk/jdk/test/sun/security/pkcs11/Secmod
[2025-01-08T00:18:11.431Z] /home/jenkins/workspace/Test_openjdk8_hs_extended.openjdk_x86-64_linux_testList_1/aqa-tests/TKG/output_17362909043282/jdk_security3_0/work/classes/1/sun/security/pkcs11/Secmod
[2025-01-08T00:18:11.431Z] /home/jenkins/workspace/Test_openjdk8_hs_extended.openjdk_x86-64_linux_testList_1/aqa-tests/TKG/output_17362909043282/jdk_security3_0/work/classes/1/sun/security/pkcs11
[2025-01-08T00:18:11.431Z] /home/jenkins/workspace/Test_openjdk8_hs_extended.openjdk_x86-64_linux_testList_1/jdkbinary/j2sdk-image/lib/tools.jar
[2025-01-08T00:18:11.431Z]
[2025-01-08T00:18:11.431Z] rerun:
[2025-01-08T00:18:11.431Z] cd /home/jenkins/workspace/Test_openjdk8_hs_extended.openjdk_x86-64_linux_testList_1/aqa-tests/TKG/output_17362909043282/jdk_security3_0/work/scratch/0 && \
[2025-01-08T00:18:11.431Z] DISPLAY=:0 \
[2025-01-08T00:18:11.431Z] HOME=/home/jenkins \
[2025-01-08T00:18:11.431Z] LANG=C.UTF-8 \
[2025-01-08T00:18:11.431Z] PATH=/bin:/usr/bin:/usr/sbin \
[2025-01-08T00:18:11.431Z] /home/jenkins/workspace/Test_openjdk8_hs_extended.openjdk_x86-64_linux_testList_1/jdkbinary/j2sdk-image/bin/javac \
[2025-01-08T00:18:11.431Z] -J-ea \
[2025-01-08T00:18:11.431Z] -J-esa \
[2025-01-08T00:18:11.431Z] -J-Xmx512m \
[2025-01-08T00:18:11.431Z] -J-XX:+UseCompressedOops \
[2025-01-08T00:18:11.431Z] -J-Dtest.vm.opts='-ea -esa -Xmx512m -XX:+UseCompressedOops' \
[2025-01-08T00:18:11.431Z] -J-Dtest.tool.vm.opts='-J-ea -J-esa -J-Xmx512m -J-XX:+UseCompressedOops' \
[2025-01-08T00:18:11.431Z] -J-Dtest.compiler.opts= \
[2025-01-08T00:18:11.431Z] -J-Dtest.java.opts= \
[2025-01-08T00:18:11.431Z] -J-Dtest.jdk=/home/jenkins/workspace/Test_openjdk8_hs_extended.openjdk_x86-64_linux_testList_1/jdkbinary/j2sdk-image \
[2025-01-08T00:18:11.431Z] -J-Dcompile.jdk=/home/jenkins/workspace/Test_openjdk8_hs_extended.openjdk_x86-64_linux_testList_1/jdkbinary/j2sdk-image \
[2025-01-08T00:18:11.431Z] -J-Dtest.timeout.factor=8.0 \
[2025-01-08T00:18:11.431Z] -J-Dtest.root=/home/jenkins/workspace/Test_openjdk8_hs_extended.openjdk_x86-64_linux_testList_1/aqa-tests/openjdk/openjdk-jdk/jdk/test \
[2025-01-08T00:18:11.431Z] -J-Dtest.name=sun/security/pkcs11/Secmod/AddPrivateKey.java \
[2025-01-08T00:18:11.431Z] -J-Dtest.file=/home/jenkins/workspace/Test_openjdk8_hs_extended.openjdk_x86-64_linux_testList_1/aqa-tests/openjdk/openjdk-jdk/jdk/test/sun/security/pkcs11/Secmod/AddPrivateKey.java \
[2025-01-08T00:18:11.431Z] -J-Dtest.src=/home/jenkins/workspace/Test_openjdk8_hs_extended.openjdk_x86-64_linux_testList_1/aqa-tests/openjdk/openjdk-jdk/jdk/test/sun/security/pkcs11/Secmod \
[2025-01-08T00:18:11.431Z] -J-Dtest.src.path=/home/jenkins/workspace/Test_openjdk8_hs_extended.openjdk_x86-64_linux_testList_1/aqa-tests/openjdk/openjdk-jdk/jdk/test/sun/security/pkcs11/Secmod:/home/jenkins/workspace/Test_openjdk8_hs_extended.openjdk_x86-64_linux_testList_1/aqa-tests/openjdk/openjdk-jdk/jdk/test/sun/security/pkcs11 \
[2025-01-08T00:18:11.431Z] -J-Dtest.classes=/home/jenkins/workspace/Test_openjdk8_hs_extended.openjdk_x86-64_linux_testList_1/aqa-tests/TKG/output_17362909043282/jdk_security3_0/work/classes/1/sun/security/pkcs11/Secmod \
[2025-01-08T00:18:11.431Z] -J-Dtest.class.path=/home/jenkins/workspace/Test_openjdk8_hs_extended.openjdk_x86-64_linux_testList_1/aqa-tests/TKG/output_17362909043282/jdk_security3_0/work/classes/1/sun/security/pkcs11/Secmod:/home/jenkins/workspace/Test_openjdk8_hs_extended.openjdk_x86-64_linux_testList_1/aqa-tests/TKG/output_17362909043282/jdk_security3_0/work/classes/1/sun/security/pkcs11 \
[2025-01-08T00:18:11.431Z] -J-Dtest.class.path.prefix=/home/jenkins/workspace/Test_openjdk8_hs_extended.openjdk_x86-64_linux_testList_1/aqa-tests/TKG/output_17362909043282/jdk_security3_0/work/classes/1/sun/security/pkcs11/Secmod:/home/jenkins/workspace/Test_openjdk8_hs_extended.openjdk_x86-64_linux_testList_1/aqa-tests/openjdk/openjdk-jdk/jdk/test/sun/security/pkcs11/Secmod:/home/jenkins/workspace/Test_openjdk8_hs_extended.openjdk_x86-64_linux_testList_1/aqa-tests/TKG/output_17362909043282/jdk_security3_0/work/classes/1/sun/security/pkcs11 \
[2025-01-08T00:18:11.431Z] -d /home/jenkins/workspace/Test_openjdk8_hs_extended.openjdk_x86-64_linux_testList_1/aqa-tests/TKG/output_17362909043282/jdk_security3_0/work/classes/1/sun/security/pkcs11/Secmod \
[2025-01-08T00:18:11.431Z] -sourcepath /home/jenkins/workspace/Test_openjdk8_hs_extended.openjdk_x86-64_linux_testList_1/aqa-tests/openjdk/openjdk-jdk/jdk/test/sun/security/pkcs11/Secmod:/home/jenkins/workspace/Test_openjdk8_hs_extended.openjdk_x86-64_linux_testList_1/aqa-tests/openjdk/openjdk-jdk/jdk/test/sun/security/pkcs11 \
[2025-01-08T00:18:11.431Z] -classpath /home/jenkins/workspace/Test_openjdk8_hs_extended.openjdk_x86-64_linux_testList_1/aqa-tests/openjdk/openjdk-jdk/jdk/test/sun/security/pkcs11/Secmod:/home/jenkins/workspace/Test_openjdk8_hs_extended.openjdk_x86-64_linux_testList_1/aqa-tests/TKG/output_17362909043282/jdk_security3_0/work/classes/1/sun/security/pkcs11/Secmod:/home/jenkins/workspace/Test_openjdk8_hs_extended.openjdk_x86-64_linux_testList_1/aqa-tests/TKG/output_17362909043282/jdk_security3_0/work/classes/1/sun/security/pkcs11:/home/jenkins/workspace/Test_openjdk8_hs_extended.openjdk_x86-64_linux_testList_1/jdkbinary/j2sdk-image/lib/tools.jar \
[2025-01-08T00:18:11.431Z] -XDignore.symbol.file=true /home/jenkins/workspace/Test_openjdk8_hs_extended.openjdk_x86-64_linux_testList_1/aqa-tests/openjdk/openjdk-jdk/jdk/test/sun/security/pkcs11/Secmod/AddPrivateKey.java
[2025-01-08T00:18:11.431Z] direct:
[2025-01-08T00:18:11.431Z] Note: /home/jenkins/workspace/Test_openjdk8_hs_extended.openjdk_x86-64_linux_testList_1/aqa-tests/openjdk/openjdk-jdk/jdk/test/sun/security/pkcs11/PKCS11Test.java uses unchecked or unsafe operations.
[2025-01-08T00:18:11.431Z] Note: Recompile with -Xlint:unchecked for details.
[2025-01-08T00:18:11.431Z]
[2025-01-08T00:18:11.431Z] ACTION: main -- Failed. Execution failed: `main' threw exception: java.lang.reflect.InvocationTargetException
[2025-01-08T00:18:11.431Z] REASON: User specified action: run main/othervm AddPrivateKey
[2025-01-08T00:18:11.431Z] TIME: 1.868 seconds
[2025-01-08T00:18:11.431Z] messages:
[2025-01-08T00:18:11.431Z] command: main AddPrivateKey
[2025-01-08T00:18:11.431Z] reason: User specified action: run main/othervm AddPrivateKey
[2025-01-08T00:18:11.431Z] Mode: othervm [/othervm specified]
[2025-01-08T00:18:11.431Z] elapsed time (seconds): 1.868
[2025-01-08T00:18:11.431Z] configuration:
[2025-01-08T00:18:11.431Z] STDOUT:
[2025-01-08T00:18:11.431Z] libsoftokn3 version = 3.105. ECC Basic.
[2025-01-08T00:18:11.431Z] STDERR:
[2025-01-08T00:18:11.431Z] java.lang.reflect.InvocationTargetException
[2025-01-08T00:18:11.431Z] at sun.reflect.NativeConstructorAccessorImpl.newInstance0(Native Method)
[2025-01-08T00:18:11.431Z] at sun.reflect.NativeConstructorAccessorImpl.newInstance(NativeConstructorAccessorImpl.java:62)
[2025-01-08T00:18:11.431Z] at sun.reflect.DelegatingConstructorAccessorImpl.newInstance(DelegatingConstructorAccessorImpl.java:45)
[2025-01-08T00:18:11.431Z] at java.lang.reflect.Constructor.newInstance(Constructor.java:423)
[2025-01-08T00:18:11.431Z] at PKCS11Test.getSunPKCS11(PKCS11Test.java:108)
[2025-01-08T00:18:11.431Z] at AddPrivateKey.main(AddPrivateKey.java:71)
[2025-01-08T00:18:11.431Z] at sun.reflect.NativeMethodAccessorImpl.invoke0(Native Method)
[2025-01-08T00:18:11.431Z] at sun.reflect.NativeMethodAccessorImpl.invoke(NativeMethodAccessorImpl.java:62)
[2025-01-08T00:18:11.431Z] at sun.reflect.DelegatingMethodAccessorImpl.invoke(DelegatingMethodAccessorImpl.java:43)
[2025-01-08T00:18:11.431Z] at java.lang.reflect.Method.invoke(Method.java:498)
[2025-01-08T00:18:11.431Z] at com.sun.javatest.regtest.agent.MainWrapper$MainThread.run(MainWrapper.java:127)
[2025-01-08T00:18:11.431Z] at java.lang.Thread.run(Thread.java:750)
[2025-01-08T00:18:11.431Z] Caused by: java.security.ProviderException: Could not initialize NSS
[2025-01-08T00:18:11.431Z] at sun.security.pkcs11.SunPKCS11.<init>(SunPKCS11.java:212)
[2025-01-08T00:18:11.431Z] at sun.security.pkcs11.SunPKCS11.<init>(SunPKCS11.java:103)
[2025-01-08T00:18:11.431Z] ... 12 more
[2025-01-08T00:18:11.431Z] Caused by: java.io.IOException: NSS initialization failed
[2025-01-08T00:18:11.431Z] at sun.security.pkcs11.Secmod.initialize(Secmod.java:243)
[2025-01-08T00:18:11.431Z] at sun.security.pkcs11.SunPKCS11.<init>(SunPKCS11.java:207)
[2025-01-08T00:18:11.431Z] ... 13 more
[2025-01-08T00:18:11.431Z]
[2025-01-08T00:18:11.431Z] JavaTest Message: Test threw exception: java.lang.reflect.InvocationTargetException
[2025-01-08T00:18:11.431Z] JavaTest Message: shutting down test
[2025-01-08T00:18:11.431Z]
[2025-01-08T00:18:11.431Z] STATUS:Failed.`main' threw exception: java.lang.reflect.InvocationTargetException
[2025-01-08T00:18:11.431Z] rerun:
[2025-01-08T00:18:11.431Z] cd /home/jenkins/workspace/Test_openjdk8_hs_extended.openjdk_x86-64_linux_testList_1/aqa-tests/TKG/output_17362909043282/jdk_security3_0/work/scratch/0 && \
[2025-01-08T00:18:11.431Z] DISPLAY=:0 \
[2025-01-08T00:18:11.431Z] HOME=/home/jenkins \
[2025-01-08T00:18:11.431Z] LANG=C.UTF-8 \
[2025-01-08T00:18:11.431Z] PATH=/bin:/usr/bin:/usr/sbin \
[2025-01-08T00:18:11.432Z] CLASSPATH=/home/jenkins/workspace/Test_openjdk8_hs_extended.openjdk_x86-64_linux_testList_1/aqa-tests/TKG/output_17362909043282/jdk_security3_0/work/classes/1/sun/security/pkcs11/Secmod:/home/jenkins/workspace/Test_openjdk8_hs_extended.openjdk_x86-64_linux_testList_1/aqa-tests/openjdk/openjdk-jdk/jdk/test/sun/security/pkcs11/Secmod:/home/jenkins/workspace/Test_openjdk8_hs_extended.openjdk_x86-64_linux_testList_1/aqa-tests/TKG/output_17362909043282/jdk_security3_0/work/classes/1/sun/security/pkcs11:/home/jenkins/workspace/Test_openjdk8_hs_extended.openjdk_x86-64_linux_testList_1/aqa-tests/openjdk/openjdk-jdk/jdk/test/sun/security/pkcs11:/home/jenkins/workspace/Test_openjdk8_hs_extended.openjdk_x86-64_linux_testList_1/jdkbinary/j2sdk-image/lib/tools.jar:/home/jenkins/workspace/Test_openjdk8_hs_extended.openjdk_x86-64_linux_testList_1/jvmtest/openjdk/jtreg/lib/javatest.jar:/home/jenkins/workspace/Test_openjdk8_hs_extended.openjdk_x86-64_linux_testList_1/jvmtest/openjdk/jtreg/lib/jtreg.jar \
[2025-01-08T00:18:11.432Z] /home/jenkins/workspace/Test_openjdk8_hs_extended.openjdk_x86-64_linux_testList_1/jdkbinary/j2sdk-image/bin/java \
[2025-01-08T00:18:11.432Z] -Dtest.vm.opts='-ea -esa -Xmx512m -XX:+UseCompressedOops' \
[2025-01-08T00:18:11.432Z] -Dtest.tool.vm.opts='-J-ea -J-esa -J-Xmx512m -J-XX:+UseCompressedOops' \
[2025-01-08T00:18:11.432Z] -Dtest.compiler.opts= \
[2025-01-08T00:18:11.432Z] -Dtest.java.opts= \
[2025-01-08T00:18:11.432Z] -Dtest.jdk=/home/jenkins/workspace/Test_openjdk8_hs_extended.openjdk_x86-64_linux_testList_1/jdkbinary/j2sdk-image \
[2025-01-08T00:18:11.432Z] -Dcompile.jdk=/home/jenkins/workspace/Test_openjdk8_hs_extended.openjdk_x86-64_linux_testList_1/jdkbinary/j2sdk-image \
[2025-01-08T00:18:11.432Z] -Dtest.timeout.factor=8.0 \
[2025-01-08T00:18:11.432Z] -Dtest.root=/home/jenkins/workspace/Test_openjdk8_hs_extended.openjdk_x86-64_linux_testList_1/aqa-tests/openjdk/openjdk-jdk/jdk/test \
[2025-01-08T00:18:11.432Z] -Dtest.name=sun/security/pkcs11/Secmod/AddPrivateKey.java \
[2025-01-08T00:18:11.432Z] -Dtest.file=/home/jenkins/workspace/Test_openjdk8_hs_extended.openjdk_x86-64_linux_testList_1/aqa-tests/openjdk/openjdk-jdk/jdk/test/sun/security/pkcs11/Secmod/AddPrivateKey.java \
[2025-01-08T00:18:11.432Z] -Dtest.src=/home/jenkins/workspace/Test_openjdk8_hs_extended.openjdk_x86-64_linux_testList_1/aqa-tests/openjdk/openjdk-jdk/jdk/test/sun/security/pkcs11/Secmod \
[2025-01-08T00:18:11.432Z] -Dtest.src.path=/home/jenkins/workspace/Test_openjdk8_hs_extended.openjdk_x86-64_linux_testList_1/aqa-tests/openjdk/openjdk-jdk/jdk/test/sun/security/pkcs11/Secmod:/home/jenkins/workspace/Test_openjdk8_hs_extended.openjdk_x86-64_linux_testList_1/aqa-tests/openjdk/openjdk-jdk/jdk/test/sun/security/pkcs11 \
[2025-01-08T00:18:11.432Z] -Dtest.classes=/home/jenkins/workspace/Test_openjdk8_hs_extended.openjdk_x86-64_linux_testList_1/aqa-tests/TKG/output_17362909043282/jdk_security3_0/work/classes/1/sun/security/pkcs11/Secmod \
[2025-01-08T00:18:11.432Z] -Dtest.class.path=/home/jenkins/workspace/Test_openjdk8_hs_extended.openjdk_x86-64_linux_testList_1/aqa-tests/TKG/output_17362909043282/jdk_security3_0/work/classes/1/sun/security/pkcs11/Secmod:/home/jenkins/workspace/Test_openjdk8_hs_extended.openjdk_x86-64_linux_testList_1/aqa-tests/TKG/output_17362909043282/jdk_security3_0/work/classes/1/sun/security/pkcs11 \
[2025-01-08T00:18:11.432Z] -Dtest.class.path.prefix=/home/jenkins/workspace/Test_openjdk8_hs_extended.openjdk_x86-64_linux_testList_1/aqa-tests/TKG/output_17362909043282/jdk_security3_0/work/classes/1/sun/security/pkcs11/Secmod:/home/jenkins/workspace/Test_openjdk8_hs_extended.openjdk_x86-64_linux_testList_1/aqa-tests/openjdk/openjdk-jdk/jdk/test/sun/security/pkcs11/Secmod:/home/jenkins/workspace/Test_openjdk8_hs_extended.openjdk_x86-64_linux_testList_1/aqa-tests/TKG/output_17362909043282/jdk_security3_0/work/classes/1/sun/security/pkcs11 \
[2025-01-08T00:18:11.432Z] -ea \
[2025-01-08T00:18:11.432Z] -esa \
[2025-01-08T00:18:11.432Z] -Xmx512m \
[2025-01-08T00:18:11.432Z] -XX:+UseCompressedOops \
[2025-01-08T00:18:11.432Z] com.sun.javatest.regtest.agent.MainWrapper /home/jenkins/workspace/Test_openjdk8_hs_extended.openjdk_x86-64_linux_testList_1/aqa-tests/TKG/output_17362909043282/jdk_security3_0/work/sun/security/pkcs11/Secmod/AddPrivateKey.d/main.0.jta
[2025-01-08T00:18:11.432Z]
[2025-01-08T00:18:11.432Z] TEST RESULT: Failed. Execution failed: `main' threw exception: java.lang.reflect.InvocationTargetException
[2025-01-08T00:18:11.432Z] --------------------------------------------------
[2025-01-08T00:18:15.136Z] TEST: sun/security/pkcs11/Secmod/GetPrivateKey.java
[2025-01-08T00:18:15.136Z] TEST JDK: /home/jenkins/workspace/Test_openjdk8_hs_extended.openjdk_x86-64_linux_testList_1/jdkbinary/j2sdk-image
[2025-01-08T00:18:15.136Z]
[2025-01-08T00:18:15.136Z] ACTION: build -- Passed. Build successful
[2025-01-08T00:18:15.136Z] REASON: Named class compiled on demand
[2025-01-08T00:18:15.136Z] TIME: 0.831 seconds
[2025-01-08T00:18:15.136Z] messages:
[2025-01-08T00:18:15.136Z] command: build GetPrivateKey
[2025-01-08T00:18:15.136Z] reason: Named class compiled on demand
[2025-01-08T00:18:15.136Z] Test directory:
[2025-01-08T00:18:15.136Z] compile: GetPrivateKey
[2025-01-08T00:18:15.136Z] elapsed time (seconds): 0.831
[2025-01-08T00:18:15.136Z]
[2025-01-08T00:18:15.136Z] ACTION: compile -- Passed. Compilation successful
[2025-01-08T00:18:15.136Z] REASON: .class file out of date or does not exist
[2025-01-08T00:18:15.136Z] TIME: 0.831 seconds
[2025-01-08T00:18:15.136Z] messages:
[2025-01-08T00:18:15.136Z] command: compile -XDignore.symbol.file=true /home/jenkins/workspace/Test_openjdk8_hs_extended.openjdk_x86-64_linux_testList_1/aqa-tests/openjdk/openjdk-jdk/jdk/test/sun/security/pkcs11/Secmod/GetPrivateKey.java
[2025-01-08T00:18:15.136Z] reason: .class file out of date or does not exist
[2025-01-08T00:18:15.136Z] Mode: agentvm
[2025-01-08T00:18:15.136Z] Agent id: 2
[2025-01-08T00:18:15.136Z] elapsed time (seconds): 0.831
[2025-01-08T00:18:15.136Z] configuration:
[2025-01-08T00:18:15.136Z] Boot Layer (javac runtime environment)
[2025-01-08T00:18:15.136Z] class path: /home/jenkins/workspace/Test_openjdk8_hs_extended.openjdk_x86-64_linux_testList_1/jdkbinary/j2sdk-image/lib/tools.jar
[2025-01-08T00:18:15.136Z] /home/jenkins/workspace/Test_openjdk8_hs_extended.openjdk_x86-64_linux_testList_1/jvmtest/openjdk/jtreg/lib/javatest.jar
[2025-01-08T00:18:15.136Z] /home/jenkins/workspace/Test_openjdk8_hs_extended.openjdk_x86-64_linux_testList_1/jvmtest/openjdk/jtreg/lib/jtreg.jar
[2025-01-08T00:18:15.136Z]
[2025-01-08T00:18:15.136Z] javac compilation environment
[2025-01-08T00:18:15.136Z] source path: /home/jenkins/workspace/Test_openjdk8_hs_extended.openjdk_x86-64_linux_testList_1/aqa-tests/openjdk/openjdk-jdk/jdk/test/sun/security/pkcs11/Secmod
[2025-01-08T00:18:15.136Z] /home/jenkins/workspace/Test_openjdk8_hs_extended.openjdk_x86-64_linux_testList_1/aqa-tests/openjdk/openjdk-jdk/jdk/test/sun/security/pkcs11
[2025-01-08T00:18:15.136Z] class path: /home/jenkins/workspace/Test_openjdk8_hs_extended.openjdk_x86-64_linux_testList_1/aqa-tests/openjdk/openjdk-jdk/jdk/test/sun/security/pkcs11/Secmod
[2025-01-08T00:18:15.136Z] /home/jenkins/workspace/Test_openjdk8_hs_extended.openjdk_x86-64_linux_testList_1/aqa-tests/TKG/output_17362909043282/jdk_security3_0/work/classes/2/sun/security/pkcs11/Secmod
[2025-01-08T00:18:15.136Z] /home/jenkins/workspace/Test_openjdk8_hs_extended.openjdk_x86-64_linux_testList_1/aqa-tests/TKG/output_17362909043282/jdk_security3_0/work/classes/2/sun/security/pkcs11
[2025-01-08T00:18:15.136Z] /home/jenkins/workspace/Test_openjdk8_hs_extended.openjdk_x86-64_linux_testList_1/jdkbinary/j2sdk-image/lib/tools.jar
[2025-01-08T00:18:15.136Z]
[2025-01-08T00:18:15.136Z] rerun:
[2025-01-08T00:18:15.136Z] cd /home/jenkins/workspace/Test_openjdk8_hs_extended.openjdk_x86-64_linux_testList_1/aqa-tests/TKG/output_17362909043282/jdk_security3_0/work/scratch/2 && \
[2025-01-08T00:18:15.136Z] DISPLAY=:0 \
[2025-01-08T00:18:15.136Z] HOME=/home/jenkins \
[2025-01-08T00:18:15.136Z] LANG=C.UTF-8 \
[2025-01-08T00:18:15.136Z] PATH=/bin:/usr/bin:/usr/sbin \
[2025-01-08T00:18:15.136Z] /home/jenkins/workspace/Test_openjdk8_hs_extended.openjdk_x86-64_linux_testList_1/jdkbinary/j2sdk-image/bin/javac \
[2025-01-08T00:18:15.136Z] -J-ea \
[2025-01-08T00:18:15.136Z] -J-esa \
[2025-01-08T00:18:15.136Z] -J-Xmx512m \
[2025-01-08T00:18:15.136Z] -J-XX:+UseCompressedOops \
[2025-01-08T00:18:15.136Z] -J-Dtest.vm.opts='-ea -esa -Xmx512m -XX:+UseCompressedOops' \
[2025-01-08T00:18:15.136Z] -J-Dtest.tool.vm.opts='-J-ea -J-esa -J-Xmx512m -J-XX:+UseCompressedOops' \
[2025-01-08T00:18:15.136Z] -J-Dtest.compiler.opts= \
[2025-01-08T00:18:15.136Z] -J-Dtest.java.opts= \
[2025-01-08T00:18:15.136Z] -J-Dtest.jdk=/home/jenkins/workspace/Test_openjdk8_hs_extended.openjdk_x86-64_linux_testList_1/jdkbinary/j2sdk-image \
[2025-01-08T00:18:15.136Z] -J-Dcompile.jdk=/home/jenkins/workspace/Test_openjdk8_hs_extended.openjdk_x86-64_linux_testList_1/jdkbinary/j2sdk-image \
[2025-01-08T00:18:15.136Z] -J-Dtest.timeout.factor=8.0 \
[2025-01-08T00:18:15.136Z] -J-Dtest.root=/home/jenkins/workspace/Test_openjdk8_hs_extended.openjdk_x86-64_linux_testList_1/aqa-tests/openjdk/openjdk-jdk/jdk/test \
[2025-01-08T00:18:15.136Z] -J-Dtest.name=sun/security/pkcs11/Secmod/GetPrivateKey.java \
[2025-01-08T00:18:15.136Z] -J-Dtest.file=/home/jenkins/workspace/Test_openjdk8_hs_extended.openjdk_x86-64_linux_testList_1/aqa-tests/openjdk/openjdk-jdk/jdk/test/sun/security/pkcs11/Secmod/GetPrivateKey.java \
[2025-01-08T00:18:15.136Z] -J-Dtest.src=/home/jenkins/workspace/Test_openjdk8_hs_extended.openjdk_x86-64_linux_testList_1/aqa-tests/openjdk/openjdk-jdk/jdk/test/sun/security/pkcs11/Secmod \
[2025-01-08T00:18:15.136Z] -J-Dtest.src.path=/home/jenkins/workspace/Test_openjdk8_hs_extended.openjdk_x86-64_linux_testList_1/aqa-tests/openjdk/openjdk-jdk/jdk/test/sun/security/pkcs11/Secmod:/home/jenkins/workspace/Test_openjdk8_hs_extended.openjdk_x86-64_linux_testList_1/aqa-tests/openjdk/openjdk-jdk/jdk/test/sun/security/pkcs11 \
[2025-01-08T00:18:15.136Z] -J-Dtest.classes=/home/jenkins/workspace/Test_openjdk8_hs_extended.openjdk_x86-64_linux_testList_1/aqa-tests/TKG/output_17362909043282/jdk_security3_0/work/classes/2/sun/security/pkcs11/Secmod \
[2025-01-08T00:18:15.136Z] -J-Dtest.class.path=/home/jenkins/workspace/Test_openjdk8_hs_extended.openjdk_x86-64_linux_testList_1/aqa-tests/TKG/output_17362909043282/jdk_security3_0/work/classes/2/sun/security/pkcs11/Secmod:/home/jenkins/workspace/Test_openjdk8_hs_extended.openjdk_x86-64_linux_testList_1/aqa-tests/TKG/output_17362909043282/jdk_security3_0/work/classes/2/sun/security/pkcs11 \
[2025-01-08T00:18:15.136Z] -J-Dtest.class.path.prefix=/home/jenkins/workspace/Test_openjdk8_hs_extended.openjdk_x86-64_linux_testList_1/aqa-tests/TKG/output_17362909043282/jdk_security3_0/work/classes/2/sun/security/pkcs11/Secmod:/home/jenkins/workspace/Test_openjdk8_hs_extended.openjdk_x86-64_linux_testList_1/aqa-tests/openjdk/openjdk-jdk/jdk/test/sun/security/pkcs11/Secmod:/home/jenkins/workspace/Test_openjdk8_hs_extended.openjdk_x86-64_linux_testList_1/aqa-tests/TKG/output_17362909043282/jdk_security3_0/work/classes/2/sun/security/pkcs11 \
[2025-01-08T00:18:15.136Z] -d /home/jenkins/workspace/Test_openjdk8_hs_extended.openjdk_x86-64_linux_testList_1/aqa-tests/TKG/output_17362909043282/jdk_security3_0/work/classes/2/sun/security/pkcs11/Secmod \
[2025-01-08T00:18:15.136Z] -sourcepath /home/jenkins/workspace/Test_openjdk8_hs_extended.openjdk_x86-64_linux_testList_1/aqa-tests/openjdk/openjdk-jdk/jdk/test/sun/security/pkcs11/Secmod:/home/jenkins/workspace/Test_openjdk8_hs_extended.openjdk_x86-64_linux_testList_1/aqa-tests/openjdk/openjdk-jdk/jdk/test/sun/security/pkcs11 \
[2025-01-08T00:18:15.136Z] -classpath /home/jenkins/workspace/Test_openjdk8_hs_extended.openjdk_x86-64_linux_testList_1/aqa-tests/openjdk/openjdk-jdk/jdk/test/sun/security/pkcs11/Secmod:/home/jenkins/workspace/Test_openjdk8_hs_extended.openjdk_x86-64_linux_testList_1/aqa-tests/TKG/output_17362909043282/jdk_security3_0/work/classes/2/sun/security/pkcs11/Secmod:/home/jenkins/workspace/Test_openjdk8_hs_extended.openjdk_x86-64_linux_testList_1/aqa-tests/TKG/output_17362909043282/jdk_security3_0/work/classes/2/sun/security/pkcs11:/home/jenkins/workspace/Test_openjdk8_hs_extended.openjdk_x86-64_linux_testList_1/jdkbinary/j2sdk-image/lib/tools.jar \
[2025-01-08T00:18:15.136Z] -XDignore.symbol.file=true /home/jenkins/workspace/Test_openjdk8_hs_extended.openjdk_x86-64_linux_testList_1/aqa-tests/openjdk/openjdk-jdk/jdk/test/sun/security/pkcs11/Secmod/GetPrivateKey.java
[2025-01-08T00:18:15.136Z] direct:
[2025-01-08T00:18:15.136Z] Note: /home/jenkins/workspace/Test_openjdk8_hs_extended.openjdk_x86-64_linux_testList_1/aqa-tests/openjdk/openjdk-jdk/jdk/test/sun/security/pkcs11/PKCS11Test.java uses unchecked or unsafe operations.
[2025-01-08T00:18:15.136Z] Note: Recompile with -Xlint:unchecked for details.
[2025-01-08T00:18:15.136Z]
[2025-01-08T00:18:15.136Z] ACTION: main -- Failed. Execution failed: `main' threw exception: java.lang.reflect.InvocationTargetException
[2025-01-08T00:18:15.136Z] REASON: User specified action: run main/othervm GetPrivateKey
[2025-01-08T00:18:15.136Z] TIME: 1.963 seconds
[2025-01-08T00:18:15.136Z] messages:
[2025-01-08T00:18:15.136Z] command: main GetPrivateKey
[2025-01-08T00:18:15.136Z] reason: User specified action: run main/othervm GetPrivateKey
[2025-01-08T00:18:15.136Z] Mode: othervm [/othervm specified]
[2025-01-08T00:18:15.136Z] elapsed time (seconds): 1.963
[2025-01-08T00:18:15.136Z] configuration:
[2025-01-08T00:18:15.136Z] STDOUT:
[2025-01-08T00:18:15.136Z] libsoftokn3 version = 3.105. ECC Basic.
[2025-01-08T00:18:15.136Z] STDERR:
[2025-01-08T00:18:15.136Z] java.lang.reflect.InvocationTargetException
[2025-01-08T00:18:15.136Z] at sun.reflect.NativeConstructorAccessorImpl.newInstance0(Native Method)
[2025-01-08T00:18:15.136Z] at sun.reflect.NativeConstructorAccessorImpl.newInstance(NativeConstructorAccessorImpl.java:62)
[2025-01-08T00:18:15.136Z] at sun.reflect.DelegatingConstructorAccessorImpl.newInstance(DelegatingConstructorAccessorImpl.java:45)
[2025-01-08T00:18:15.136Z] at java.lang.reflect.Constructor.newInstance(Constructor.java:423)
[2025-01-08T00:18:15.136Z] at PKCS11Test.getSunPKCS11(PKCS11Test.java:108)
[2025-01-08T00:18:15.136Z] at GetPrivateKey.main(GetPrivateKey.java:54)
[2025-01-08T00:18:15.136Z] at sun.reflect.NativeMethodAccessorImpl.invoke0(Native Method)
[2025-01-08T00:18:15.136Z] at sun.reflect.NativeMethodAccessorImpl.invoke(NativeMethodAccessorImpl.java:62)
[2025-01-08T00:18:15.136Z] at sun.reflect.DelegatingMethodAccessorImpl.invoke(DelegatingMethodAccessorImpl.java:43)
[2025-01-08T00:18:15.136Z] at java.lang.reflect.Method.invoke(Method.java:498)
[2025-01-08T00:18:15.136Z] at com.sun.javatest.regtest.agent.MainWrapper$MainThread.run(MainWrapper.java:127)
[2025-01-08T00:18:15.136Z] at java.lang.Thread.run(Thread.java:750)
[2025-01-08T00:18:15.136Z] Caused by: java.security.ProviderException: Could not initialize NSS
[2025-01-08T00:18:15.136Z] at sun.security.pkcs11.SunPKCS11.<init>(SunPKCS11.java:212)
[2025-01-08T00:18:15.136Z] at sun.security.pkcs11.SunPKCS11.<init>(SunPKCS11.java:103)
[2025-01-08T00:18:15.136Z] ... 12 more
[2025-01-08T00:18:15.136Z] Caused by: java.io.IOException: NSS initialization failed
[2025-01-08T00:18:15.136Z] at sun.security.pkcs11.Secmod.initialize(Secmod.java:243)
[2025-01-08T00:18:15.136Z] at sun.security.pkcs11.SunPKCS11.<init>(SunPKCS11.java:207)
[2025-01-08T00:18:15.136Z] ... 13 more
[2025-01-08T00:18:15.136Z]
[2025-01-08T00:18:15.136Z] JavaTest Message: Test threw exception: java.lang.reflect.InvocationTargetException
[2025-01-08T00:18:15.136Z] JavaTest Message: shutting down test
[2025-01-08T00:18:15.136Z]
[2025-01-08T00:18:15.136Z] STATUS:Failed.`main' threw exception: java.lang.reflect.InvocationTargetException
[2025-01-08T00:18:15.136Z] rerun:
[2025-01-08T00:18:15.136Z] cd /home/jenkins/workspace/Test_openjdk8_hs_extended.openjdk_x86-64_linux_testList_1/aqa-tests/TKG/output_17362909043282/jdk_security3_0/work/scratch/2 && \
[2025-01-08T00:18:15.136Z] DISPLAY=:0 \
[2025-01-08T00:18:15.136Z] HOME=/home/jenkins \
[2025-01-08T00:18:15.136Z] LANG=C.UTF-8 \
[2025-01-08T00:18:15.136Z] PATH=/bin:/usr/bin:/usr/sbin \
[2025-01-08T00:18:15.136Z] CLASSPATH=/home/jenkins/workspace/Test_openjdk8_hs_extended.openjdk_x86-64_linux_testList_1/aqa-tests/TKG/output_17362909043282/jdk_security3_0/work/classes/2/sun/security/pkcs11/Secmod:/home/jenkins/workspace/Test_openjdk8_hs_extended.openjdk_x86-64_linux_testList_1/aqa-tests/openjdk/openjdk-jdk/jdk/test/sun/security/pkcs11/Secmod:/home/jenkins/workspace/Test_openjdk8_hs_extended.openjdk_x86-64_linux_testList_1/aqa-tests/TKG/output_17362909043282/jdk_security3_0/work/classes/2/sun/security/pkcs11:/home/jenkins/workspace/Test_openjdk8_hs_extended.openjdk_x86-64_linux_testList_1/aqa-tests/openjdk/openjdk-jdk/jdk/test/sun/security/pkcs11:/home/jenkins/workspace/Test_openjdk8_hs_extended.openjdk_x86-64_linux_testList_1/jdkbinary/j2sdk-image/lib/tools.jar:/home/jenkins/workspace/Test_openjdk8_hs_extended.openjdk_x86-64_linux_testList_1/jvmtest/openjdk/jtreg/lib/javatest.jar:/home/jenkins/workspace/Test_openjdk8_hs_extended.openjdk_x86-64_linux_testList_1/jvmtest/openjdk/jtreg/lib/jtreg.jar \
[2025-01-08T00:18:15.136Z] /home/jenkins/workspace/Test_openjdk8_hs_extended.openjdk_x86-64_linux_testList_1/jdkbinary/j2sdk-image/bin/java \
[2025-01-08T00:18:15.136Z] -Dtest.vm.opts='-ea -esa -Xmx512m -XX:+UseCompressedOops' \
[2025-01-08T00:18:15.136Z] -Dtest.tool.vm.opts='-J-ea -J-esa -J-Xmx512m -J-XX:+UseCompressedOops' \
[2025-01-08T00:18:15.136Z] -Dtest.compiler.opts= \
[2025-01-08T00:18:15.136Z] -Dtest.java.opts= \
[2025-01-08T00:18:15.136Z] -Dtest.jdk=/home/jenkins/workspace/Test_openjdk8_hs_extended.openjdk_x86-64_linux_testList_1/jdkbinary/j2sdk-image \
[2025-01-08T00:18:15.136Z] -Dcompile.jdk=/home/jenkins/workspace/Test_openjdk8_hs_extended.openjdk_x86-64_linux_testList_1/jdkbinary/j2sdk-image \
[2025-01-08T00:18:15.136Z] -Dtest.timeout.factor=8.0 \
[2025-01-08T00:18:15.136Z] -Dtest.root=/home/jenkins/workspace/Test_openjdk8_hs_extended.openjdk_x86-64_linux_testList_1/aqa-tests/openjdk/openjdk-jdk/jdk/test \
[2025-01-08T00:18:15.136Z] -Dtest.name=sun/security/pkcs11/Secmod/GetPrivateKey.java \
[2025-01-08T00:18:15.136Z] -Dtest.file=/home/jenkins/workspace/Test_openjdk8_hs_extended.openjdk_x86-64_linux_testList_1/aqa-tests/openjdk/openjdk-jdk/jdk/test/sun/security/pkcs11/Secmod/GetPrivateKey.java \
[2025-01-08T00:18:15.136Z] -Dtest.src=/home/jenkins/workspace/Test_openjdk8_hs_extended.openjdk_x86-64_linux_testList_1/aqa-tests/openjdk/openjdk-jdk/jdk/test/sun/security/pkcs11/Secmod \
[2025-01-08T00:18:15.136Z] -Dtest.src.path=/home/jenkins/workspace/Test_openjdk8_hs_extended.openjdk_x86-64_linux_testList_1/aqa-tests/openjdk/openjdk-jdk/jdk/test/sun/security/pkcs11/Secmod:/home/jenkins/workspace/Test_openjdk8_hs_extended.openjdk_x86-64_linux_testList_1/aqa-tests/openjdk/openjdk-jdk/jdk/test/sun/security/pkcs11 \
[2025-01-08T00:18:15.136Z] -Dtest.classes=/home/jenkins/workspace/Test_openjdk8_hs_extended.openjdk_x86-64_linux_testList_1/aqa-tests/TKG/output_17362909043282/jdk_security3_0/work/classes/2/sun/security/pkcs11/Secmod \
[2025-01-08T00:18:15.136Z] -Dtest.class.path=/home/jenkins/workspace/Test_openjdk8_hs_extended.openjdk_x86-64_linux_testList_1/aqa-tests/TKG/output_17362909043282/jdk_security3_0/work/classes/2/sun/security/pkcs11/Secmod:/home/jenkins/workspace/Test_openjdk8_hs_extended.openjdk_x86-64_linux_testList_1/aqa-tests/TKG/output_17362909043282/jdk_security3_0/work/classes/2/sun/security/pkcs11 \
[2025-01-08T00:18:15.136Z] -Dtest.class.path.prefix=/home/jenkins/workspace/Test_openjdk8_hs_extended.openjdk_x86-64_linux_testList_1/aqa-tests/TKG/output_17362909043282/jdk_security3_0/work/classes/2/sun/security/pkcs11/Secmod:/home/jenkins/workspace/Test_openjdk8_hs_extended.openjdk_x86-64_linux_testList_1/aqa-tests/openjdk/openjdk-jdk/jdk/test/sun/security/pkcs11/Secmod:/home/jenkins/workspace/Test_openjdk8_hs_extended.openjdk_x86-64_linux_testList_1/aqa-tests/TKG/output_17362909043282/jdk_security3_0/work/classes/2/sun/security/pkcs11 \
[2025-01-08T00:18:15.136Z] -ea \
[2025-01-08T00:18:15.136Z] -esa \
[2025-01-08T00:18:15.136Z] -Xmx512m \
[2025-01-08T00:18:15.136Z] -XX:+UseCompressedOops \
[2025-01-08T00:18:15.136Z] com.sun.javatest.regtest.agent.MainWrapper /home/jenkins/workspace/Test_openjdk8_hs_extended.openjdk_x86-64_linux_testList_1/aqa-tests/TKG/output_17362909043282/jdk_security3_0/work/sun/security/pkcs11/Secmod/GetPrivateKey.d/main.0.jta
[2025-01-08T00:18:15.136Z]
[2025-01-08T00:18:15.136Z] TEST RESULT: Failed. Execution failed: `main' threw exception: java.lang.reflect.InvocationTargetException
[2025-01-08T00:18:15.136Z] --------------------------------------------------
[2025-01-08T00:18:16.999Z] TEST: sun/security/pkcs11/Secmod/JksSetPrivateKey.java
[2025-01-08T00:18:16.999Z] TEST JDK: /home/jenkins/workspace/Test_openjdk8_hs_extended.openjdk_x86-64_linux_testList_1/jdkbinary/j2sdk-image
[2025-01-08T00:18:16.999Z]
[2025-01-08T00:18:16.999Z] ACTION: build -- Passed. Build successful
[2025-01-08T00:18:16.999Z] REASON: Named class compiled on demand
[2025-01-08T00:18:16.999Z] TIME: 0.64 seconds
[2025-01-08T00:18:16.999Z] messages:
[2025-01-08T00:18:16.999Z] command: build JksSetPrivateKey
[2025-01-08T00:18:16.999Z] reason: Named class compiled on demand
[2025-01-08T00:18:16.999Z] Test directory:
[2025-01-08T00:18:16.999Z] compile: JksSetPrivateKey
[2025-01-08T00:18:16.999Z] elapsed time (seconds): 0.64
[2025-01-08T00:18:16.999Z]
[2025-01-08T00:18:16.999Z] ACTION: compile -- Passed. Compilation successful
[2025-01-08T00:18:16.999Z] REASON: .class file out of date or does not exist
[2025-01-08T00:18:16.999Z] TIME: 0.631 seconds
[2025-01-08T00:18:16.999Z] messages:
[2025-01-08T00:18:16.999Z] command: compile -XDignore.symbol.file=true /home/jenkins/workspace/Test_openjdk8_hs_extended.openjdk_x86-64_linux_testList_1/aqa-tests/openjdk/openjdk-jdk/jdk/test/sun/security/pkcs11/Secmod/JksSetPrivateKey.java
[2025-01-08T00:18:16.999Z] reason: .class file out of date or does not exist
[2025-01-08T00:18:16.999Z] Mode: agentvm
[2025-01-08T00:18:16.999Z] Agent id: 3
[2025-01-08T00:18:16.999Z] elapsed time (seconds): 0.631
[2025-01-08T00:18:16.999Z] configuration:
[2025-01-08T00:18:16.999Z] Boot Layer (javac runtime environment)
[2025-01-08T00:18:16.999Z] class path: /home/jenkins/workspace/Test_openjdk8_hs_extended.openjdk_x86-64_linux_testList_1/jdkbinary/j2sdk-image/lib/tools.jar
[2025-01-08T00:18:16.999Z] /home/jenkins/workspace/Test_openjdk8_hs_extended.openjdk_x86-64_linux_testList_1/jvmtest/openjdk/jtreg/lib/javatest.jar
[2025-01-08T00:18:16.999Z] /home/jenkins/workspace/Test_openjdk8_hs_extended.openjdk_x86-64_linux_testList_1/jvmtest/openjdk/jtreg/lib/jtreg.jar
[2025-01-08T00:18:16.999Z]
[2025-01-08T00:18:16.999Z] javac compilation environment
[2025-01-08T00:18:16.999Z] source path: /home/jenkins/workspace/Test_openjdk8_hs_extended.openjdk_x86-64_linux_testList_1/aqa-tests/openjdk/openjdk-jdk/jdk/test/sun/security/pkcs11/Secmod
[2025-01-08T00:18:16.999Z] /home/jenkins/workspace/Test_openjdk8_hs_extended.openjdk_x86-64_linux_testList_1/aqa-tests/openjdk/openjdk-jdk/jdk/test/sun/security/pkcs11
[2025-01-08T00:18:17.000Z] class path: /home/jenkins/workspace/Test_openjdk8_hs_extended.openjdk_x86-64_linux_testList_1/aqa-tests/openjdk/openjdk-jdk/jdk/test/sun/security/pkcs11/Secmod
[2025-01-08T00:18:17.000Z] /home/jenkins/workspace/Test_openjdk8_hs_extended.openjdk_x86-64_linux_testList_1/aqa-tests/TKG/output_17362909043282/jdk_security3_0/work/classes/0/sun/security/pkcs11/Secmod
[2025-01-08T00:18:17.000Z] /home/jenkins/workspace/Test_openjdk8_hs_extended.openjdk_x86-64_linux_testList_1/aqa-tests/TKG/output_17362909043282/jdk_security3_0/work/classes/0/sun/security/pkcs11
[2025-01-08T00:18:17.000Z] /home/jenkins/workspace/Test_openjdk8_hs_extended.openjdk_x86-64_linux_testList_1/jdkbinary/j2sdk-image/lib/tools.jar
[2025-01-08T00:18:17.000Z]
[2025-01-08T00:18:17.000Z] rerun:
[2025-01-08T00:18:17.000Z] cd /home/jenkins/workspace/Test_openjdk8_hs_extended.openjdk_x86-64_linux_testList_1/aqa-tests/TKG/output_17362909043282/jdk_security3_0/work/scratch/1 && \
[2025-01-08T00:18:17.000Z] DISPLAY=:0 \
[2025-01-08T00:18:17.000Z] HOME=/home/jenkins \
[2025-01-08T00:18:17.000Z] LANG=C.UTF-8 \
[2025-01-08T00:18:17.000Z] PATH=/bin:/usr/bin:/usr/sbin \
[2025-01-08T00:18:17.000Z] /home/jenkins/workspace/Test_openjdk8_hs_extended.openjdk_x86-64_linux_testList_1/jdkbinary/j2sdk-image/bin/javac \
[2025-01-08T00:18:17.000Z] -J-ea \
[2025-01-08T00:18:17.000Z] -J-esa \
[2025-01-08T00:18:17.000Z] -J-Xmx512m \
[2025-01-08T00:18:17.000Z] -J-XX:+UseCompressedOops \
[2025-01-08T00:18:17.000Z] -J-Dtest.vm.opts='-ea -esa -Xmx512m -XX:+UseCompressedOops' \
[2025-01-08T00:18:17.000Z] -J-Dtest.tool.vm.opts='-J-ea -J-esa -J-Xmx512m -J-XX:+UseCompressedOops' \
[2025-01-08T00:18:17.000Z] -J-Dtest.compiler.opts= \
[2025-01-08T00:18:17.000Z] -J-Dtest.java.opts= \
[2025-01-08T00:18:17.000Z] -J-Dtest.jdk=/home/jenkins/workspace/Test_openjdk8_hs_extended.openjdk_x86-64_linux_testList_1/jdkbinary/j2sdk-image \
[2025-01-08T00:18:17.000Z] -J-Dcompile.jdk=/home/jenkins/workspace/Test_openjdk8_hs_extended.openjdk_x86-64_linux_testList_1/jdkbinary/j2sdk-image \
[2025-01-08T00:18:17.000Z] -J-Dtest.timeout.factor=8.0 \
[2025-01-08T00:18:17.000Z] -J-Dtest.root=/home/jenkins/workspace/Test_openjdk8_hs_extended.openjdk_x86-64_linux_testList_1/aqa-tests/openjdk/openjdk-jdk/jdk/test \
[2025-01-08T00:18:17.000Z] -J-Dtest.name=sun/security/pkcs11/Secmod/JksSetPrivateKey.java \
[2025-01-08T00:18:17.000Z] -J-Dtest.file=/home/jenkins/workspace/Test_openjdk8_hs_extended.openjdk_x86-64_linux_testList_1/aqa-tests/openjdk/openjdk-jdk/jdk/test/sun/security/pkcs11/Secmod/JksSetPrivateKey.java \
[2025-01-08T00:18:17.000Z] -J-Dtest.src=/home/jenkins/workspace/Test_openjdk8_hs_extended.openjdk_x86-64_linux_testList_1/aqa-tests/openjdk/openjdk-jdk/jdk/test/sun/security/pkcs11/Secmod \
[2025-01-08T00:18:17.000Z] -J-Dtest.src.path=/home/jenkins/workspace/Test_openjdk8_hs_extended.openjdk_x86-64_linux_testList_1/aqa-tests/openjdk/openjdk-jdk/jdk/test/sun/security/pkcs11/Secmod:/home/jenkins/workspace/Test_openjdk8_hs_extended.openjdk_x86-64_linux_testList_1/aqa-tests/openjdk/openjdk-jdk/jdk/test/sun/security/pkcs11 \
[2025-01-08T00:18:17.000Z] -J-Dtest.classes=/home/jenkins/workspace/Test_openjdk8_hs_extended.openjdk_x86-64_linux_testList_1/aqa-tests/TKG/output_17362909043282/jdk_security3_0/work/classes/0/sun/security/pkcs11/Secmod \
[2025-01-08T00:18:17.000Z] -J-Dtest.class.path=/home/jenkins/workspace/Test_openjdk8_hs_extended.openjdk_x86-64_linux_testList_1/aqa-tests/TKG/output_17362909043282/jdk_security3_0/work/classes/0/sun/security/pkcs11/Secmod:/home/jenkins/workspace/Test_openjdk8_hs_extended.openjdk_x86-64_linux_testList_1/aqa-tests/TKG/output_17362909043282/jdk_security3_0/work/classes/0/sun/security/pkcs11 \
[2025-01-08T00:18:17.000Z] -J-Dtest.class.path.prefix=/home/jenkins/workspace/Test_openjdk8_hs_extended.openjdk_x86-64_linux_testList_1/aqa-tests/TKG/output_17362909043282/jdk_security3_0/work/classes/0/sun/security/pkcs11/Secmod:/home/jenkins/workspace/Test_openjdk8_hs_extended.openjdk_x86-64_linux_testList_1/aqa-tests/openjdk/openjdk-jdk/jdk/test/sun/security/pkcs11/Secmod:/home/jenkins/workspace/Test_openjdk8_hs_extended.openjdk_x86-64_linux_testList_1/aqa-tests/TKG/output_17362909043282/jdk_security3_0/work/classes/0/sun/security/pkcs11 \
[2025-01-08T00:18:17.000Z] -d /home/jenkins/workspace/Test_openjdk8_hs_extended.openjdk_x86-64_linux_testList_1/aqa-tests/TKG/output_17362909043282/jdk_security3_0/work/classes/0/sun/security/pkcs11/Secmod \
[2025-01-08T00:18:17.000Z] -sourcepath /home/jenkins/workspace/Test_openjdk8_hs_extended.openjdk_x86-64_linux_testList_1/aqa-tests/openjdk/openjdk-jdk/jdk/test/sun/security/pkcs11/Secmod:/home/jenkins/workspace/Test_openjdk8_hs_extended.openjdk_x86-64_linux_testList_1/aqa-tests/openjdk/openjdk-jdk/jdk/test/sun/security/pkcs11 \
[2025-01-08T00:18:17.000Z] -classpath /home/jenkins/workspace/Test_openjdk8_hs_extended.openjdk_x86-64_linux_testList_1/aqa-tests/openjdk/openjdk-jdk/jdk/test/sun/security/pkcs11/Secmod:/home/jenkins/workspace/Test_openjdk8_hs_extended.openjdk_x86-64_linux_testList_1/aqa-tests/TKG/output_17362909043282/jdk_security3_0/work/classes/0/sun/security/pkcs11/Secmod:/home/jenkins/workspace/Test_openjdk8_hs_extended.openjdk_x86-64_linux_testList_1/aqa-tests/TKG/output_17362909043282/jdk_security3_0/work/classes/0/sun/security/pkcs11:/home/jenkins/workspace/Test_openjdk8_hs_extended.openjdk_x86-64_linux_testList_1/jdkbinary/j2sdk-image/lib/tools.jar \
[2025-01-08T00:18:17.000Z] -XDignore.symbol.file=true /home/jenkins/workspace/Test_openjdk8_hs_extended.openjdk_x86-64_linux_testList_1/aqa-tests/openjdk/openjdk-jdk/jdk/test/sun/security/pkcs11/Secmod/JksSetPrivateKey.java
[2025-01-08T00:18:17.000Z] direct:
[2025-01-08T00:18:17.000Z] Note: /home/jenkins/workspace/Test_openjdk8_hs_extended.openjdk_x86-64_linux_testList_1/aqa-tests/openjdk/openjdk-jdk/jdk/test/sun/security/pkcs11/PKCS11Test.java uses unchecked or unsafe operations.
[2025-01-08T00:18:17.000Z] Note: Recompile with -Xlint:unchecked for details.
[2025-01-08T00:18:17.000Z]
[2025-01-08T00:18:17.000Z] ACTION: main -- Failed. Execution failed: `main' threw exception: java.lang.reflect.InvocationTargetException
[2025-01-08T00:18:17.000Z] REASON: User specified action: run main/othervm JksSetPrivateKey
[2025-01-08T00:18:17.000Z] TIME: 1.438 seconds
[2025-01-08T00:18:17.000Z] messages:
[2025-01-08T00:18:17.000Z] command: main JksSetPrivateKey
[2025-01-08T00:18:17.000Z] reason: User specified action: run main/othervm JksSetPrivateKey
[2025-01-08T00:18:17.000Z] Mode: othervm [/othervm specified]
[2025-01-08T00:18:17.000Z] elapsed time (seconds): 1.438
[2025-01-08T00:18:17.000Z] configuration:
[2025-01-08T00:18:17.000Z] STDOUT:
[2025-01-08T00:18:17.000Z] libsoftokn3 version = 3.105. ECC Basic.
[2025-01-08T00:18:17.000Z] STDERR:
[2025-01-08T00:18:17.000Z] java.lang.reflect.InvocationTargetException
[2025-01-08T00:18:17.000Z] at sun.reflect.NativeConstructorAccessorImpl.newInstance0(Native Method)
[2025-01-08T00:18:17.000Z] at sun.reflect.NativeConstructorAccessorImpl.newInstance(NativeConstructorAccessorImpl.java:62)
[2025-01-08T00:18:17.000Z] at sun.reflect.DelegatingConstructorAccessorImpl.newInstance(DelegatingConstructorAccessorImpl.java:45)
[2025-01-08T00:18:17.000Z] at java.lang.reflect.Constructor.newInstance(Constructor.java:423)
[2025-01-08T00:18:17.000Z] at PKCS11Test.getSunPKCS11(PKCS11Test.java:108)
[2025-01-08T00:18:17.000Z] at JksSetPrivateKey.main(JksSetPrivateKey.java:53)
[2025-01-08T00:18:17.000Z] at sun.reflect.NativeMethodAccessorImpl.invoke0(Native Method)
[2025-01-08T00:18:17.000Z] at sun.reflect.NativeMethodAccessorImpl.invoke(NativeMethodAccessorImpl.java:62)
[2025-01-08T00:18:17.000Z] at sun.reflect.DelegatingMethodAccessorImpl.invoke(DelegatingMethodAccessorImpl.java:43)
[2025-01-08T00:18:17.000Z] at java.lang.reflect.Method.invoke(Method.java:498)
[2025-01-08T00:18:17.000Z] at com.sun.javatest.regtest.agent.MainWrapper$MainThread.run(MainWrapper.java:127)
[2025-01-08T00:18:17.000Z] at java.lang.Thread.run(Thread.java:750)
[2025-01-08T00:18:17.000Z] Caused by: java.security.ProviderException: Could not initialize NSS
[2025-01-08T00:18:17.000Z] at sun.security.pkcs11.SunPKCS11.<init>(SunPKCS11.java:212)
[2025-01-08T00:18:17.000Z] at sun.security.pkcs11.SunPKCS11.<init>(SunPKCS11.java:103)
[2025-01-08T00:18:17.000Z] ... 12 more
[2025-01-08T00:18:17.000Z] Caused by: java.io.IOException: NSS initialization failed
[2025-01-08T00:18:17.000Z] at sun.security.pkcs11.Secmod.initialize(Secmod.java:243)
[2025-01-08T00:18:17.000Z] at sun.security.pkcs11.SunPKCS11.<init>(SunPKCS11.java:207)
[2025-01-08T00:18:17.000Z] ... 13 more
[2025-01-08T00:18:17.000Z]
[2025-01-08T00:18:17.000Z] JavaTest Message: Test threw exception: java.lang.reflect.InvocationTargetException
[2025-01-08T00:18:17.000Z] JavaTest Message: shutting down test
[2025-01-08T00:18:17.000Z]
[2025-01-08T00:18:17.000Z] STATUS:Failed.`main' threw exception: java.lang.reflect.InvocationTargetException
[2025-01-08T00:18:17.000Z] rerun:
[2025-01-08T00:18:17.000Z] cd /home/jenkins/workspace/Test_openjdk8_hs_extended.openjdk_x86-64_linux_testList_1/aqa-tests/TKG/output_17362909043282/jdk_security3_0/work/scratch/1 && \
[2025-01-08T00:18:17.000Z] DISPLAY=:0 \
[2025-01-08T00:18:17.000Z] HOME=/home/jenkins \
[2025-01-08T00:18:17.000Z] LANG=C.UTF-8 \
[2025-01-08T00:18:17.000Z] PATH=/bin:/usr/bin:/usr/sbin \
[2025-01-08T00:18:17.001Z] CLASSPATH=/home/jenkins/workspace/Test_openjdk8_hs_extended.openjdk_x86-64_linux_testList_1/aqa-tests/TKG/output_17362909043282/jdk_security3_0/work/classes/0/sun/security/pkcs11/Secmod:/home/jenkins/workspace/Test_openjdk8_hs_extended.openjdk_x86-64_linux_testList_1/aqa-tests/openjdk/openjdk-jdk/jdk/test/sun/security/pkcs11/Secmod:/home/jenkins/workspace/Test_openjdk8_hs_extended.openjdk_x86-64_linux_testList_1/aqa-tests/TKG/output_17362909043282/jdk_security3_0/work/classes/0/sun/security/pkcs11:/home/jenkins/workspace/Test_openjdk8_hs_extended.openjdk_x86-64_linux_testList_1/aqa-tests/openjdk/openjdk-jdk/jdk/test/sun/security/pkcs11:/home/jenkins/workspace/Test_openjdk8_hs_extended.openjdk_x86-64_linux_testList_1/jdkbinary/j2sdk-image/lib/tools.jar:/home/jenkins/workspace/Test_openjdk8_hs_extended.openjdk_x86-64_linux_testList_1/jvmtest/openjdk/jtreg/lib/javatest.jar:/home/jenkins/workspace/Test_openjdk8_hs_extended.openjdk_x86-64_linux_testList_1/jvmtest/openjdk/jtreg/lib/jtreg.jar \
[2025-01-08T00:18:17.001Z] /home/jenkins/workspace/Test_openjdk8_hs_extended.openjdk_x86-64_linux_testList_1/jdkbinary/j2sdk-image/bin/java \
[2025-01-08T00:18:17.001Z] -Dtest.vm.opts='-ea -esa -Xmx512m -XX:+UseCompressedOops' \
[2025-01-08T00:18:17.001Z] -Dtest.tool.vm.opts='-J-ea -J-esa -J-Xmx512m -J-XX:+UseCompressedOops' \
[2025-01-08T00:18:17.001Z] -Dtest.compiler.opts= \
[2025-01-08T00:18:17.001Z] -Dtest.java.opts= \
[2025-01-08T00:18:17.001Z] -Dtest.jdk=/home/jenkins/workspace/Test_openjdk8_hs_extended.openjdk_x86-64_linux_testList_1/jdkbinary/j2sdk-image \
[2025-01-08T00:18:17.001Z] -Dcompile.jdk=/home/jenkins/workspace/Test_openjdk8_hs_extended.openjdk_x86-64_linux_testList_1/jdkbinary/j2sdk-image \
[2025-01-08T00:18:17.001Z] -Dtest.timeout.factor=8.0 \
[2025-01-08T00:18:17.001Z] -Dtest.root=/home/jenkins/workspace/Test_openjdk8_hs_extended.openjdk_x86-64_linux_testList_1/aqa-tests/openjdk/openjdk-jdk/jdk/test \
[2025-01-08T00:18:17.001Z] -Dtest.name=sun/security/pkcs11/Secmod/JksSetPrivateKey.java \
[2025-01-08T00:18:17.001Z] -Dtest.file=/home/jenkins/workspace/Test_openjdk8_hs_extended.openjdk_x86-64_linux_testList_1/aqa-tests/openjdk/openjdk-jdk/jdk/test/sun/security/pkcs11/Secmod/JksSetPrivateKey.java \
[2025-01-08T00:18:17.001Z] -Dtest.src=/home/jenkins/workspace/Test_openjdk8_hs_extended.openjdk_x86-64_linux_testList_1/aqa-tests/openjdk/openjdk-jdk/jdk/test/sun/security/pkcs11/Secmod \
[2025-01-08T00:18:17.001Z] -Dtest.src.path=/home/jenkins/workspace/Test_openjdk8_hs_extended.openjdk_x86-64_linux_testList_1/aqa-tests/openjdk/openjdk-jdk/jdk/test/sun/security/pkcs11/Secmod:/home/jenkins/workspace/Test_openjdk8_hs_extended.openjdk_x86-64_linux_testList_1/aqa-tests/openjdk/openjdk-jdk/jdk/test/sun/security/pkcs11 \
[2025-01-08T00:18:17.001Z] -Dtest.classes=/home/jenkins/workspace/Test_openjdk8_hs_extended.openjdk_x86-64_linux_testList_1/aqa-tests/TKG/output_17362909043282/jdk_security3_0/work/classes/0/sun/security/pkcs11/Secmod \
[2025-01-08T00:18:17.001Z] -Dtest.class.path=/home/jenkins/workspace/Test_openjdk8_hs_extended.openjdk_x86-64_linux_testList_1/aqa-tests/TKG/output_17362909043282/jdk_security3_0/work/classes/0/sun/security/pkcs11/Secmod:/home/jenkins/workspace/Test_openjdk8_hs_extended.openjdk_x86-64_linux_testList_1/aqa-tests/TKG/output_17362909043282/jdk_security3_0/work/classes/0/sun/security/pkcs11 \
[2025-01-08T00:18:17.001Z] -Dtest.class.path.prefix=/home/jenkins/workspace/Test_openjdk8_hs_extended.openjdk_x86-64_linux_testList_1/aqa-tests/TKG/output_17362909043282/jdk_security3_0/work/classes/0/sun/security/pkcs11/Secmod:/home/jenkins/workspace/Test_openjdk8_hs_extended.openjdk_x86-64_linux_testList_1/aqa-tests/openjdk/openjdk-jdk/jdk/test/sun/security/pkcs11/Secmod:/home/jenkins/workspace/Test_openjdk8_hs_extended.openjdk_x86-64_linux_testList_1/aqa-tests/TKG/output_17362909043282/jdk_security3_0/work/classes/0/sun/security/pkcs11 \
[2025-01-08T00:18:17.001Z] -ea \
[2025-01-08T00:18:17.001Z] -esa \
[2025-01-08T00:18:17.001Z] -Xmx512m \
[2025-01-08T00:18:17.001Z] -XX:+UseCompressedOops \
[2025-01-08T00:18:17.001Z] com.sun.javatest.regtest.agent.MainWrapper /home/jenkins/workspace/Test_openjdk8_hs_extended.openjdk_x86-64_linux_testList_1/aqa-tests/TKG/output_17362909043282/jdk_security3_0/work/sun/security/pkcs11/Secmod/JksSetPrivateKey.d/main.0.jta
[2025-01-08T00:18:17.001Z]
[2025-01-08T00:18:17.001Z] TEST RESULT: Failed. Execution failed: `main' threw exception: java.lang.reflect.InvocationTargetException
[2025-01-08T00:18:17.001Z] --------------------------------------------------
[2025-01-08T00:18:17.001Z] TEST: sun/security/pkcs11/Secmod/LoadKeystore.java
[2025-01-08T00:18:17.001Z] TEST JDK: /home/jenkins/workspace/Test_openjdk8_hs_extended.openjdk_x86-64_linux_testList_1/jdkbinary/j2sdk-image
[2025-01-08T00:18:17.001Z]
[2025-01-08T00:18:17.001Z] ACTION: build -- Passed. Build successful
[2025-01-08T00:18:17.001Z] REASON: Named class compiled on demand
[2025-01-08T00:18:17.001Z] TIME: 0.3 seconds
[2025-01-08T00:18:17.001Z] messages:
[2025-01-08T00:18:17.001Z] command: build LoadKeystore
[2025-01-08T00:18:17.001Z] reason: Named class compiled on demand
[2025-01-08T00:18:17.001Z] Test directory:
[2025-01-08T00:18:17.001Z] compile: LoadKeystore
[2025-01-08T00:18:17.001Z] elapsed time (seconds): 0.3
[2025-01-08T00:18:17.001Z]
[2025-01-08T00:18:17.001Z] ACTION: compile -- Passed. Compilation successful
[2025-01-08T00:18:17.001Z] REASON: .class file out of date or does not exist
[2025-01-08T00:18:17.001Z] TIME: 0.3 seconds
[2025-01-08T00:18:17.001Z] messages:
[2025-01-08T00:18:17.001Z] command: compile -XDignore.symbol.file=true /home/jenkins/workspace/Test_openjdk8_hs_extended.openjdk_x86-64_linux_testList_1/aqa-tests/openjdk/openjdk-jdk/jdk/test/sun/security/pkcs11/Secmod/LoadKeystore.java
[2025-01-08T00:18:17.001Z] reason: .class file out of date or does not exist
[2025-01-08T00:18:17.001Z] Mode: agentvm
[2025-01-08T00:18:17.001Z] Agent id: 2
[2025-01-08T00:18:17.001Z] elapsed time (seconds): 0.3
[2025-01-08T00:18:17.001Z] configuration:
[2025-01-08T00:18:17.001Z] Boot Layer (javac runtime environment)
[2025-01-08T00:18:17.001Z] class path: /home/jenkins/workspace/Test_openjdk8_hs_extended.openjdk_x86-64_linux_testList_1/jdkbinary/j2sdk-image/lib/tools.jar
[2025-01-08T00:18:17.001Z] /home/jenkins/workspace/Test_openjdk8_hs_extended.openjdk_x86-64_linux_testList_1/jvmtest/openjdk/jtreg/lib/javatest.jar
[2025-01-08T00:18:17.001Z] /home/jenkins/workspace/Test_openjdk8_hs_extended.openjdk_x86-64_linux_testList_1/jvmtest/openjdk/jtreg/lib/jtreg.jar
[2025-01-08T00:18:17.001Z]
[2025-01-08T00:18:17.001Z] javac compilation environment
[2025-01-08T00:18:17.001Z] source path: /home/jenkins/workspace/Test_openjdk8_hs_extended.openjdk_x86-64_linux_testList_1/aqa-tests/openjdk/openjdk-jdk/jdk/test/sun/security/pkcs11/Secmod
[2025-01-08T00:18:17.001Z] /home/jenkins/workspace/Test_openjdk8_hs_extended.openjdk_x86-64_linux_testList_1/aqa-tests/openjdk/openjdk-jdk/jdk/test/sun/security/pkcs11
[2025-01-08T00:18:17.001Z] class path: /home/jenkins/workspace/Test_openjdk8_hs_extended.openjdk_x86-64_linux_testList_1/aqa-tests/openjdk/openjdk-jdk/jdk/test/sun/security/pkcs11/Secmod
[2025-01-08T00:18:17.001Z] /home/jenkins/workspace/Test_openjdk8_hs_extended.openjdk_x86-64_linux_testList_1/aqa-tests/TKG/output_17362909043282/jdk_security3_0/work/classes/2/sun/security/pkcs11/Secmod
[2025-01-08T00:18:17.001Z] /home/jenkins/workspace/Test_openjdk8_hs_extended.openjdk_x86-64_linux_testList_1/aqa-tests/TKG/output_17362909043282/jdk_security3_0/work/classes/2/sun/security/pkcs11
[2025-01-08T00:18:17.001Z] /home/jenkins/workspace/Test_openjdk8_hs_extended.openjdk_x86-64_linux_testList_1/jdkbinary/j2sdk-image/lib/tools.jar
[2025-01-08T00:18:17.001Z]
[2025-01-08T00:18:17.001Z] rerun:
[2025-01-08T00:18:17.001Z] cd /home/jenkins/workspace/Test_openjdk8_hs_extended.openjdk_x86-64_linux_testList_1/aqa-tests/TKG/output_17362909043282/jdk_security3_0/work/scratch/2 && \
[2025-01-08T00:18:17.001Z] DISPLAY=:0 \
[2025-01-08T00:18:17.001Z] HOME=/home/jenkins \
[2025-01-08T00:18:17.001Z] LANG=C.UTF-8 \
[2025-01-08T00:18:17.001Z] PATH=/bin:/usr/bin:/usr/sbin \
[2025-01-08T00:18:17.001Z] /home/jenkins/workspace/Test_openjdk8_hs_extended.openjdk_x86-64_linux_testList_1/jdkbinary/j2sdk-image/bin/javac \
[2025-01-08T00:18:17.001Z] -J-ea \
[2025-01-08T00:18:17.001Z] -J-esa \
[2025-01-08T00:18:17.001Z] -J-Xmx512m \
[2025-01-08T00:18:17.001Z] -J-XX:+UseCompressedOops \
[2025-01-08T00:18:17.001Z] -J-Dtest.vm.opts='-ea -esa -Xmx512m -XX:+UseCompressedOops' \
[2025-01-08T00:18:17.001Z] -J-Dtest.tool.vm.opts='-J-ea -J-esa -J-Xmx512m -J-XX:+UseCompressedOops' \
[2025-01-08T00:18:17.001Z] -J-Dtest.compiler.opts= \
[2025-01-08T00:18:17.001Z] -J-Dtest.java.opts= \
[2025-01-08T00:18:17.001Z] -J-Dtest.jdk=/home/jenkins/workspace/Test_openjdk8_hs_extended.openjdk_x86-64_linux_testList_1/jdkbinary/j2sdk-image \
[2025-01-08T00:18:17.001Z] -J-Dcompile.jdk=/home/jenkins/workspace/Test_openjdk8_hs_extended.openjdk_x86-64_linux_testList_1/jdkbinary/j2sdk-image \
[2025-01-08T00:18:17.001Z] -J-Dtest.timeout.factor=8.0 \
[2025-01-08T00:18:17.001Z] -J-Dtest.root=/home/jenkins/workspace/Test_openjdk8_hs_extended.openjdk_x86-64_linux_testList_1/aqa-tests/openjdk/openjdk-jdk/jdk/test \
[2025-01-08T00:18:17.001Z] -J-Dtest.name=sun/security/pkcs11/Secmod/LoadKeystore.java \
[2025-01-08T00:18:17.001Z] -J-Dtest.file=/home/jenkins/workspace/Test_openjdk8_hs_extended.openjdk_x86-64_linux_testList_1/aqa-tests/openjdk/openjdk-jdk/jdk/test/sun/security/pkcs11/Secmod/LoadKeystore.java \
[2025-01-08T00:18:17.001Z] -J-Dtest.src=/home/jenkins/workspace/Test_openjdk8_hs_extended.openjdk_x86-64_linux_testList_1/aqa-tests/openjdk/openjdk-jdk/jdk/test/sun/security/pkcs11/Secmod \
[2025-01-08T00:18:17.001Z] -J-Dtest.src.path=/home/jenkins/workspace/Test_openjdk8_hs_extended.openjdk_x86-64_linux_testList_1/aqa-tests/openjdk/openjdk-jdk/jdk/test/sun/security/pkcs11/Secmod:/home/jenkins/workspace/Test_openjdk8_hs_extended.openjdk_x86-64_linux_testList_1/aqa-tests/openjdk/openjdk-jdk/jdk/test/sun/security/pkcs11 \
[2025-01-08T00:18:17.002Z] -J-Dtest.classes=/home/jenkins/workspace/Test_openjdk8_hs_extended.openjdk_x86-64_linux_testList_1/aqa-tests/TKG/output_17362909043282/jdk_security3_0/work/classes/2/sun/security/pkcs11/Secmod \
[2025-01-08T00:18:17.002Z] -J-Dtest.class.path=/home/jenkins/workspace/Test_openjdk8_hs_extended.openjdk_x86-64_linux_testList_1/aqa-tests/TKG/output_17362909043282/jdk_security3_0/work/classes/2/sun/security/pkcs11/Secmod:/home/jenkins/workspace/Test_openjdk8_hs_extended.openjdk_x86-64_linux_testList_1/aqa-tests/TKG/output_17362909043282/jdk_security3_0/work/classes/2/sun/security/pkcs11 \
[2025-01-08T00:18:17.002Z] -J-Dtest.class.path.prefix=/home/jenkins/workspace/Test_openjdk8_hs_extended.openjdk_x86-64_linux_testList_1/aqa-tests/TKG/output_17362909043282/jdk_security3_0/work/classes/2/sun/security/pkcs11/Secmod:/home/jenkins/workspace/Test_openjdk8_hs_extended.openjdk_x86-64_linux_testList_1/aqa-tests/openjdk/openjdk-jdk/jdk/test/sun/security/pkcs11/Secmod:/home/jenkins/workspace/Test_openjdk8_hs_extended.openjdk_x86-64_linux_testList_1/aqa-tests/TKG/output_17362909043282/jdk_security3_0/work/classes/2/sun/security/pkcs11 \
[2025-01-08T00:18:17.002Z] -d /home/jenkins/workspace/Test_openjdk8_hs_extended.openjdk_x86-64_linux_testList_1/aqa-tests/TKG/output_17362909043282/jdk_security3_0/work/classes/2/sun/security/pkcs11/Secmod \
[2025-01-08T00:18:17.002Z] -sourcepath /home/jenkins/workspace/Test_openjdk8_hs_extended.openjdk_x86-64_linux_testList_1/aqa-tests/openjdk/openjdk-jdk/jdk/test/sun/security/pkcs11/Secmod:/home/jenkins/workspace/Test_openjdk8_hs_extended.openjdk_x86-64_linux_testList_1/aqa-tests/openjdk/openjdk-jdk/jdk/test/sun/security/pkcs11 \
[2025-01-08T00:18:17.002Z] -classpath /home/jenkins/workspace/Test_openjdk8_hs_extended.openjdk_x86-64_linux_testList_1/aqa-tests/openjdk/openjdk-jdk/jdk/test/sun/security/pkcs11/Secmod:/home/jenkins/workspace/Test_openjdk8_hs_extended.openjdk_x86-64_linux_testList_1/aqa-tests/TKG/output_17362909043282/jdk_security3_0/work/classes/2/sun/security/pkcs11/Secmod:/home/jenkins/workspace/Test_openjdk8_hs_extended.openjdk_x86-64_linux_testList_1/aqa-tests/TKG/output_17362909043282/jdk_security3_0/work/classes/2/sun/security/pkcs11:/home/jenkins/workspace/Test_openjdk8_hs_extended.openjdk_x86-64_linux_testList_1/jdkbinary/j2sdk-image/lib/tools.jar \
[2025-01-08T00:18:17.002Z] -XDignore.symbol.file=true /home/jenkins/workspace/Test_openjdk8_hs_extended.openjdk_x86-64_linux_testList_1/aqa-tests/openjdk/openjdk-jdk/jdk/test/sun/security/pkcs11/Secmod/LoadKeystore.java
[2025-01-08T00:18:17.002Z]
[2025-01-08T00:18:17.002Z] ACTION: main -- Failed. Execution failed: `main' threw exception: java.lang.reflect.InvocationTargetException
[2025-01-08T00:18:17.002Z] REASON: User specified action: run main/othervm LoadKeystore
[2025-01-08T00:18:17.002Z] TIME: 1.939 seconds
[2025-01-08T00:18:17.002Z] messages:
[2025-01-08T00:18:17.002Z] command: main LoadKeystore
[2025-01-08T00:18:17.002Z] reason: User specified action: run main/othervm LoadKeystore
[2025-01-08T00:18:17.002Z] Mode: othervm [/othervm specified]
[2025-01-08T00:18:17.002Z] elapsed time (seconds): 1.939
[2025-01-08T00:18:17.002Z] configuration:
[2025-01-08T00:18:17.002Z] STDOUT:
[2025-01-08T00:18:17.002Z] libsoftokn3 version = 3.105. ECC Basic.
[2025-01-08T00:18:17.002Z] STDERR:
[2025-01-08T00:18:17.002Z] java.lang.reflect.InvocationTargetException
[2025-01-08T00:18:17.002Z] at sun.reflect.NativeConstructorAccessorImpl.newInstance0(Native Method)
[2025-01-08T00:18:17.002Z] at sun.reflect.NativeConstructorAccessorImpl.newInstance(NativeConstructorAccessorImpl.java:62)
[2025-01-08T00:18:17.002Z] at sun.reflect.DelegatingConstructorAccessorImpl.newInstance(DelegatingConstructorAccessorImpl.java:45)
[2025-01-08T00:18:17.002Z] at java.lang.reflect.Constructor.newInstance(Constructor.java:423)
[2025-01-08T00:18:17.002Z] at PKCS11Test.getSunPKCS11(PKCS11Test.java:108)
[2025-01-08T00:18:17.002Z] at LoadKeystore.main(LoadKeystore.java:49)
[2025-01-08T00:18:17.002Z] at sun.reflect.NativeMethodAccessorImpl.invoke0(Native Method)
[2025-01-08T00:18:17.002Z] at sun.reflect.NativeMethodAccessorImpl.invoke(NativeMethodAccessorImpl.java:62)
[2025-01-08T00:18:17.002Z] at sun.reflect.DelegatingMethodAccessorImpl.invoke(DelegatingMethodAccessorImpl.java:43)
[2025-01-08T00:18:17.002Z] at java.lang.reflect.Method.invoke(Method.java:498)
[2025-01-08T00:18:17.002Z] at com.sun.javatest.regtest.agent.MainWrapper$MainThread.run(MainWrapper.java:127)
[2025-01-08T00:18:17.002Z] at java.lang.Thread.run(Thread.java:750)
[2025-01-08T00:18:17.002Z] Caused by: java.security.ProviderException: Could not initialize NSS
[2025-01-08T00:18:17.002Z] at sun.security.pkcs11.SunPKCS11.<init>(SunPKCS11.java:212)
[2025-01-08T00:18:17.002Z] at sun.security.pkcs11.SunPKCS11.<init>(SunPKCS11.java:103)
[2025-01-08T00:18:17.002Z] ... 12 more
[2025-01-08T00:18:17.002Z] Caused by: java.io.IOException: NSS initialization failed
[2025-01-08T00:18:17.002Z] at sun.security.pkcs11.Secmod.initialize(Secmod.java:243)
[2025-01-08T00:18:17.002Z] at sun.security.pkcs11.SunPKCS11.<init>(SunPKCS11.java:207)
[2025-01-08T00:18:17.002Z] ... 13 more
[2025-01-08T00:18:17.002Z]
[2025-01-08T00:18:17.002Z] JavaTest Message: Test threw exception: java.lang.reflect.InvocationTargetException
[2025-01-08T00:18:17.002Z] JavaTest Message: shutting down test
[2025-01-08T00:18:17.002Z]
[2025-01-08T00:18:17.002Z] STATUS:Failed.`main' threw exception: java.lang.reflect.InvocationTargetException
[2025-01-08T00:18:17.002Z] rerun:
[2025-01-08T00:18:17.002Z] cd /home/jenkins/workspace/Test_openjdk8_hs_extended.openjdk_x86-64_linux_testList_1/aqa-tests/TKG/output_17362909043282/jdk_security3_0/work/scratch/2 && \
[2025-01-08T00:18:17.002Z] DISPLAY=:0 \
[2025-01-08T00:18:17.002Z] HOME=/home/jenkins \
[2025-01-08T00:18:17.002Z] LANG=C.UTF-8 \
[2025-01-08T00:18:17.002Z] PATH=/bin:/usr/bin:/usr/sbin \
[2025-01-08T00:18:17.002Z] CLASSPATH=/home/jenkins/workspace/Test_openjdk8_hs_extended.openjdk_x86-64_linux_testList_1/aqa-tests/TKG/output_17362909043282/jdk_security3_0/work/classes/2/sun/security/pkcs11/Secmod:/home/jenkins/workspace/Test_openjdk8_hs_extended.openjdk_x86-64_linux_testList_1/aqa-tests/openjdk/openjdk-jdk/jdk/test/sun/security/pkcs11/Secmod:/home/jenkins/workspace/Test_openjdk8_hs_extended.openjdk_x86-64_linux_testList_1/aqa-tests/TKG/output_17362909043282/jdk_security3_0/work/classes/2/sun/security/pkcs11:/home/jenkins/workspace/Test_openjdk8_hs_extended.openjdk_x86-64_linux_testList_1/aqa-tests/openjdk/openjdk-jdk/jdk/test/sun/security/pkcs11:/home/jenkins/workspace/Test_openjdk8_hs_extended.openjdk_x86-64_linux_testList_1/jdkbinary/j2sdk-image/lib/tools.jar:/home/jenkins/workspace/Test_openjdk8_hs_extended.openjdk_x86-64_linux_testList_1/jvmtest/openjdk/jtreg/lib/javatest.jar:/home/jenkins/workspace/Test_openjdk8_hs_extended.openjdk_x86-64_linux_testList_1/jvmtest/openjdk/jtreg/lib/jtreg.jar \
[2025-01-08T00:18:17.002Z] /home/jenkins/workspace/Test_openjdk8_hs_extended.openjdk_x86-64_linux_testList_1/jdkbinary/j2sdk-image/bin/java \
[2025-01-08T00:18:17.002Z] -Dtest.vm.opts='-ea -esa -Xmx512m -XX:+UseCompressedOops' \
[2025-01-08T00:18:17.002Z] -Dtest.tool.vm.opts='-J-ea -J-esa -J-Xmx512m -J-XX:+UseCompressedOops' \
[2025-01-08T00:18:17.002Z] -Dtest.compiler.opts= \
[2025-01-08T00:18:17.002Z] -Dtest.java.opts= \
[2025-01-08T00:18:17.002Z] -Dtest.jdk=/home/jenkins/workspace/Test_openjdk8_hs_extended.openjdk_x86-64_linux_testList_1/jdkbinary/j2sdk-image \
[2025-01-08T00:18:17.002Z] -Dcompile.jdk=/home/jenkins/workspace/Test_openjdk8_hs_extended.openjdk_x86-64_linux_testList_1/jdkbinary/j2sdk-image \
[2025-01-08T00:18:17.002Z] -Dtest.timeout.factor=8.0 \
[2025-01-08T00:18:17.002Z] -Dtest.root=/home/jenkins/workspace/Test_openjdk8_hs_extended.openjdk_x86-64_linux_testList_1/aqa-tests/openjdk/openjdk-jdk/jdk/test \
[2025-01-08T00:18:17.002Z] -Dtest.name=sun/security/pkcs11/Secmod/LoadKeystore.java \
[2025-01-08T00:18:17.002Z] -Dtest.file=/home/jenkins/workspace/Test_openjdk8_hs_extended.openjdk_x86-64_linux_testList_1/aqa-tests/openjdk/openjdk-jdk/jdk/test/sun/security/pkcs11/Secmod/LoadKeystore.java \
[2025-01-08T00:18:17.002Z] -Dtest.src=/home/jenkins/workspace/Test_openjdk8_hs_extended.openjdk_x86-64_linux_testList_1/aqa-tests/openjdk/openjdk-jdk/jdk/test/sun/security/pkcs11/Secmod \
[2025-01-08T00:18:17.002Z] -Dtest.src.path=/home/jenkins/workspace/Test_openjdk8_hs_extended.openjdk_x86-64_linux_testList_1/aqa-tests/openjdk/openjdk-jdk/jdk/test/sun/security/pkcs11/Secmod:/home/jenkins/workspace/Test_openjdk8_hs_extended.openjdk_x86-64_linux_testList_1/aqa-tests/openjdk/openjdk-jdk/jdk/test/sun/security/pkcs11 \
[2025-01-08T00:18:17.002Z] -Dtest.classes=/home/jenkins/workspace/Test_openjdk8_hs_extended.openjdk_x86-64_linux_testList_1/aqa-tests/TKG/output_17362909043282/jdk_security3_0/work/classes/2/sun/security/pkcs11/Secmod \
[2025-01-08T00:18:17.003Z] -Dtest.class.path=/home/jenkins/workspace/Test_openjdk8_hs_extended.openjdk_x86-64_linux_testList_1/aqa-tests/TKG/output_17362909043282/jdk_security3_0/work/classes/2/sun/security/pkcs11/Secmod:/home/jenkins/workspace/Test_openjdk8_hs_extended.openjdk_x86-64_linux_testList_1/aqa-tests/TKG/output_17362909043282/jdk_security3_0/work/classes/2/sun/security/pkcs11 \
[2025-01-08T00:18:17.003Z] -Dtest.class.path.prefix=/home/jenkins/workspace/Test_openjdk8_hs_extended.openjdk_x86-64_linux_testList_1/aqa-tests/TKG/output_17362909043282/jdk_security3_0/work/classes/2/sun/security/pkcs11/Secmod:/home/jenkins/workspace/Test_openjdk8_hs_extended.openjdk_x86-64_linux_testList_1/aqa-tests/openjdk/openjdk-jdk/jdk/test/sun/security/pkcs11/Secmod:/home/jenkins/workspace/Test_openjdk8_hs_extended.openjdk_x86-64_linux_testList_1/aqa-tests/TKG/output_17362909043282/jdk_security3_0/work/classes/2/sun/security/pkcs11 \
[2025-01-08T00:18:17.003Z] -ea \
[2025-01-08T00:18:17.003Z] -esa \
[2025-01-08T00:18:17.003Z] -Xmx512m \
[2025-01-08T00:18:17.003Z] -XX:+UseCompressedOops \
[2025-01-08T00:18:17.003Z] com.sun.javatest.regtest.agent.MainWrapper /home/jenkins/workspace/Test_openjdk8_hs_extended.openjdk_x86-64_linux_testList_1/aqa-tests/TKG/output_17362909043282/jdk_security3_0/work/sun/security/pkcs11/Secmod/LoadKeystore.d/main.0.jta
[2025-01-08T00:18:17.003Z]
[2025-01-08T00:18:17.003Z] TEST RESULT: Failed. Execution failed: `main' threw exception: java.lang.reflect.InvocationTargetException
[2025-01-08T00:18:17.003Z] --------------------------------------------------
[2025-01-08T00:18:18.788Z] TEST: sun/security/pkcs11/Secmod/TrustAnchors.java
[2025-01-08T00:18:18.788Z] TEST JDK: /home/jenkins/workspace/Test_openjdk8_hs_extended.openjdk_x86-64_linux_testList_1/jdkbinary/j2sdk-image
[2025-01-08T00:18:18.788Z]
[2025-01-08T00:18:18.788Z] ACTION: build -- Passed. Build successful
[2025-01-08T00:18:18.788Z] REASON: Named class compiled on demand
[2025-01-08T00:18:18.788Z] TIME: 0.254 seconds
[2025-01-08T00:18:18.788Z] messages:
[2025-01-08T00:18:18.788Z] command: build TrustAnchors
[2025-01-08T00:18:18.788Z] reason: Named class compiled on demand
[2025-01-08T00:18:18.788Z] Test directory:
[2025-01-08T00:18:18.788Z] compile: TrustAnchors
[2025-01-08T00:18:18.788Z] elapsed time (seconds): 0.254
[2025-01-08T00:18:18.788Z]
[2025-01-08T00:18:18.788Z] ACTION: compile -- Passed. Compilation successful
[2025-01-08T00:18:18.788Z] REASON: .class file out of date or does not exist
[2025-01-08T00:18:18.788Z] TIME: 0.254 seconds
[2025-01-08T00:18:18.788Z] messages:
[2025-01-08T00:18:18.788Z] command: compile -XDignore.symbol.file=true /home/jenkins/workspace/Test_openjdk8_hs_extended.openjdk_x86-64_linux_testList_1/aqa-tests/openjdk/openjdk-jdk/jdk/test/sun/security/pkcs11/Secmod/TrustAnchors.java
[2025-01-08T00:18:18.788Z] reason: .class file out of date or does not exist
[2025-01-08T00:18:18.788Z] Mode: agentvm
[2025-01-08T00:18:18.788Z] Agent id: 3
[2025-01-08T00:18:18.788Z] elapsed time (seconds): 0.254
[2025-01-08T00:18:18.788Z] configuration:
[2025-01-08T00:18:18.788Z] Boot Layer (javac runtime environment)
[2025-01-08T00:18:18.788Z] class path: /home/jenkins/workspace/Test_openjdk8_hs_extended.openjdk_x86-64_linux_testList_1/jdkbinary/j2sdk-image/lib/tools.jar
[2025-01-08T00:18:18.789Z] /home/jenkins/workspace/Test_openjdk8_hs_extended.openjdk_x86-64_linux_testList_1/jvmtest/openjdk/jtreg/lib/javatest.jar
[2025-01-08T00:18:18.789Z] /home/jenkins/workspace/Test_openjdk8_hs_extended.openjdk_x86-64_linux_testList_1/jvmtest/openjdk/jtreg/lib/jtreg.jar
[2025-01-08T00:18:18.789Z]
[2025-01-08T00:18:18.789Z] javac compilation environment
[2025-01-08T00:18:18.789Z] source path: /home/jenkins/workspace/Test_openjdk8_hs_extended.openjdk_x86-64_linux_testList_1/aqa-tests/openjdk/openjdk-jdk/jdk/test/sun/security/pkcs11/Secmod
[2025-01-08T00:18:18.789Z] /home/jenkins/workspace/Test_openjdk8_hs_extended.openjdk_x86-64_linux_testList_1/aqa-tests/openjdk/openjdk-jdk/jdk/test/sun/security/pkcs11
[2025-01-08T00:18:18.789Z] class path: /home/jenkins/workspace/Test_openjdk8_hs_extended.openjdk_x86-64_linux_testList_1/aqa-tests/openjdk/openjdk-jdk/jdk/test/sun/security/pkcs11/Secmod
[2025-01-08T00:18:18.789Z] /home/jenkins/workspace/Test_openjdk8_hs_extended.openjdk_x86-64_linux_testList_1/aqa-tests/TKG/output_17362909043282/jdk_security3_0/work/classes/0/sun/security/pkcs11/Secmod
[2025-01-08T00:18:18.789Z] /home/jenkins/workspace/Test_openjdk8_hs_extended.openjdk_x86-64_linux_testList_1/aqa-tests/TKG/output_17362909043282/jdk_security3_0/work/classes/0/sun/security/pkcs11
[2025-01-08T00:18:18.789Z] /home/jenkins/workspace/Test_openjdk8_hs_extended.openjdk_x86-64_linux_testList_1/jdkbinary/j2sdk-image/lib/tools.jar
[2025-01-08T00:18:18.789Z]
[2025-01-08T00:18:18.789Z] rerun:
[2025-01-08T00:18:18.789Z] cd /home/jenkins/workspace/Test_openjdk8_hs_extended.openjdk_x86-64_linux_testList_1/aqa-tests/TKG/output_17362909043282/jdk_security3_0/work/scratch/1 && \
[2025-01-08T00:18:18.789Z] DISPLAY=:0 \
[2025-01-08T00:18:18.789Z] HOME=/home/jenkins \
[2025-01-08T00:18:18.789Z] LANG=C.UTF-8 \
[2025-01-08T00:18:18.789Z] PATH=/bin:/usr/bin:/usr/sbin \
[2025-01-08T00:18:18.789Z] /home/jenkins/workspace/Test_openjdk8_hs_extended.openjdk_x86-64_linux_testList_1/jdkbinary/j2sdk-image/bin/javac \
[2025-01-08T00:18:18.789Z] -J-ea \
[2025-01-08T00:18:18.789Z] -J-esa \
[2025-01-08T00:18:18.789Z] -J-Xmx512m \
[2025-01-08T00:18:18.789Z] -J-XX:+UseCompressedOops \
[2025-01-08T00:18:18.789Z] -J-Dtest.vm.opts='-ea -esa -Xmx512m -XX:+UseCompressedOops' \
[2025-01-08T00:18:18.789Z] -J-Dtest.tool.vm.opts='-J-ea -J-esa -J-Xmx512m -J-XX:+UseCompressedOops' \
[2025-01-08T00:18:18.789Z] -J-Dtest.compiler.opts= \
[2025-01-08T00:18:18.789Z] -J-Dtest.java.opts= \
[2025-01-08T00:18:18.789Z] -J-Dtest.jdk=/home/jenkins/workspace/Test_openjdk8_hs_extended.openjdk_x86-64_linux_testList_1/jdkbinary/j2sdk-image \
[2025-01-08T00:18:18.789Z] -J-Dcompile.jdk=/home/jenkins/workspace/Test_openjdk8_hs_extended.openjdk_x86-64_linux_testList_1/jdkbinary/j2sdk-image \
[2025-01-08T00:18:18.789Z] -J-Dtest.timeout.factor=8.0 \
[2025-01-08T00:18:18.789Z] -J-Dtest.root=/home/jenkins/workspace/Test_openjdk8_hs_extended.openjdk_x86-64_linux_testList_1/aqa-tests/openjdk/openjdk-jdk/jdk/test \
[2025-01-08T00:18:18.789Z] -J-Dtest.name=sun/security/pkcs11/Secmod/TrustAnchors.java \
[2025-01-08T00:18:18.789Z] -J-Dtest.file=/home/jenkins/workspace/Test_openjdk8_hs_extended.openjdk_x86-64_linux_testList_1/aqa-tests/openjdk/openjdk-jdk/jdk/test/sun/security/pkcs11/Secmod/TrustAnchors.java \
[2025-01-08T00:18:18.789Z] -J-Dtest.src=/home/jenkins/workspace/Test_openjdk8_hs_extended.openjdk_x86-64_linux_testList_1/aqa-tests/openjdk/openjdk-jdk/jdk/test/sun/security/pkcs11/Secmod \
[2025-01-08T00:18:18.789Z] -J-Dtest.src.path=/home/jenkins/workspace/Test_openjdk8_hs_extended.openjdk_x86-64_linux_testList_1/aqa-tests/openjdk/openjdk-jdk/jdk/test/sun/security/pkcs11/Secmod:/home/jenkins/workspace/Test_openjdk8_hs_extended.openjdk_x86-64_linux_testList_1/aqa-tests/openjdk/openjdk-jdk/jdk/test/sun/security/pkcs11 \
[2025-01-08T00:18:18.789Z] -J-Dtest.classes=/home/jenkins/workspace/Test_openjdk8_hs_extended.openjdk_x86-64_linux_testList_1/aqa-tests/TKG/output_17362909043282/jdk_security3_0/work/classes/0/sun/security/pkcs11/Secmod \
[2025-01-08T00:18:18.789Z] -J-Dtest.class.path=/home/jenkins/workspace/Test_openjdk8_hs_extended.openjdk_x86-64_linux_testList_1/aqa-tests/TKG/output_17362909043282/jdk_security3_0/work/classes/0/sun/security/pkcs11/Secmod:/home/jenkins/workspace/Test_openjdk8_hs_extended.openjdk_x86-64_linux_testList_1/aqa-tests/TKG/output_17362909043282/jdk_security3_0/work/classes/0/sun/security/pkcs11 \
[2025-01-08T00:18:18.789Z] -J-Dtest.class.path.prefix=/home/jenkins/workspace/Test_openjdk8_hs_extended.openjdk_x86-64_linux_testList_1/aqa-tests/TKG/output_17362909043282/jdk_security3_0/work/classes/0/sun/security/pkcs11/Secmod:/home/jenkins/workspace/Test_openjdk8_hs_extended.openjdk_x86-64_linux_testList_1/aqa-tests/openjdk/openjdk-jdk/jdk/test/sun/security/pkcs11/Secmod:/home/jenkins/workspace/Test_openjdk8_hs_extended.openjdk_x86-64_linux_testList_1/aqa-tests/TKG/output_17362909043282/jdk_security3_0/work/classes/0/sun/security/pkcs11 \
[2025-01-08T00:18:18.789Z] -d /home/jenkins/workspace/Test_openjdk8_hs_extended.openjdk_x86-64_linux_testList_1/aqa-tests/TKG/output_17362909043282/jdk_security3_0/work/classes/0/sun/security/pkcs11/Secmod \
[2025-01-08T00:18:18.789Z] -sourcepath /home/jenkins/workspace/Test_openjdk8_hs_extended.openjdk_x86-64_linux_testList_1/aqa-tests/openjdk/openjdk-jdk/jdk/test/sun/security/pkcs11/Secmod:/home/jenkins/workspace/Test_openjdk8_hs_extended.openjdk_x86-64_linux_testList_1/aqa-tests/openjdk/openjdk-jdk/jdk/test/sun/security/pkcs11 \
[2025-01-08T00:18:18.789Z] -classpath /home/jenkins/workspace/Test_openjdk8_hs_extended.openjdk_x86-64_linux_testList_1/aqa-tests/openjdk/openjdk-jdk/jdk/test/sun/security/pkcs11/Secmod:/home/jenkins/workspace/Test_openjdk8_hs_extended.openjdk_x86-64_linux_testList_1/aqa-tests/TKG/output_17362909043282/jdk_security3_0/work/classes/0/sun/security/pkcs11/Secmod:/home/jenkins/workspace/Test_openjdk8_hs_extended.openjdk_x86-64_linux_testList_1/aqa-tests/TKG/output_17362909043282/jdk_security3_0/work/classes/0/sun/security/pkcs11:/home/jenkins/workspace/Test_openjdk8_hs_extended.openjdk_x86-64_linux_testList_1/jdkbinary/j2sdk-image/lib/tools.jar \
[2025-01-08T00:18:18.789Z] -XDignore.symbol.file=true /home/jenkins/workspace/Test_openjdk8_hs_extended.openjdk_x86-64_linux_testList_1/aqa-tests/openjdk/openjdk-jdk/jdk/test/sun/security/pkcs11/Secmod/TrustAnchors.java
[2025-01-08T00:18:18.789Z]
[2025-01-08T00:18:18.789Z] ACTION: main -- Failed. Execution failed: `main' threw exception: java.lang.reflect.InvocationTargetException
[2025-01-08T00:18:18.789Z] REASON: User specified action: run main/othervm TrustAnchors
[2025-01-08T00:18:18.789Z] TIME: 1.448 seconds
[2025-01-08T00:18:18.789Z] messages:
[2025-01-08T00:18:18.789Z] command: main TrustAnchors
[2025-01-08T00:18:18.789Z] reason: User specified action: run main/othervm TrustAnchors
[2025-01-08T00:18:18.789Z] Mode: othervm [/othervm specified]
[2025-01-08T00:18:18.789Z] elapsed time (seconds): 1.448
[2025-01-08T00:18:18.789Z] configuration:
[2025-01-08T00:18:18.789Z] STDOUT:
[2025-01-08T00:18:18.789Z] libsoftokn3 version = 3.105. ECC Basic.
[2025-01-08T00:18:18.789Z] STDERR:
[2025-01-08T00:18:18.789Z] java.lang.reflect.InvocationTargetException
[2025-01-08T00:18:18.789Z] at sun.reflect.NativeConstructorAccessorImpl.newInstance0(Native Method)
[2025-01-08T00:18:18.789Z] at sun.reflect.NativeConstructorAccessorImpl.newInstance(NativeConstructorAccessorImpl.java:62)
[2025-01-08T00:18:18.789Z] at sun.reflect.DelegatingConstructorAccessorImpl.newInstance(DelegatingConstructorAccessorImpl.java:45)
[2025-01-08T00:18:18.789Z] at java.lang.reflect.Constructor.newInstance(Constructor.java:423)
[2025-01-08T00:18:18.789Z] at PKCS11Test.getSunPKCS11(PKCS11Test.java:108)
[2025-01-08T00:18:18.789Z] at TrustAnchors.main(TrustAnchors.java:58)
[2025-01-08T00:18:18.789Z] at sun.reflect.NativeMethodAccessorImpl.invoke0(Native Method)
[2025-01-08T00:18:18.789Z] at sun.reflect.NativeMethodAccessorImpl.invoke(NativeMethodAccessorImpl.java:62)
[2025-01-08T00:18:18.789Z] at sun.reflect.DelegatingMethodAccessorImpl.invoke(DelegatingMethodAccessorImpl.java:43)
[2025-01-08T00:18:18.789Z] at java.lang.reflect.Method.invoke(Method.java:498)
[2025-01-08T00:18:18.789Z] at com.sun.javatest.regtest.agent.MainWrapper$MainThread.run(MainWrapper.java:127)
[2025-01-08T00:18:18.789Z] at java.lang.Thread.run(Thread.java:750)
[2025-01-08T00:18:18.789Z] Caused by: java.security.ProviderException: Could not initialize NSS
[2025-01-08T00:18:18.789Z] at sun.security.pkcs11.SunPKCS11.<init>(SunPKCS11.java:212)
[2025-01-08T00:18:18.789Z] at sun.security.pkcs11.SunPKCS11.<init>(SunPKCS11.java:103)
[2025-01-08T00:18:18.789Z] ... 12 more
[2025-01-08T00:18:18.789Z] Caused by: java.io.IOException: NSS initialization failed
[2025-01-08T00:18:18.789Z] at sun.security.pkcs11.Secmod.initialize(Secmod.java:243)
[2025-01-08T00:18:18.789Z] at sun.security.pkcs11.SunPKCS11.<init>(SunPKCS11.java:207)
[2025-01-08T00:18:18.789Z] ... 13 more
[2025-01-08T00:18:18.789Z]
[2025-01-08T00:18:18.789Z] JavaTest Message: Test threw exception: java.lang.reflect.InvocationTargetException
[2025-01-08T00:18:18.789Z] JavaTest Message: shutting down test
[2025-01-08T00:18:18.789Z]
[2025-01-08T00:18:18.789Z] STATUS:Failed.`main' threw exception: java.lang.reflect.InvocationTargetException
[2025-01-08T00:18:18.789Z] rerun:
[2025-01-08T00:18:18.789Z] cd /home/jenkins/workspace/Test_openjdk8_hs_extended.openjdk_x86-64_linux_testList_1/aqa-tests/TKG/output_17362909043282/jdk_security3_0/work/scratch/1 && \
[2025-01-08T00:18:18.789Z] DISPLAY=:0 \
[2025-01-08T00:18:18.789Z] HOME=/home/jenkins \
[2025-01-08T00:18:18.789Z] LANG=C.UTF-8 \
[2025-01-08T00:18:18.789Z] PATH=/bin:/usr/bin:/usr/sbin \
[2025-01-08T00:18:18.789Z] CLASSPATH=/home/jenkins/workspace/Test_openjdk8_hs_extended.openjdk_x86-64_linux_testList_1/aqa-tests/TKG/output_17362909043282/jdk_security3_0/work/classes/0/sun/security/pkcs11/Secmod:/home/jenkins/workspace/Test_openjdk8_hs_extended.openjdk_x86-64_linux_testList_1/aqa-tests/openjdk/openjdk-jdk/jdk/test/sun/security/pkcs11/Secmod:/home/jenkins/workspace/Test_openjdk8_hs_extended.openjdk_x86-64_linux_testList_1/aqa-tests/TKG/output_17362909043282/jdk_security3_0/work/classes/0/sun/security/pkcs11:/home/jenkins/workspace/Test_openjdk8_hs_extended.openjdk_x86-64_linux_testList_1/aqa-tests/openjdk/openjdk-jdk/jdk/test/sun/security/pkcs11:/home/jenkins/workspace/Test_openjdk8_hs_extended.openjdk_x86-64_linux_testList_1/jdkbinary/j2sdk-image/lib/tools.jar:/home/jenkins/workspace/Test_openjdk8_hs_extended.openjdk_x86-64_linux_testList_1/jvmtest/openjdk/jtreg/lib/javatest.jar:/home/jenkins/workspace/Test_openjdk8_hs_extended.openjdk_x86-64_linux_testList_1/jvmtest/openjdk/jtreg/lib/jtreg.jar \
[2025-01-08T00:18:18.789Z] /home/jenkins/workspace/Test_openjdk8_hs_extended.openjdk_x86-64_linux_testList_1/jdkbinary/j2sdk-image/bin/java \
[2025-01-08T00:18:18.789Z] -Dtest.vm.opts='-ea -esa -Xmx512m -XX:+UseCompressedOops' \
[2025-01-08T00:18:18.789Z] -Dtest.tool.vm.opts='-J-ea -J-esa -J-Xmx512m -J-XX:+UseCompressedOops' \
[2025-01-08T00:18:18.789Z] -Dtest.compiler.opts= \
[2025-01-08T00:18:18.789Z] -Dtest.java.opts= \
[2025-01-08T00:18:18.789Z] -Dtest.jdk=/home/jenkins/workspace/Test_openjdk8_hs_extended.openjdk_x86-64_linux_testList_1/jdkbinary/j2sdk-image \
[2025-01-08T00:18:18.789Z] -Dcompile.jdk=/home/jenkins/workspace/Test_openjdk8_hs_extended.openjdk_x86-64_linux_testList_1/jdkbinary/j2sdk-image \
[2025-01-08T00:18:18.789Z] -Dtest.timeout.factor=8.0 \
[2025-01-08T00:18:18.789Z] -Dtest.root=/home/jenkins/workspace/Test_openjdk8_hs_extended.openjdk_x86-64_linux_testList_1/aqa-tests/openjdk/openjdk-jdk/jdk/test \
[2025-01-08T00:18:18.789Z] -Dtest.name=sun/security/pkcs11/Secmod/TrustAnchors.java \
[2025-01-08T00:18:18.789Z] -Dtest.file=/home/jenkins/workspace/Test_openjdk8_hs_extended.openjdk_x86-64_linux_testList_1/aqa-tests/openjdk/openjdk-jdk/jdk/test/sun/security/pkcs11/Secmod/TrustAnchors.java \
[2025-01-08T00:18:18.789Z] -Dtest.src=/home/jenkins/workspace/Test_openjdk8_hs_extended.openjdk_x86-64_linux_testList_1/aqa-tests/openjdk/openjdk-jdk/jdk/test/sun/security/pkcs11/Secmod \
[2025-01-08T00:18:18.789Z] -Dtest.src.path=/home/jenkins/workspace/Test_openjdk8_hs_extended.openjdk_x86-64_linux_testList_1/aqa-tests/openjdk/openjdk-jdk/jdk/test/sun/security/pkcs11/Secmod:/home/jenkins/workspace/Test_openjdk8_hs_extended.openjdk_x86-64_linux_testList_1/aqa-tests/openjdk/openjdk-jdk/jdk/test/sun/security/pkcs11 \
[2025-01-08T00:18:18.789Z] -Dtest.classes=/home/jenkins/workspace/Test_openjdk8_hs_extended.openjdk_x86-64_linux_testList_1/aqa-tests/TKG/output_17362909043282/jdk_security3_0/work/classes/0/sun/security/pkcs11/Secmod \
[2025-01-08T00:18:18.789Z] -Dtest.class.path=/home/jenkins/workspace/Test_openjdk8_hs_extended.openjdk_x86-64_linux_testList_1/aqa-tests/TKG/output_17362909043282/jdk_security3_0/work/classes/0/sun/security/pkcs11/Secmod:/home/jenkins/workspace/Test_openjdk8_hs_extended.openjdk_x86-64_linux_testList_1/aqa-tests/TKG/output_17362909043282/jdk_security3_0/work/classes/0/sun/security/pkcs11 \
[2025-01-08T00:18:18.789Z] -Dtest.class.path.prefix=/home/jenkins/workspace/Test_openjdk8_hs_extended.openjdk_x86-64_linux_testList_1/aqa-tests/TKG/output_17362909043282/jdk_security3_0/work/classes/0/sun/security/pkcs11/Secmod:/home/jenkins/workspace/Test_openjdk8_hs_extended.openjdk_x86-64_linux_testList_1/aqa-tests/openjdk/openjdk-jdk/jdk/test/sun/security/pkcs11/Secmod:/home/jenkins/workspace/Test_openjdk8_hs_extended.openjdk_x86-64_linux_testList_1/aqa-tests/TKG/output_17362909043282/jdk_security3_0/work/classes/0/sun/security/pkcs11 \
[2025-01-08T00:18:18.789Z] -ea \
[2025-01-08T00:18:18.789Z] -esa \
[2025-01-08T00:18:18.789Z] -Xmx512m \
[2025-01-08T00:18:18.789Z] -XX:+UseCompressedOops \
[2025-01-08T00:18:18.789Z] com.sun.javatest.regtest.agent.MainWrapper /home/jenkins/workspace/Test_openjdk8_hs_extended.openjdk_x86-64_linux_testList_1/aqa-tests/TKG/output_17362909043282/jdk_security3_0/work/sun/security/pkcs11/Secmod/TrustAnchors.d/main.0.jta
[2025-01-08T00:18:18.789Z]
[2025-01-08T00:18:18.789Z] TEST RESULT: Failed. Execution failed: `main' threw exception: java.lang.reflect.InvocationTargetException
[2025-01-08T00:18:18.789Z] --------------------------------------------------
[2025-01-08T00:18:49.624Z] TEST: sun/security/pkcs11/sslecc/ClientJSSEServerJSSE.java
[2025-01-08T00:18:49.624Z] TEST JDK: /home/jenkins/workspace/Test_openjdk8_hs_extended.openjdk_x86-64_linux_testList_1/jdkbinary/j2sdk-image
[2025-01-08T00:18:49.624Z]
[2025-01-08T00:18:49.624Z] ACTION: build -- Passed. Build successful
[2025-01-08T00:18:49.624Z] REASON: Named class compiled on demand
[2025-01-08T00:18:49.624Z] TIME: 1.713 seconds
[2025-01-08T00:18:49.624Z] messages:
[2025-01-08T00:18:49.624Z] command: build ClientJSSEServerJSSE
[2025-01-08T00:18:49.624Z] reason: Named class compiled on demand
[2025-01-08T00:18:49.624Z] Test directory:
[2025-01-08T00:18:49.624Z] compile: ClientJSSEServerJSSE
[2025-01-08T00:18:49.624Z] elapsed time (seconds): 1.713
[2025-01-08T00:18:49.624Z]
[2025-01-08T00:18:49.624Z] ACTION: compile -- Passed. Compilation successful
[2025-01-08T00:18:49.624Z] REASON: .class file out of date or does not exist
[2025-01-08T00:18:49.624Z] TIME: 1.713 seconds
[2025-01-08T00:18:49.624Z] messages:
[2025-01-08T00:18:49.624Z] command: compile -XDignore.symbol.file=true /home/jenkins/workspace/Test_openjdk8_hs_extended.openjdk_x86-64_linux_testList_1/aqa-tests/openjdk/openjdk-jdk/jdk/test/sun/security/pkcs11/sslecc/ClientJSSEServerJSSE.java
[2025-01-08T00:18:49.624Z] reason: .class file out of date or does not exist
[2025-01-08T00:18:49.624Z] Mode: agentvm
[2025-01-08T00:18:49.624Z] Agent id: 2
[2025-01-08T00:18:49.624Z] elapsed time (seconds): 1.713
[2025-01-08T00:18:49.624Z] configuration:
[2025-01-08T00:18:49.624Z] Boot Layer (javac runtime environment)
[2025-01-08T00:18:49.624Z] class path: /home/jenkins/workspace/Test_openjdk8_hs_extended.openjdk_x86-64_linux_testList_1/jdkbinary/j2sdk-image/lib/tools.jar
[2025-01-08T00:18:49.624Z] /home/jenkins/workspace/Test_openjdk8_hs_extended.openjdk_x86-64_linux_testList_1/jvmtest/openjdk/jtreg/lib/javatest.jar
[2025-01-08T00:18:49.624Z] /home/jenkins/workspace/Test_openjdk8_hs_extended.openjdk_x86-64_linux_testList_1/jvmtest/openjdk/jtreg/lib/jtreg.jar
[2025-01-08T00:18:49.624Z]
[2025-01-08T00:18:49.624Z] javac compilation environment
[2025-01-08T00:18:49.624Z] source path: /home/jenkins/workspace/Test_openjdk8_hs_extended.openjdk_x86-64_linux_testList_1/aqa-tests/openjdk/openjdk-jdk/jdk/test/sun/security/pkcs11/sslecc
[2025-01-08T00:18:49.624Z] /home/jenkins/workspace/Test_openjdk8_hs_extended.openjdk_x86-64_linux_testList_1/aqa-tests/openjdk/openjdk-jdk/jdk/test/java/security/testlibrary
[2025-01-08T00:18:49.624Z] /home/jenkins/workspace/Test_openjdk8_hs_extended.openjdk_x86-64_linux_testList_1/aqa-tests/openjdk/openjdk-jdk/test/lib
[2025-01-08T00:18:49.624Z] /home/jenkins/workspace/Test_openjdk8_hs_extended.openjdk_x86-64_linux_testList_1/aqa-tests/openjdk/openjdk-jdk/jdk/test/sun/security/pkcs11
[2025-01-08T00:18:49.624Z] /home/jenkins/workspace/Test_openjdk8_hs_extended.openjdk_x86-64_linux_testList_1/aqa-tests/openjdk/openjdk-jdk/jdk/test/javax/net/ssl/TLSCommon
[2025-01-08T00:18:49.624Z] class path: /home/jenkins/workspace/Test_openjdk8_hs_extended.openjdk_x86-64_linux_testList_1/aqa-tests/openjdk/openjdk-jdk/jdk/test/sun/security/pkcs11/sslecc
[2025-01-08T00:18:49.624Z] /home/jenkins/workspace/Test_openjdk8_hs_extended.openjdk_x86-64_linux_testList_1/aqa-tests/TKG/output_17362909043282/jdk_security3_0/work/classes/2/sun/security/pkcs11/sslecc
[2025-01-08T00:18:49.624Z] /home/jenkins/workspace/Test_openjdk8_hs_extended.openjdk_x86-64_linux_testList_1/aqa-tests/TKG/output_17362909043282/jdk_security3_0/work/classes/2/java/security/testlibrary
[2025-01-08T00:18:49.624Z] /home/jenkins/workspace/Test_openjdk8_hs_extended.openjdk_x86-64_linux_testList_1/aqa-tests/TKG/output_17362909043282/jdk_security3_0/work/classes/2/test/lib
[2025-01-08T00:18:49.624Z] /home/jenkins/workspace/Test_openjdk8_hs_extended.openjdk_x86-64_linux_testList_1/aqa-tests/TKG/output_17362909043282/jdk_security3_0/work/classes/2/sun/security/pkcs11
[2025-01-08T00:18:49.624Z] /home/jenkins/workspace/Test_openjdk8_hs_extended.openjdk_x86-64_linux_testList_1/aqa-tests/TKG/output_17362909043282/jdk_security3_0/work/classes/2/javax/net/ssl/TLSCommon
[2025-01-08T00:18:49.624Z] /home/jenkins/workspace/Test_openjdk8_hs_extended.openjdk_x86-64_linux_testList_1/jdkbinary/j2sdk-image/lib/tools.jar
[2025-01-08T00:18:49.624Z]
[2025-01-08T00:18:49.624Z] rerun:
[2025-01-08T00:18:49.624Z] cd /home/jenkins/workspace/Test_openjdk8_hs_extended.openjdk_x86-64_linux_testList_1/aqa-tests/TKG/output_17362909043282/jdk_security3_0/work/scratch/2 && \
[2025-01-08T00:18:49.624Z] DISPLAY=:0 \
[2025-01-08T00:18:49.624Z] HOME=/home/jenkins \
[2025-01-08T00:18:49.624Z] LANG=C.UTF-8 \
[2025-01-08T00:18:49.624Z] PATH=/bin:/usr/bin:/usr/sbin \
[2025-01-08T00:18:49.624Z] /home/jenkins/workspace/Test_openjdk8_hs_extended.openjdk_x86-64_linux_testList_1/jdkbinary/j2sdk-image/bin/javac \
[2025-01-08T00:18:49.624Z] -J-ea \
[2025-01-08T00:18:49.624Z] -J-esa \
[2025-01-08T00:18:49.624Z] -J-Xmx512m \
[2025-01-08T00:18:49.624Z] -J-XX:+UseCompressedOops \
[2025-01-08T00:18:49.625Z] -J-Dtest.vm.opts='-ea -esa -Xmx512m -XX:+UseCompressedOops' \
[2025-01-08T00:18:49.625Z] -J-Dtest.tool.vm.opts='-J-ea -J-esa -J-Xmx512m -J-XX:+UseCompressedOops' \
[2025-01-08T00:18:49.625Z] -J-Dtest.compiler.opts= \
[2025-01-08T00:18:49.625Z] -J-Dtest.java.opts= \
[2025-01-08T00:18:49.625Z] -J-Dtest.jdk=/home/jenkins/workspace/Test_openjdk8_hs_extended.openjdk_x86-64_linux_testList_1/jdkbinary/j2sdk-image \
[2025-01-08T00:18:49.625Z] -J-Dcompile.jdk=/home/jenkins/workspace/Test_openjdk8_hs_extended.openjdk_x86-64_linux_testList_1/jdkbinary/j2sdk-image \
[2025-01-08T00:18:49.625Z] -J-Dtest.timeout.factor=8.0 \
[2025-01-08T00:18:49.625Z] -J-Dtest.root=/home/jenkins/workspace/Test_openjdk8_hs_extended.openjdk_x86-64_linux_testList_1/aqa-tests/openjdk/openjdk-jdk/jdk/test \
[2025-01-08T00:18:49.625Z] -J-Dtest.name=sun/security/pkcs11/sslecc/ClientJSSEServerJSSE.java \
[2025-01-08T00:18:49.625Z] -J-Dtest.file=/home/jenkins/workspace/Test_openjdk8_hs_extended.openjdk_x86-64_linux_testList_1/aqa-tests/openjdk/openjdk-jdk/jdk/test/sun/security/pkcs11/sslecc/ClientJSSEServerJSSE.java \
[2025-01-08T00:18:49.625Z] -J-Dtest.src=/home/jenkins/workspace/Test_openjdk8_hs_extended.openjdk_x86-64_linux_testList_1/aqa-tests/openjdk/openjdk-jdk/jdk/test/sun/security/pkcs11/sslecc \
[2025-01-08T00:18:49.625Z] -J-Dtest.src.path=/home/jenkins/workspace/Test_openjdk8_hs_extended.openjdk_x86-64_linux_testList_1/aqa-tests/openjdk/openjdk-jdk/jdk/test/sun/security/pkcs11/sslecc:/home/jenkins/workspace/Test_openjdk8_hs_extended.openjdk_x86-64_linux_testList_1/aqa-tests/openjdk/openjdk-jdk/jdk/test/java/security/testlibrary:/home/jenkins/workspace/Test_openjdk8_hs_extended.openjdk_x86-64_linux_testList_1/aqa-tests/openjdk/openjdk-jdk/test/lib:/home/jenkins/workspace/Test_openjdk8_hs_extended.openjdk_x86-64_linux_testList_1/aqa-tests/openjdk/openjdk-jdk/jdk/test/sun/security/pkcs11:/home/jenkins/workspace/Test_openjdk8_hs_extended.openjdk_x86-64_linux_testList_1/aqa-tests/openjdk/openjdk-jdk/jdk/test/javax/net/ssl/TLSCommon \
[2025-01-08T00:18:49.625Z] -J-Dtest.classes=/home/jenkins/workspace/Test_openjdk8_hs_extended.openjdk_x86-64_linux_testList_1/aqa-tests/TKG/output_17362909043282/jdk_security3_0/work/classes/2/sun/security/pkcs11/sslecc \
[2025-01-08T00:18:49.625Z] -J-Dtest.class.path=/home/jenkins/workspace/Test_openjdk8_hs_extended.openjdk_x86-64_linux_testList_1/aqa-tests/TKG/output_17362909043282/jdk_security3_0/work/classes/2/sun/security/pkcs11/sslecc:/home/jenkins/workspace/Test_openjdk8_hs_extended.openjdk_x86-64_linux_testList_1/aqa-tests/TKG/output_17362909043282/jdk_security3_0/work/classes/2/java/security/testlibrary:/home/jenkins/workspace/Test_openjdk8_hs_extended.openjdk_x86-64_linux_testList_1/aqa-tests/TKG/output_17362909043282/jdk_security3_0/work/classes/2/test/lib:/home/jenkins/workspace/Test_openjdk8_hs_extended.openjdk_x86-64_linux_testList_1/aqa-tests/TKG/output_17362909043282/jdk_security3_0/work/classes/2/sun/security/pkcs11:/home/jenkins/workspace/Test_openjdk8_hs_extended.openjdk_x86-64_linux_testList_1/aqa-tests/TKG/output_17362909043282/jdk_security3_0/work/classes/2/javax/net/ssl/TLSCommon \
[2025-01-08T00:18:49.625Z] -J-Dtest.class.path.prefix=/home/jenkins/workspace/Test_openjdk8_hs_extended.openjdk_x86-64_linux_testList_1/aqa-tests/TKG/output_17362909043282/jdk_security3_0/work/classes/2/sun/security/pkcs11/sslecc:/home/jenkins/workspace/Test_openjdk8_hs_extended.openjdk_x86-64_linux_testList_1/aqa-tests/openjdk/openjdk-jdk/jdk/test/sun/security/pkcs11/sslecc:/home/jenkins/workspace/Test_openjdk8_hs_extended.openjdk_x86-64_linux_testList_1/aqa-tests/TKG/output_17362909043282/jdk_security3_0/work/classes/2/java/security/testlibrary:/home/jenkins/workspace/Test_openjdk8_hs_extended.openjdk_x86-64_linux_testList_1/aqa-tests/TKG/output_17362909043282/jdk_security3_0/work/classes/2/test/lib:/home/jenkins/workspace/Test_openjdk8_hs_extended.openjdk_x86-64_linux_testList_1/aqa-tests/TKG/output_17362909043282/jdk_security3_0/work/classes/2/sun/security/pkcs11:/home/jenkins/workspace/Test_openjdk8_hs_extended.openjdk_x86-64_linux_testList_1/aqa-tests/TKG/output_17362909043282/jdk_security3_0/work/classes/2/javax/net/ssl/TLSCommon \
[2025-01-08T00:18:49.625Z] -d /home/jenkins/workspace/Test_openjdk8_hs_extended.openjdk_x86-64_linux_testList_1/aqa-tests/TKG/output_17362909043282/jdk_security3_0/work/classes/2/sun/security/pkcs11/sslecc \
[2025-01-08T00:18:49.625Z] -sourcepath /home/jenkins/workspace/Test_openjdk8_hs_extended.openjdk_x86-64_linux_testList_1/aqa-tests/openjdk/openjdk-jdk/jdk/test/sun/security/pkcs11/sslecc:/home/jenkins/workspace/Test_openjdk8_hs_extended.openjdk_x86-64_linux_testList_1/aqa-tests/openjdk/openjdk-jdk/jdk/test/java/security/testlibrary:/home/jenkins/workspace/Test_openjdk8_hs_extended.openjdk_x86-64_linux_testList_1/aqa-tests/openjdk/openjdk-jdk/test/lib:/home/jenkins/workspace/Test_openjdk8_hs_extended.openjdk_x86-64_linux_testList_1/aqa-tests/openjdk/openjdk-jdk/jdk/test/sun/security/pkcs11:/home/jenkins/workspace/Test_openjdk8_hs_extended.openjdk_x86-64_linux_testList_1/aqa-tests/openjdk/openjdk-jdk/jdk/test/javax/net/ssl/TLSCommon \
[2025-01-08T00:18:49.625Z] -classpath /home/jenkins/workspace/Test_openjdk8_hs_extended.openjdk_x86-64_linux_testList_1/aqa-tests/openjdk/openjdk-jdk/jdk/test/sun/security/pkcs11/sslecc:/home/jenkins/workspace/Test_openjdk8_hs_extended.openjdk_x86-64_linux_testList_1/aqa-tests/TKG/output_17362909043282/jdk_security3_0/work/classes/2/sun/security/pkcs11/sslecc:/home/jenkins/workspace/Test_openjdk8_hs_extended.openjdk_x86-64_linux_testList_1/aqa-tests/TKG/output_17362909043282/jdk_security3_0/work/classes/2/java/security/testlibrary:/home/jenkins/workspace/Test_openjdk8_hs_extended.openjdk_x86-64_linux_testList_1/aqa-tests/TKG/output_17362909043282/jdk_security3_0/work/classes/2/test/lib:/home/jenkins/workspace/Test_openjdk8_hs_extended.openjdk_x86-64_linux_testList_1/aqa-tests/TKG/output_17362909043282/jdk_security3_0/work/classes/2/sun/security/pkcs11:/home/jenkins/workspace/Test_openjdk8_hs_extended.openjdk_x86-64_linux_testList_1/aqa-tests/TKG/output_17362909043282/jdk_security3_0/work/classes/2/javax/net/ssl/TLSCommon:/home/jenkins/workspace/Test_openjdk8_hs_extended.openjdk_x86-64_linux_testList_1/jdkbinary/j2sdk-image/lib/tools.jar \
[2025-01-08T00:18:49.625Z] -XDignore.symbol.file=true /home/jenkins/workspace/Test_openjdk8_hs_extended.openjdk_x86-64_linux_testList_1/aqa-tests/openjdk/openjdk-jdk/jdk/test/sun/security/pkcs11/sslecc/ClientJSSEServerJSSE.java
[2025-01-08T00:18:49.625Z] direct:
[2025-01-08T00:18:49.625Z] Note: /home/jenkins/workspace/Test_openjdk8_hs_extended.openjdk_x86-64_linux_testList_1/aqa-tests/openjdk/openjdk-jdk/jdk/test/sun/security/pkcs11/PKCS11Test.java uses unchecked or unsafe operations.
[2025-01-08T00:18:49.625Z] Note: Recompile with -Xlint:unchecked for details.
[2025-01-08T00:18:49.625Z]
[2025-01-08T00:18:49.625Z] ACTION: main -- Failed. Unexpected exit from test [exit code: 134]
[2025-01-08T00:18:49.625Z] REASON: User specified action: run main/othervm -Djdk.tls.namedGroups="secp256r1,sect193r1" ClientJSSEServerJSSE
[2025-01-08T00:18:49.625Z] TIME: 7.097 seconds
[2025-01-08T00:18:49.625Z] messages:
[2025-01-08T00:18:49.625Z] command: main -Djdk.tls.namedGroups="secp256r1,sect193r1" ClientJSSEServerJSSE
[2025-01-08T00:18:49.625Z] reason: User specified action: run main/othervm -Djdk.tls.namedGroups="secp256r1,sect193r1" ClientJSSEServerJSSE
[2025-01-08T00:18:49.625Z] Mode: othervm [/othervm specified]
[2025-01-08T00:18:49.625Z] elapsed time (seconds): 7.097
[2025-01-08T00:18:49.625Z] configuration:
[2025-01-08T00:18:49.625Z] STDOUT:
[2025-01-08T00:18:49.625Z] libsoftokn3 version = 3.105. ECC Basic.
[2025-01-08T00:18:49.625Z] Beginning test run ClientJSSEServerJSSE...
[2025-01-08T00:18:49.625Z] Running test with provider SunPKCS11-NSS (security manager disabled) ...
[2025-01-08T00:18:49.625Z] Initializing test 'Client JSSE - Server JSSE'...Skipping unsupported test for TLS_AES_256_GCM_SHA384 of SSLv2Hello
[2025-01-08T00:18:49.625Z] Skipping unsupported test for TLS_AES_128_GCM_SHA256 of SSLv2Hello
[2025-01-08T00:18:49.625Z] Skipping unsupported test for TLS_ECDHE_ECDSA_WITH_AES_256_GCM_SHA384 of SSLv2Hello
[2025-01-08T00:18:49.625Z] Skipping unsupported test for TLS_ECDHE_ECDSA_WITH_AES_128_GCM_SHA256 of SSLv2Hello
[2025-01-08T00:18:49.625Z] Skipping unsupported test for TLS_ECDHE_RSA_WITH_AES_256_GCM_SHA384 of SSLv2Hello
[2025-01-08T00:18:49.625Z] Skipping unsupported test for TLS_ECDHE_RSA_WITH_AES_128_GCM_SHA256 of SSLv2Hello
[2025-01-08T00:18:49.625Z] Skipping unsupported test for TLS_DHE_RSA_WITH_AES_256_GCM_SHA384 of SSLv2Hello
[2025-01-08T00:18:49.625Z] Skipping unsupported test for TLS_DHE_DSS_WITH_AES_256_GCM_SHA384 of SSLv2Hello
[2025-01-08T00:18:49.625Z] Skipping unsupported test for TLS_DHE_RSA_WITH_AES_128_GCM_SHA256 of SSLv2Hello
[2025-01-08T00:18:49.625Z] Skipping unsupported test for TLS_DHE_DSS_WITH_AES_128_GCM_SHA256 of SSLv2Hello
[2025-01-08T00:18:49.625Z] Skipping unsupported test for TLS_ECDHE_ECDSA_WITH_AES_256_CBC_SHA384 of SSLv2Hello
[2025-01-08T00:18:49.625Z] Skipping unsupported test for TLS_ECDHE_RSA_WITH_AES_256_CBC_SHA384 of SSLv2Hello
[2025-01-08T00:18:49.625Z] Skipping unsupported test for TLS_ECDHE_ECDSA_WITH_AES_128_CBC_SHA256 of SSLv2Hello
[2025-01-08T00:18:49.625Z] Skipping unsupported test for TLS_ECDHE_RSA_WITH_AES_128_CBC_SHA256 of SSLv2Hello
[2025-01-08T00:18:49.625Z] Skipping unsupported test for TLS_DHE_RSA_WITH_AES_256_CBC_SHA256 of SSLv2Hello
[2025-01-08T00:18:49.625Z] Skipping unsupported test for TLS_DHE_DSS_WITH_AES_256_CBC_SHA256 of SSLv2Hello
[2025-01-08T00:18:49.625Z] Skipping unsupported test for TLS_DHE_RSA_WITH_AES_128_CBC_SHA256 of SSLv2Hello
[2025-01-08T00:18:49.625Z] Skipping unsupported test for TLS_DHE_DSS_WITH_AES_128_CBC_SHA256 of SSLv2Hello
[2025-01-08T00:18:49.625Z] Skipping unsupported test for TLS_ECDH_ECDSA_WITH_AES_256_GCM_SHA384 of SSLv2Hello
[2025-01-08T00:18:49.625Z] Skipping unsupported test for TLS_ECDH_RSA_WITH_AES_256_GCM_SHA384 of SSLv2Hello
[2025-01-08T00:18:49.625Z] Skipping unsupported test for TLS_ECDH_ECDSA_WITH_AES_128_GCM_SHA256 of SSLv2Hello
[2025-01-08T00:18:49.625Z] Skipping unsupported test for TLS_ECDH_RSA_WITH_AES_128_GCM_SHA256 of SSLv2Hello
[2025-01-08T00:18:49.625Z] Skipping unsupported test for TLS_ECDH_ECDSA_WITH_AES_256_CBC_SHA384 of SSLv2Hello
[2025-01-08T00:18:49.625Z] Skipping unsupported test for TLS_ECDH_RSA_WITH_AES_256_CBC_SHA384 of SSLv2Hello
[2025-01-08T00:18:49.625Z] Skipping unsupported test for TLS_ECDH_ECDSA_WITH_AES_128_CBC_SHA256 of SSLv2Hello
[2025-01-08T00:18:49.625Z] Skipping unsupported test for TLS_ECDH_RSA_WITH_AES_128_CBC_SHA256 of SSLv2Hello
[2025-01-08T00:18:49.625Z] Skipping unsupported test for TLS_ECDHE_ECDSA_WITH_AES_256_CBC_SHA of SSLv2Hello
[2025-01-08T00:18:49.625Z] Skipping unsupported test for TLS_ECDHE_RSA_WITH_AES_256_CBC_SHA of SSLv2Hello
[2025-01-08T00:18:49.625Z] Skipping unsupported test for TLS_ECDHE_ECDSA_WITH_AES_128_CBC_SHA of SSLv2Hello
[2025-01-08T00:18:49.625Z] Skipping unsupported test for TLS_ECDHE_RSA_WITH_AES_128_CBC_SHA of SSLv2Hello
[2025-01-08T00:18:49.625Z] Skipping unsupported test for TLS_DHE_RSA_WITH_AES_256_CBC_SHA of SSLv2Hello
[2025-01-08T00:18:49.625Z] Skipping unsupported test for TLS_DHE_DSS_WITH_AES_256_CBC_SHA of SSLv2Hello
[2025-01-08T00:18:49.625Z] Skipping unsupported test for TLS_DHE_RSA_WITH_AES_128_CBC_SHA of SSLv2Hello
[2025-01-08T00:18:49.625Z] Skipping unsupported test for TLS_DHE_DSS_WITH_AES_128_CBC_SHA of SSLv2Hello
[2025-01-08T00:18:49.625Z] Skipping unsupported test for TLS_ECDH_ECDSA_WITH_AES_256_CBC_SHA of SSLv2Hello
[2025-01-08T00:18:49.625Z] Skipping unsupported test for TLS_ECDH_RSA_WITH_AES_256_CBC_SHA of SSLv2Hello
[2025-01-08T00:18:49.625Z] Skipping unsupported test for TLS_ECDH_ECDSA_WITH_AES_128_CBC_SHA of SSLv2Hello
[2025-01-08T00:18:49.625Z] Skipping unsupported test for TLS_ECDH_RSA_WITH_AES_128_CBC_SHA of SSLv2Hello
[2025-01-08T00:18:49.625Z] Skipping unsupported test for TLS_RSA_WITH_AES_256_GCM_SHA384 of SSLv2Hello
[2025-01-08T00:18:49.625Z] Skipping unsupported test for TLS_RSA_WITH_AES_128_GCM_SHA256 of SSLv2Hello
[2025-01-08T00:18:49.625Z] Skipping unsupported test for TLS_RSA_WITH_AES_256_CBC_SHA256 of SSLv2Hello
[2025-01-08T00:18:49.625Z] Skipping unsupported test for TLS_RSA_WITH_AES_128_CBC_SHA256 of SSLv2Hello
[2025-01-08T00:18:49.625Z] Skipping unsupported test for TLS_RSA_WITH_AES_256_CBC_SHA of SSLv2Hello
[2025-01-08T00:18:49.625Z] Skipping unsupported test for TLS_RSA_WITH_AES_128_CBC_SHA of SSLv2Hello
[2025-01-08T00:18:49.625Z] Skipping unsupported test for TLS_ECDHE_ECDSA_WITH_3DES_EDE_CBC_SHA of SSLv2Hello
[2025-01-08T00:18:49.625Z] Skipping unsupported test for TLS_ECDHE_RSA_WITH_3DES_EDE_CBC_SHA of SSLv2Hello
[2025-01-08T00:18:49.625Z] Skipping unsupported test for SSL_DHE_RSA_WITH_3DES_EDE_CBC_SHA of SSLv2Hello
[2025-01-08T00:18:49.625Z] Skipping unsupported test for SSL_DHE_DSS_WITH_3DES_EDE_CBC_SHA of SSLv2Hello
[2025-01-08T00:18:49.625Z] Skipping unsupported test for TLS_ECDH_ECDSA_WITH_3DES_EDE_CBC_SHA of SSLv2Hello
[2025-01-08T00:18:49.625Z] Skipping unsupported test for TLS_ECDH_RSA_WITH_3DES_EDE_CBC_SHA of SSLv2Hello
[2025-01-08T00:18:49.625Z] Skipping unsupported test for SSL_RSA_WITH_3DES_EDE_CBC_SHA of SSLv2Hello
[2025-01-08T00:18:49.625Z] Skipping unsupported test for TLS_EMPTY_RENEGOTIATION_INFO_SCSV of SSLv2Hello
[2025-01-08T00:18:49.625Z] Skipping unsupported test for TLS_DH_anon_WITH_AES_256_GCM_SHA384 of SSLv2Hello
[2025-01-08T00:18:49.625Z] Skipping unsupported test for TLS_DH_anon_WITH_AES_128_GCM_SHA256 of SSLv2Hello
[2025-01-08T00:18:49.625Z] Skipping unsupported test for TLS_DH_anon_WITH_AES_256_CBC_SHA256 of SSLv2Hello
[2025-01-08T00:18:49.625Z] Skipping unsupported test for TLS_ECDH_anon_WITH_AES_256_CBC_SHA of SSLv2Hello
[2025-01-08T00:18:49.625Z] Skipping unsupported test for TLS_DH_anon_WITH_AES_256_CBC_SHA of SSLv2Hello
[2025-01-08T00:18:49.625Z] Skipping unsupported test for TLS_DH_anon_WITH_AES_128_CBC_SHA256 of SSLv2Hello
[2025-01-08T00:18:49.625Z] Skipping unsupported test for TLS_ECDH_anon_WITH_AES_128_CBC_SHA of SSLv2Hello
[2025-01-08T00:18:49.625Z] Skipping unsupported test for TLS_DH_anon_WITH_AES_128_CBC_SHA of SSLv2Hello
[2025-01-08T00:18:49.625Z] Skipping unsupported test for TLS_ECDH_anon_WITH_3DES_EDE_CBC_SHA of SSLv2Hello
[2025-01-08T00:18:49.625Z] Skipping unsupported test for SSL_DH_anon_WITH_3DES_EDE_CBC_SHA of SSLv2Hello
[2025-01-08T00:18:49.625Z] Skipping unsupported test for TLS_ECDHE_ECDSA_WITH_RC4_128_SHA of SSLv2Hello
[2025-01-08T00:18:49.625Z] Skipping unsupported test for TLS_ECDHE_RSA_WITH_RC4_128_SHA of SSLv2Hello
[2025-01-08T00:18:49.625Z] Skipping unsupported test for SSL_RSA_WITH_RC4_128_SHA of SSLv2Hello
[2025-01-08T00:18:49.625Z] Skipping unsupported test for TLS_ECDH_ECDSA_WITH_RC4_128_SHA of SSLv2Hello
[2025-01-08T00:18:49.625Z] Skipping unsupported test for TLS_ECDH_RSA_WITH_RC4_128_SHA of SSLv2Hello
[2025-01-08T00:18:49.625Z] Skipping unsupported test for SSL_RSA_WITH_RC4_128_MD5 of SSLv2Hello
[2025-01-08T00:18:49.625Z] Skipping unsupported test for TLS_ECDH_anon_WITH_RC4_128_SHA of SSLv2Hello
[2025-01-08T00:18:49.625Z] Skipping unsupported test for SSL_DH_anon_WITH_RC4_128_MD5 of SSLv2Hello
[2025-01-08T00:18:49.625Z] Skipping unsupported test for SSL_RSA_WITH_DES_CBC_SHA of SSLv2Hello
[2025-01-08T00:18:49.625Z] Skipping unsupported test for SSL_DHE_RSA_WITH_DES_CBC_SHA of SSLv2Hello
[2025-01-08T00:18:49.625Z] Skipping unsupported test for SSL_DHE_DSS_WITH_DES_CBC_SHA of SSLv2Hello
[2025-01-08T00:18:49.625Z] Skipping unsupported test for SSL_DH_anon_WITH_DES_CBC_SHA of SSLv2Hello
[2025-01-08T00:18:49.625Z] Skipping obsoleted test for SSL_RSA_EXPORT_WITH_DES40_CBC_SHA of TLSv1.1
[2025-01-08T00:18:49.625Z] Skipping unsupported test for SSL_RSA_EXPORT_WITH_DES40_CBC_SHA of SSLv2Hello
[2025-01-08T00:18:49.625Z] Skipping obsoleted test for SSL_DHE_RSA_EXPORT_WITH_DES40_CBC_SHA of TLSv1.1
[2025-01-08T00:18:49.625Z] Skipping unsupported test for SSL_DHE_RSA_EXPORT_WITH_DES40_CBC_SHA of SSLv2Hello
[2025-01-08T00:18:49.625Z] Skipping obsoleted test for SSL_DHE_DSS_EXPORT_WITH_DES40_CBC_SHA of TLSv1.1
[2025-01-08T00:18:49.625Z] Skipping unsupported test for SSL_DHE_DSS_EXPORT_WITH_DES40_CBC_SHA of SSLv2Hello
[2025-01-08T00:18:49.625Z] Skipping obsoleted test for SSL_DH_anon_EXPORT_WITH_DES40_CBC_SHA of TLSv1.1
[2025-01-08T00:18:49.625Z] Skipping unsupported test for SSL_DH_anon_EXPORT_WITH_DES40_CBC_SHA of SSLv2Hello
[2025-01-08T00:18:49.625Z] Skipping obsoleted test for SSL_RSA_EXPORT_WITH_RC4_40_MD5 of TLSv1.1
[2025-01-08T00:18:49.625Z] Skipping unsupported test for SSL_RSA_EXPORT_WITH_RC4_40_MD5 of SSLv2Hello
[2025-01-08T00:18:49.625Z] Skipping obsoleted test for SSL_DH_anon_EXPORT_WITH_RC4_40_MD5 of TLSv1.1
[2025-01-08T00:18:49.625Z] Skipping unsupported test for SSL_DH_anon_EXPORT_WITH_RC4_40_MD5 of SSLv2Hello
[2025-01-08T00:18:49.625Z] Skipping unsupported test for TLS_RSA_WITH_NULL_SHA256 of SSLv2Hello
[2025-01-08T00:18:49.625Z] Skipping unsupported test for TLS_ECDHE_ECDSA_WITH_NULL_SHA of SSLv2Hello
[2025-01-08T00:18:49.625Z] Skipping unsupported test for TLS_ECDHE_RSA_WITH_NULL_SHA of SSLv2Hello
[2025-01-08T00:18:49.625Z] Skipping unsupported test for SSL_RSA_WITH_NULL_SHA of SSLv2Hello
[2025-01-08T00:18:49.625Z] Skipping unsupported test for TLS_ECDH_ECDSA_WITH_NULL_SHA of SSLv2Hello
[2025-01-08T00:18:49.625Z] Skipping unsupported test for TLS_ECDH_RSA_WITH_NULL_SHA of SSLv2Hello
[2025-01-08T00:18:49.625Z] Skipping unsupported test for TLS_ECDH_anon_WITH_NULL_SHA of SSLv2Hello
[2025-01-08T00:18:49.625Z] Skipping unsupported test for SSL_RSA_WITH_NULL_MD5 of SSLv2Hello
[2025-01-08T00:18:49.625Z] Skipping unsupported test for TLS_KRB5_WITH_3DES_EDE_CBC_SHA of TLSv1.3
[2025-01-08T00:18:49.625Z] Skipping unsupported test for TLS_KRB5_WITH_3DES_EDE_CBC_SHA of TLSv1.2
[2025-01-08T00:18:49.625Z] Skipping unsupported test for TLS_KRB5_WITH_3DES_EDE_CBC_SHA of TLSv1.1
[2025-01-08T00:18:49.625Z] Skipping unsupported test for TLS_KRB5_WITH_3DES_EDE_CBC_SHA of TLSv1
[2025-01-08T00:18:49.625Z] Skipping unsupported test for TLS_KRB5_WITH_3DES_EDE_CBC_SHA of SSLv3
[2025-01-08T00:18:49.625Z] Skipping unsupported test for TLS_KRB5_WITH_3DES_EDE_CBC_SHA of SSLv2Hello
[2025-01-08T00:18:49.625Z] Skipping unsupported test for TLS_KRB5_WITH_3DES_EDE_CBC_MD5 of TLSv1.3
[2025-01-08T00:18:49.625Z] Skipping unsupported test for TLS_KRB5_WITH_3DES_EDE_CBC_MD5 of TLSv1.2
[2025-01-08T00:18:49.625Z] Skipping unsupported test for TLS_KRB5_WITH_3DES_EDE_CBC_MD5 of TLSv1.1
[2025-01-08T00:18:49.625Z] Skipping unsupported test for TLS_KRB5_WITH_3DES_EDE_CBC_MD5 of TLSv1
[2025-01-08T00:18:49.625Z] Skipping unsupported test for TLS_KRB5_WITH_3DES_EDE_CBC_MD5 of SSLv3
[2025-01-08T00:18:49.625Z] Skipping unsupported test for TLS_KRB5_WITH_3DES_EDE_CBC_MD5 of SSLv2Hello
[2025-01-08T00:18:49.625Z] Skipping unsupported test for TLS_KRB5_WITH_RC4_128_SHA of TLSv1.3
[2025-01-08T00:18:49.625Z] Skipping unsupported test for TLS_KRB5_WITH_RC4_128_SHA of TLSv1.2
[2025-01-08T00:18:49.625Z] Skipping unsupported test for TLS_KRB5_WITH_RC4_128_SHA of TLSv1.1
[2025-01-08T00:18:49.625Z] Skipping unsupported test for TLS_KRB5_WITH_RC4_128_SHA of TLSv1
[2025-01-08T00:18:49.625Z] Skipping unsupported test for TLS_KRB5_WITH_RC4_128_SHA of SSLv3
[2025-01-08T00:18:49.625Z] Skipping unsupported test for TLS_KRB5_WITH_RC4_128_SHA of SSLv2Hello
[2025-01-08T00:18:49.625Z] Skipping unsupported test for TLS_KRB5_WITH_RC4_128_MD5 of TLSv1.3
[2025-01-08T00:18:49.625Z] Skipping unsupported test for TLS_KRB5_WITH_RC4_128_MD5 of TLSv1.2
[2025-01-08T00:18:49.625Z] Skipping unsupported test for TLS_KRB5_WITH_RC4_128_MD5 of TLSv1.1
[2025-01-08T00:18:49.625Z] Skipping unsupported test for TLS_KRB5_WITH_RC4_128_MD5 of TLSv1
[2025-01-08T00:18:49.625Z] Skipping unsupported test for TLS_KRB5_WITH_RC4_128_MD5 of SSLv3
[2025-01-08T00:18:49.625Z] Skipping unsupported test for TLS_KRB5_WITH_RC4_128_MD5 of SSLv2Hello
[2025-01-08T00:18:49.625Z] Skipping unsupported test for TLS_KRB5_WITH_DES_CBC_SHA of TLSv1.3
[2025-01-08T00:18:49.625Z] Skipping unsupported test for TLS_KRB5_WITH_DES_CBC_SHA of TLSv1.2
[2025-01-08T00:18:49.625Z] Skipping unsupported test for TLS_KRB5_WITH_DES_CBC_SHA of TLSv1.1
[2025-01-08T00:18:49.625Z] Skipping unsupported test for TLS_KRB5_WITH_DES_CBC_SHA of TLSv1
[2025-01-08T00:18:49.625Z] Skipping unsupported test for TLS_KRB5_WITH_DES_CBC_SHA of SSLv3
[2025-01-08T00:18:49.625Z] Skipping unsupported test for TLS_KRB5_WITH_DES_CBC_SHA of SSLv2Hello
[2025-01-08T00:18:49.625Z] Skipping unsupported test for TLS_KRB5_WITH_DES_CBC_MD5 of TLSv1.3
[2025-01-08T00:18:49.625Z] Skipping unsupported test for TLS_KRB5_WITH_DES_CBC_MD5 of TLSv1.2
[2025-01-08T00:18:49.625Z] Skipping unsupported test for TLS_KRB5_WITH_DES_CBC_MD5 of TLSv1.1
[2025-01-08T00:18:49.625Z] Skipping unsupported test for TLS_KRB5_WITH_DES_CBC_MD5 of TLSv1
[2025-01-08T00:18:49.625Z] Skipping unsupported test for TLS_KRB5_WITH_DES_CBC_MD5 of SSLv3
[2025-01-08T00:18:49.625Z] Skipping unsupported test for TLS_KRB5_WITH_DES_CBC_MD5 of SSLv2Hello
[2025-01-08T00:18:49.625Z] Skipping unsupported test for TLS_KRB5_EXPORT_WITH_DES_CBC_40_SHA of TLSv1.3
[2025-01-08T00:18:49.625Z] Skipping unsupported test for TLS_KRB5_EXPORT_WITH_DES_CBC_40_SHA of TLSv1.2
[2025-01-08T00:18:49.625Z] Skipping unsupported test for TLS_KRB5_EXPORT_WITH_DES_CBC_40_SHA of TLSv1.1
[2025-01-08T00:18:49.625Z] Skipping unsupported test for TLS_KRB5_EXPORT_WITH_DES_CBC_40_SHA of TLSv1
[2025-01-08T00:18:49.625Z] Skipping unsupported test for TLS_KRB5_EXPORT_WITH_DES_CBC_40_SHA of SSLv3
[2025-01-08T00:18:49.625Z] Skipping unsupported test for TLS_KRB5_EXPORT_WITH_DES_CBC_40_SHA of SSLv2Hello
[2025-01-08T00:18:49.625Z] Skipping unsupported test for TLS_KRB5_EXPORT_WITH_DES_CBC_40_MD5 of TLSv1.3
[2025-01-08T00:18:49.625Z] Skipping unsupported test for TLS_KRB5_EXPORT_WITH_DES_CBC_40_MD5 of TLSv1.2
[2025-01-08T00:18:49.625Z] Skipping unsupported test for TLS_KRB5_EXPORT_WITH_DES_CBC_40_MD5 of TLSv1.1
[2025-01-08T00:18:49.625Z] Skipping unsupported test for TLS_KRB5_EXPORT_WITH_DES_CBC_40_MD5 of TLSv1
[2025-01-08T00:18:49.625Z] Skipping unsupported test for TLS_KRB5_EXPORT_WITH_DES_CBC_40_MD5 of SSLv3
[2025-01-08T00:18:49.625Z] Skipping unsupported test for TLS_KRB5_EXPORT_WITH_DES_CBC_40_MD5 of SSLv2Hello
[2025-01-08T00:18:49.625Z] Skipping unsupported test for TLS_KRB5_EXPORT_WITH_RC4_40_SHA of TLSv1.3
[2025-01-08T00:18:49.625Z] Skipping unsupported test for TLS_KRB5_EXPORT_WITH_RC4_40_SHA of TLSv1.2
[2025-01-08T00:18:49.625Z] Skipping unsupported test for TLS_KRB5_EXPORT_WITH_RC4_40_SHA of TLSv1.1
[2025-01-08T00:18:49.625Z] Skipping unsupported test for TLS_KRB5_EXPORT_WITH_RC4_40_SHA of TLSv1
[2025-01-08T00:18:49.626Z] Skipping unsupported test for TLS_KRB5_EXPORT_WITH_RC4_40_SHA of SSLv3
[2025-01-08T00:18:49.626Z] Skipping unsupported test for TLS_KRB5_EXPORT_WITH_RC4_40_SHA of SSLv2Hello
[2025-01-08T00:18:49.626Z] Skipping unsupported test for TLS_KRB5_EXPORT_WITH_RC4_40_MD5 of TLSv1.3
[2025-01-08T00:18:49.626Z] Skipping unsupported test for TLS_KRB5_EXPORT_WITH_RC4_40_MD5 of TLSv1.2
[2025-01-08T00:18:49.626Z] Skipping unsupported test for TLS_KRB5_EXPORT_WITH_RC4_40_MD5 of TLSv1.1
[2025-01-08T00:18:49.626Z] Skipping unsupported test for TLS_KRB5_EXPORT_WITH_RC4_40_MD5 of TLSv1
[2025-01-08T00:18:49.626Z] Skipping unsupported test for TLS_KRB5_EXPORT_WITH_RC4_40_MD5 of SSLv3
[2025-01-08T00:18:49.626Z] Skipping unsupported test for TLS_KRB5_EXPORT_WITH_RC4_40_MD5 of SSLv2Hello
[2025-01-08T00:18:49.626Z] Done
[2025-01-08T00:18:49.626Z] JSSE Server listening on port 34521
[2025-01-08T00:18:49.626Z] Skipping disabled test TLS_AES_256_GCM_SHA384 in TLSv1.2 mode
[2025-01-08T00:18:49.626Z] Skipping disabled test TLS_AES_256_GCM_SHA384 in TLSv1.2 mode with RSA client authentication
[2025-01-08T00:18:49.626Z] Skipping disabled test TLS_AES_256_GCM_SHA384 in TLSv1.2 mode with DSA client authentication
[2025-01-08T00:18:49.626Z] Skipping disabled test TLS_AES_256_GCM_SHA384 in TLSv1.2 mode with ECDSA client authentication
[2025-01-08T00:18:49.626Z] Skipping disabled test TLS_AES_256_GCM_SHA384 in TLSv1.1 mode
[2025-01-08T00:18:49.626Z] Skipping disabled test TLS_AES_256_GCM_SHA384 in TLSv1.1 mode with RSA client authentication
[2025-01-08T00:18:49.626Z] Skipping disabled test TLS_AES_256_GCM_SHA384 in TLSv1.1 mode with DSA client authentication
[2025-01-08T00:18:49.626Z] Skipping disabled test TLS_AES_256_GCM_SHA384 in TLSv1.1 mode with ECDSA client authentication
[2025-01-08T00:18:49.626Z] Skipping disabled test TLS_AES_256_GCM_SHA384 in TLSv1 mode
[2025-01-08T00:18:49.626Z] Skipping disabled test TLS_AES_256_GCM_SHA384 in TLSv1 mode with RSA client authentication
[2025-01-08T00:18:49.626Z] Skipping disabled test TLS_AES_256_GCM_SHA384 in TLSv1 mode with DSA client authentication
[2025-01-08T00:18:49.626Z] Skipping disabled test TLS_AES_256_GCM_SHA384 in TLSv1 mode with ECDSA client authentication
[2025-01-08T00:18:49.626Z] Skipping disabled test TLS_AES_256_GCM_SHA384 in SSLv3 mode
[2025-01-08T00:18:49.626Z] Skipping disabled test TLS_AES_256_GCM_SHA384 in SSLv3 mode with RSA client authentication
[2025-01-08T00:18:49.626Z] Skipping disabled test TLS_AES_256_GCM_SHA384 in SSLv3 mode with DSA client authentication
[2025-01-08T00:18:49.626Z] Skipping disabled test TLS_AES_256_GCM_SHA384 in SSLv3 mode with ECDSA client authentication
[2025-01-08T00:18:49.626Z] Skipping disabled test TLS_AES_128_GCM_SHA256 in TLSv1.2 mode
[2025-01-08T00:18:49.626Z] Skipping disabled test TLS_AES_128_GCM_SHA256 in TLSv1.2 mode with RSA client authentication
[2025-01-08T00:18:49.626Z] Skipping disabled test TLS_AES_128_GCM_SHA256 in TLSv1.2 mode with DSA client authentication
[2025-01-08T00:18:49.626Z] Skipping disabled test TLS_AES_128_GCM_SHA256 in TLSv1.2 mode with ECDSA client authentication
[2025-01-08T00:18:49.626Z] Skipping disabled test TLS_AES_128_GCM_SHA256 in TLSv1.1 mode
[2025-01-08T00:18:49.626Z] Skipping disabled test TLS_AES_128_GCM_SHA256 in TLSv1.1 mode with RSA client authentication
[2025-01-08T00:18:49.626Z] Skipping disabled test TLS_AES_128_GCM_SHA256 in TLSv1.1 mode with DSA client authentication
[2025-01-08T00:18:49.626Z] Skipping disabled test TLS_AES_128_GCM_SHA256 in TLSv1.1 mode with ECDSA client authentication
[2025-01-08T00:18:49.626Z] Skipping disabled test TLS_AES_128_GCM_SHA256 in TLSv1 mode
[2025-01-08T00:18:49.626Z] Skipping disabled test TLS_AES_128_GCM_SHA256 in TLSv1 mode with RSA client authentication
[2025-01-08T00:18:49.626Z] Skipping disabled test TLS_AES_128_GCM_SHA256 in TLSv1 mode with DSA client authentication
[2025-01-08T00:18:49.626Z] Skipping disabled test TLS_AES_128_GCM_SHA256 in SSLv3 mode with DSA client authentication
[2025-01-08T00:18:49.626Z] Skipping disabled test TLS_AES_128_GCM_SHA256 in SSLv3 mode with ECDSA client authentication
[2025-01-08T00:18:49.626Z] Skipping disabled test TLS_AES_128_GCM_SHA256 in SSLv3 mode with RSA client authentication
[2025-01-08T00:18:49.626Z] Skipping disabled test TLS_AES_128_GCM_SHA256 in SSLv3 mode
[2025-01-08T00:18:49.626Z] Skipping disabled test TLS_AES_128_GCM_SHA256 in TLSv1 mode with ECDSA client authentication
[2025-01-08T00:18:49.626Z] #
[2025-01-08T00:18:49.626Z] # A fatal error has been detected by the Java Runtime Environment:
[2025-01-08T00:18:49.626Z] #
[2025-01-08T00:18:49.626Z] # SIGSEGV (0xb) at pc=0x00007794d0c0d2bb, pid=3793624, tid=0x00007794d06356c0
[2025-01-08T00:18:49.626Z] #
[2025-01-08T00:18:49.626Z] # JRE version: OpenJDK Runtime Environment (8.0_442-b05) (build 1.8.0_442-beta-202501072107-b05)
[2025-01-08T00:18:49.626Z] # Java VM: OpenJDK 64-Bit Server VM (25.442-b05 mixed mode linux-amd64 compressed oops)
[2025-01-08T00:18:49.626Z] # Problematic frame:
[2025-01-08T00:18:49.626Z] # C [libsoftokn3.so+0x232bb]
[2025-01-08T00:18:49.626Z] #
[2025-01-08T00:18:49.626Z] # Core dump written. Default location: /home/jenkins/workspace/Test_openjdk8_hs_extended.openjdk_x86-64_linux_testList_1/aqa-tests/TKG/output_17362909043282/jdk_security3_0/work/scratch/2/core or core.3793624
[2025-01-08T00:18:49.626Z] #
[2025-01-08T00:18:49.626Z] # An error report file with more information is saved as:
[2025-01-08T00:18:49.626Z] # /home/jenkins/workspace/Test_openjdk8_hs_extended.openjdk_x86-64_linux_testList_1/aqa-tests/TKG/output_17362909043282/jdk_security3_0/work/scratch/2/hs_err_pid3793624.log
[2025-01-08T00:18:49.626Z] [thread 131480959317696 also had an error]
[2025-01-08T00:18:49.626Z] [thread 131480961414848 also had an error]
[2025-01-08T00:18:49.626Z] [thread 131480960366272 also had an error]
[2025-01-08T00:18:49.626Z] [thread 131481029572288 also had an error]
[2025-01-08T00:18:49.626Z] [thread 131481030620864 also had an error]
[2025-01-08T00:18:49.626Z] [thread 131480955123392 also had an error]
[2025-01-08T00:18:49.626Z] [thread 131481033987776 also had an error]
[2025-01-08T00:18:49.626Z] #
[2025-01-08T00:18:49.626Z] # If you would like to submit a bug report, please visit:
[2025-01-08T00:18:49.626Z] # https://github.com/adoptium/adoptium-support/issues
[2025-01-08T00:18:49.626Z] # The crash happened outside the Java Virtual Machine in native code.
[2025-01-08T00:18:49.626Z] # See problematic frame for where to report the bug.
[2025-01-08T00:18:49.626Z] #
[2025-01-08T00:18:49.626Z] STDERR:
[2025-01-08T00:18:49.626Z] rerun:
[2025-01-08T00:18:49.626Z] cd /home/jenkins/workspace/Test_openjdk8_hs_extended.openjdk_x86-64_linux_testList_1/aqa-tests/TKG/output_17362909043282/jdk_security3_0/work/scratch/2 && \
[2025-01-08T00:18:49.626Z] DISPLAY=:0 \
[2025-01-08T00:18:49.626Z] HOME=/home/jenkins \
[2025-01-08T00:18:49.626Z] LANG=C.UTF-8 \
[2025-01-08T00:18:49.626Z] PATH=/bin:/usr/bin:/usr/sbin \
[2025-01-08T00:18:49.626Z] CLASSPATH=/home/jenkins/workspace/Test_openjdk8_hs_extended.openjdk_x86-64_linux_testList_1/aqa-tests/TKG/output_17362909043282/jdk_security3_0/work/classes/2/sun/security/pkcs11/sslecc:/home/jenkins/workspace/Test_openjdk8_hs_extended.openjdk_x86-64_linux_testList_1/aqa-tests/openjdk/openjdk-jdk/jdk/test/sun/security/pkcs11/sslecc:/home/jenkins/workspace/Test_openjdk8_hs_extended.openjdk_x86-64_linux_testList_1/aqa-tests/TKG/output_17362909043282/jdk_security3_0/work/classes/2/java/security/testlibrary:/home/jenkins/workspace/Test_openjdk8_hs_extended.openjdk_x86-64_linux_testList_1/aqa-tests/openjdk/openjdk-jdk/jdk/test/java/security/testlibrary:/home/jenkins/workspace/Test_openjdk8_hs_extended.openjdk_x86-64_linux_testList_1/aqa-tests/TKG/output_17362909043282/jdk_security3_0/work/classes/2/test/lib:/home/jenkins/workspace/Test_openjdk8_hs_extended.openjdk_x86-64_linux_testList_1/aqa-tests/openjdk/openjdk-jdk/test/lib:/home/jenkins/workspace/Test_openjdk8_hs_extended.openjdk_x86-64_linux_testList_1/aqa-tests/TKG/output_17362909043282/jdk_security3_0/work/classes/2/sun/security/pkcs11:/home/jenkins/workspace/Test_openjdk8_hs_extended.openjdk_x86-64_linux_testList_1/aqa-tests/openjdk/openjdk-jdk/jdk/test/sun/security/pkcs11:/home/jenkins/workspace/Test_openjdk8_hs_extended.openjdk_x86-64_linux_testList_1/aqa-tests/TKG/output_17362909043282/jdk_security3_0/work/classes/2/javax/net/ssl/TLSCommon:/home/jenkins/workspace/Test_openjdk8_hs_extended.openjdk_x86-64_linux_testList_1/aqa-tests/openjdk/openjdk-jdk/jdk/test/javax/net/ssl/TLSCommon:/home/jenkins/workspace/Test_openjdk8_hs_extended.openjdk_x86-64_linux_testList_1/jdkbinary/j2sdk-image/lib/tools.jar:/home/jenkins/workspace/Test_openjdk8_hs_extended.openjdk_x86-64_linux_testList_1/jvmtest/openjdk/jtreg/lib/javatest.jar:/home/jenkins/workspace/Test_openjdk8_hs_extended.openjdk_x86-64_linux_testList_1/jvmtest/openjdk/jtreg/lib/jtreg.jar \
[2025-01-08T00:18:49.626Z] /home/jenkins/workspace/Test_openjdk8_hs_extended.openjdk_x86-64_linux_testList_1/jdkbinary/j2sdk-image/bin/java \
[2025-01-08T00:18:49.626Z] -Dtest.vm.opts='-ea -esa -Xmx512m -XX:+UseCompressedOops' \
[2025-01-08T00:18:49.626Z] -Dtest.tool.vm.opts='-J-ea -J-esa -J-Xmx512m -J-XX:+UseCompressedOops' \
[2025-01-08T00:18:49.626Z] -Dtest.compiler.opts= \
[2025-01-08T00:18:49.626Z] -Dtest.java.opts= \
[2025-01-08T00:18:49.626Z] -Dtest.jdk=/home/jenkins/workspace/Test_openjdk8_hs_extended.openjdk_x86-64_linux_testList_1/jdkbinary/j2sdk-image \
[2025-01-08T00:18:49.626Z] -Dcompile.jdk=/home/jenkins/workspace/Test_openjdk8_hs_extended.openjdk_x86-64_linux_testList_1/jdkbinary/j2sdk-image \
[2025-01-08T00:18:49.626Z] -Dtest.timeout.factor=8.0 \
[2025-01-08T00:18:49.626Z] -Dtest.root=/home/jenkins/workspace/Test_openjdk8_hs_extended.openjdk_x86-64_linux_testList_1/aqa-tests/openjdk/openjdk-jdk/jdk/test \
[2025-01-08T00:18:49.626Z] -Dtest.name=sun/security/pkcs11/sslecc/ClientJSSEServerJSSE.java \
[2025-01-08T00:18:49.626Z] -Dtest.file=/home/jenkins/workspace/Test_openjdk8_hs_extended.openjdk_x86-64_linux_testList_1/aqa-tests/openjdk/openjdk-jdk/jdk/test/sun/security/pkcs11/sslecc/ClientJSSEServerJSSE.java \
[2025-01-08T00:18:49.626Z] -Dtest.src=/home/jenkins/workspace/Test_openjdk8_hs_extended.openjdk_x86-64_linux_testList_1/aqa-tests/openjdk/openjdk-jdk/jdk/test/sun/security/pkcs11/sslecc \
[2025-01-08T00:18:49.626Z] -Dtest.src.path=/home/jenkins/workspace/Test_openjdk8_hs_extended.openjdk_x86-64_linux_testList_1/aqa-tests/openjdk/openjdk-jdk/jdk/test/sun/security/pkcs11/sslecc:/home/jenkins/workspace/Test_openjdk8_hs_extended.openjdk_x86-64_linux_testList_1/aqa-tests/openjdk/openjdk-jdk/jdk/test/java/security/testlibrary:/home/jenkins/workspace/Test_openjdk8_hs_extended.openjdk_x86-64_linux_testList_1/aqa-tests/openjdk/openjdk-jdk/test/lib:/home/jenkins/workspace/Test_openjdk8_hs_extended.openjdk_x86-64_linux_testList_1/aqa-tests/openjdk/openjdk-jdk/jdk/test/sun/security/pkcs11:/home/jenkins/workspace/Test_openjdk8_hs_extended.openjdk_x86-64_linux_testList_1/aqa-tests/openjdk/openjdk-jdk/jdk/test/javax/net/ssl/TLSCommon \
[2025-01-08T00:18:49.626Z] -Dtest.classes=/home/jenkins/workspace/Test_openjdk8_hs_extended.openjdk_x86-64_linux_testList_1/aqa-tests/TKG/output_17362909043282/jdk_security3_0/work/classes/2/sun/security/pkcs11/sslecc \
[2025-01-08T00:18:49.626Z] -Dtest.class.path=/home/jenkins/workspace/Test_openjdk8_hs_extended.openjdk_x86-64_linux_testList_1/aqa-tests/TKG/output_17362909043282/jdk_security3_0/work/classes/2/sun/security/pkcs11/sslecc:/home/jenkins/workspace/Test_openjdk8_hs_extended.openjdk_x86-64_linux_testList_1/aqa-tests/TKG/output_17362909043282/jdk_security3_0/work/classes/2/java/security/testlibrary:/home/jenkins/workspace/Test_openjdk8_hs_extended.openjdk_x86-64_linux_testList_1/aqa-tests/TKG/output_17362909043282/jdk_security3_0/work/classes/2/test/lib:/home/jenkins/workspace/Test_openjdk8_hs_extended.openjdk_x86-64_linux_testList_1/aqa-tests/TKG/output_17362909043282/jdk_security3_0/work/classes/2/sun/security/pkcs11:/home/jenkins/workspace/Test_openjdk8_hs_extended.openjdk_x86-64_linux_testList_1/aqa-tests/TKG/output_17362909043282/jdk_security3_0/work/classes/2/javax/net/ssl/TLSCommon \
[2025-01-08T00:18:49.626Z] -Dtest.class.path.prefix=/home/jenkins/workspace/Test_openjdk8_hs_extended.openjdk_x86-64_linux_testList_1/aqa-tests/TKG/output_17362909043282/jdk_security3_0/work/classes/2/sun/security/pkcs11/sslecc:/home/jenkins/workspace/Test_openjdk8_hs_extended.openjdk_x86-64_linux_testList_1/aqa-tests/openjdk/openjdk-jdk/jdk/test/sun/security/pkcs11/sslecc:/home/jenkins/workspace/Test_openjdk8_hs_extended.openjdk_x86-64_linux_testList_1/aqa-tests/TKG/output_17362909043282/jdk_security3_0/work/classes/2/java/security/testlibrary:/home/jenkins/workspace/Test_openjdk8_hs_extended.openjdk_x86-64_linux_testList_1/aqa-tests/TKG/output_17362909043282/jdk_security3_0/work/classes/2/test/lib:/home/jenkins/workspace/Test_openjdk8_hs_extended.openjdk_x86-64_linux_testList_1/aqa-tests/TKG/output_17362909043282/jdk_security3_0/work/classes/2/sun/security/pkcs11:/home/jenkins/workspace/Test_openjdk8_hs_extended.openjdk_x86-64_linux_testList_1/aqa-tests/TKG/output_17362909043282/jdk_security3_0/work/classes/2/javax/net/ssl/TLSCommon \
[2025-01-08T00:18:49.626Z] -ea \
[2025-01-08T00:18:49.626Z] -esa \
[2025-01-08T00:18:49.626Z] -Xmx512m \
[2025-01-08T00:18:49.626Z] -XX:+UseCompressedOops \
[2025-01-08T00:18:49.626Z] -Djdk.tls.namedGroups="secp256r1,sect193r1" \
[2025-01-08T00:18:49.626Z] com.sun.javatest.regtest.agent.MainWrapper /home/jenkins/workspace/Test_openjdk8_hs_extended.openjdk_x86-64_linux_testList_1/aqa-tests/TKG/output_17362909043282/jdk_security3_0/work/sun/security/pkcs11/sslecc/ClientJSSEServerJSSE.d/main.0.jta
[2025-01-08T00:18:49.626Z]
[2025-01-08T00:18:49.626Z] TEST RESULT: Failed. Unexpected exit from test [exit code: 134]
[2025-01-08T00:18:49.626Z] --------------------------------------------------
[2025-01-08T00:45:10.683Z] TEST: sun/security/tools/keytool/autotest.sh
[2025-01-08T00:45:10.683Z] TEST JDK: /home/jenkins/workspace/Test_openjdk8_hs_extended.openjdk_x86-64_linux_testList_1/jdkbinary/j2sdk-image
[2025-01-08T00:45:10.683Z]
[2025-01-08T00:45:10.683Z] ACTION: shell -- Failed. Execution failed: exit code 1
[2025-01-08T00:45:10.683Z] REASON: Assumed action based on file name: run shell autotest.sh
[2025-01-08T00:45:10.683Z] TIME: 13.865 seconds
[2025-01-08T00:45:10.683Z] messages:
[2025-01-08T00:45:10.683Z] command: shell autotest.sh
[2025-01-08T00:45:10.683Z] reason: Assumed action based on file name: run shell autotest.sh
[2025-01-08T00:45:10.683Z] elapsed time (seconds): 13.865
[2025-01-08T00:45:10.683Z] STDOUT:
[2025-01-08T00:45:10.683Z] STDERR:
[2025-01-08T00:45:10.683Z] Note: /home/jenkins/workspace/Test_openjdk8_hs_extended.openjdk_x86-64_linux_testList_1/aqa-tests/openjdk/openjdk-jdk/jdk/test/sun/security/tools/keytool/KeyToolTest.java uses unchecked or unsafe operations.
[2025-01-08T00:45:10.683Z] Note: Recompile with -Xlint:unchecked for details.
[2025-01-08T00:45:10.683Z] .....
[2025-01-08T00:45:10.683Z] Test fails for the command ---
[2025-01-08T00:45:10.683Z] keytool -J-Dnss.lib=/usr/lib64/libsoftokn3.so -keystore NONE -storetype PKCS11 -providerName SunPKCS11-nss -providerClass sun.security.pkcs11.SunPKCS11 -providerArg p11-nss.txt -storepass test12 -list
[2025-01-08T00:45:10.684Z] Or its debug version ---
[2025-01-08T00:45:10.684Z] keytool -debug -J-Dnss.lib=/usr/lib64/libsoftokn3.so -keystore NONE -storetype PKCS11 -providerName SunPKCS11-nss -providerClass sun.security.pkcs11.SunPKCS11 -providerArg p11-nss.txt -storepass test12 -list
[2025-01-08T00:45:10.684Z] The command result should be OK, but it's not. Try run the command manually and type these input into it:
[2025-01-08T00:45:10.684Z]
[2025-01-08T00:45:10.684Z] ERR is:
[2025-01-08T00:45:10.684Z]
[2025-01-08T00:45:10.684Z] OUT is:
[2025-01-08T00:45:10.684Z] keytool error: java.io.IOException: load failed
[2025-01-08T00:45:10.684Z]
[2025-01-08T00:45:10.684Z] Exception in thread "main" java.io.IOException: load failed
[2025-01-08T00:45:10.684Z] at sun.security.pkcs11.P11KeyStore.engineLoad(P11KeyStore.java:764)
[2025-01-08T00:45:10.684Z] at java.security.KeyStore.load(KeyStore.java:1445)
[2025-01-08T00:45:10.684Z] at sun.security.tools.keytool.Main.doCommands(Main.java:869)
[2025-01-08T00:45:10.684Z] at sun.security.tools.keytool.Main.run(Main.java:378)
[2025-01-08T00:45:10.684Z] at sun.security.tools.keytool.Main.main(Main.java:371)
[2025-01-08T00:45:10.684Z] at KeyToolTest.test(KeyToolTest.java:159)
[2025-01-08T00:45:10.684Z] at KeyToolTest.test(KeyToolTest.java:127)
[2025-01-08T00:45:10.684Z] at KeyToolTest.testOK(KeyToolTest.java:182)
[2025-01-08T00:45:10.684Z] at KeyToolTest.testPKCS11(KeyToolTest.java:525)
[2025-01-08T00:45:10.684Z] at KeyToolTest.main(KeyToolTest.java:1345)
[2025-01-08T00:45:10.684Z] Caused by: javax.security.auth.login.LoginException
[2025-01-08T00:45:10.684Z] at sun.security.pkcs11.SunPKCS11.login(SunPKCS11.java:1333)
[2025-01-08T00:45:10.684Z] at sun.security.pkcs11.P11KeyStore.login(P11KeyStore.java:864)
[2025-01-08T00:45:10.684Z] at sun.security.pkcs11.P11KeyStore.engineLoad(P11KeyStore.java:751)
[2025-01-08T00:45:10.684Z] ... 9 more
[2025-01-08T00:45:10.684Z] Caused by: sun.security.pkcs11.wrapper.PKCS11Exception: CKR_USER_TYPE_INVALID
[2025-01-08T00:45:10.684Z] at sun.security.pkcs11.wrapper.PKCS11.C_Login(Native Method)
[2025-01-08T00:45:10.684Z] at sun.security.pkcs11.SunPKCS11.login(SunPKCS11.java:1317)
[2025-01-08T00:45:10.684Z] ... 11 more
[2025-01-08T00:45:10.684Z] rerun:
[2025-01-08T00:45:10.684Z] cd /home/jenkins/workspace/Test_openjdk8_hs_extended.openjdk_x86-64_linux_testList_1/aqa-tests/TKG/output_17362909043282/jdk_security3_0/work/scratch/0 && \
[2025-01-08T00:45:10.684Z] DISPLAY=:0 \
[2025-01-08T00:45:10.684Z] HOME=/home/jenkins \
[2025-01-08T00:45:10.684Z] LANG=C.UTF-8 \
[2025-01-08T00:45:10.684Z] PATH=/bin:/usr/bin:/usr/sbin \
[2025-01-08T00:45:10.684Z] TESTFILE=/home/jenkins/workspace/Test_openjdk8_hs_extended.openjdk_x86-64_linux_testList_1/aqa-tests/openjdk/openjdk-jdk/jdk/test/sun/security/tools/keytool/autotest.sh \
[2025-01-08T00:45:10.684Z] TESTSRC=/home/jenkins/workspace/Test_openjdk8_hs_extended.openjdk_x86-64_linux_testList_1/aqa-tests/openjdk/openjdk-jdk/jdk/test/sun/security/tools/keytool \
[2025-01-08T00:45:10.684Z] TESTSRCPATH=/home/jenkins/workspace/Test_openjdk8_hs_extended.openjdk_x86-64_linux_testList_1/aqa-tests/openjdk/openjdk-jdk/jdk/test/sun/security/tools/keytool \
[2025-01-08T00:45:10.684Z] TESTCLASSES=/home/jenkins/workspace/Test_openjdk8_hs_extended.openjdk_x86-64_linux_testList_1/aqa-tests/TKG/output_17362909043282/jdk_security3_0/work/classes/1/sun/security/tools/keytool \
[2025-01-08T00:45:10.684Z] TESTCLASSPATH=/home/jenkins/workspace/Test_openjdk8_hs_extended.openjdk_x86-64_linux_testList_1/aqa-tests/TKG/output_17362909043282/jdk_security3_0/work/classes/1/sun/security/tools/keytool \
[2025-01-08T00:45:10.684Z] COMPILEJAVA=/home/jenkins/workspace/Test_openjdk8_hs_extended.openjdk_x86-64_linux_testList_1/jdkbinary/j2sdk-image \
[2025-01-08T00:45:10.684Z] TESTJAVA=/home/jenkins/workspace/Test_openjdk8_hs_extended.openjdk_x86-64_linux_testList_1/jdkbinary/j2sdk-image \
[2025-01-08T00:45:10.684Z] TESTVMOPTS='-ea -esa -Xmx512m -XX:+UseCompressedOops' \
[2025-01-08T00:45:10.684Z] TESTTOOLVMOPTS='-J-ea -J-esa -J-Xmx512m -J-XX:+UseCompressedOops' \
[2025-01-08T00:45:10.684Z] TESTJAVACOPTS= \
[2025-01-08T00:45:10.684Z] TESTJAVAOPTS= \
[2025-01-08T00:45:10.684Z] TESTTIMEOUTFACTOR=8.0 \
[2025-01-08T00:45:10.684Z] TESTROOT=/home/jenkins/workspace/Test_openjdk8_hs_extended.openjdk_x86-64_linux_testList_1/aqa-tests/openjdk/openjdk-jdk/jdk/test \
[2025-01-08T00:45:10.684Z] FS=/ \
[2025-01-08T00:45:10.684Z] PS=: \
[2025-01-08T00:45:10.684Z] NULL=/dev/null \
[2025-01-08T00:45:10.684Z] sh \
[2025-01-08T00:45:10.684Z] /home/jenkins/workspace/Test_openjdk8_hs_extended.openjdk_x86-64_linux_testList_1/aqa-tests/openjdk/openjdk-jdk/jdk/test/sun/security/tools/keytool/autotest.sh
[2025-01-08T00:45:10.684Z]
[2025-01-08T00:45:10.684Z] TEST RESULT: Failed. Execution failed: exit code 1
[2025-01-08T00:45:10.684Z] --------------------------------------------------
[2025-01-08T01:01:16.830Z] Test results: passed: 609; failed: 8
[2025-01-08T01:01:39.433Z] Report written to /home/jenkins/workspace/Test_openjdk8_hs_extended.openjdk_x86-64_linux_testList_1/aqa-tests/TKG/output_17362909043282/jdk_security3_0/report/html/report.html
[2025-01-08T01:01:39.433Z] Results written to /home/jenkins/workspace/Test_openjdk8_hs_extended.openjdk_x86-64_linux_testList_1/aqa-tests/TKG/output_17362909043282/jdk_security3_0/work
[2025-01-08T01:01:39.433Z] Error: Some tests failed or other problems occurred.
[2025-01-08T01:01:39.433Z] -----------------------------------
[2025-01-08T01:01:39.433Z] jdk_security3_0_FAILED
[2025-01-08T01:01:39.433Z] -----------------------------------
[2025-01-08T01:01:39.433Z]
[2025-01-08T01:01:39.433Z] TEST TEARDOWN:
[2025-01-08T01:01:39.433Z] Nothing to be done for teardown.
[2025-01-08T01:01:39.433Z] jdk_security3_0 Finish Time: Wed Jan 8 01:01:36 2025 Epoch Time (ms): 1736298096874