Post Test
[2025-02-13T21:45:54.544Z] make[4]: Leaving directory '/home/jenkins/workspace/Test_openjdk8_hs_extended.system_x86-64_linux/aqa-tests/system/mauveLoadTest'
[2025-02-13T21:45:54.544Z] make[3]: Leaving directory '/home/jenkins/workspace/Test_openjdk8_hs_extended.system_x86-64_linux/aqa-tests/system'
[2025-02-13T21:45:54.544Z] make[2]: Leaving directory '/home/jenkins/workspace/Test_openjdk8_hs_extended.system_x86-64_linux/aqa-tests'
[2025-02-13T21:45:54.544Z]
[2025-02-13T21:45:54.544Z]
[2025-02-13T21:45:54.544Z] All tests finished, run result summary:
[2025-02-13T21:45:54.544Z] cd "/home/jenkins/workspace/Test_openjdk8_hs_extended.system_x86-64_linux/aqa-tests/TKG/../TKG/scripts"; \
[2025-02-13T21:45:54.544Z] perl "resultsSum.pl" --failuremk="/home/jenkins/workspace/Test_openjdk8_hs_extended.system_x86-64_linux/aqa-tests/TKG/../TKG/failedtargets.mk" --resultFile="/home/jenkins/workspace/Test_openjdk8_hs_extended.system_x86-64_linux/aqa-tests/TKG/../TKG/output_17394830468193/TestTargetResult" --platFile="/home/jenkins/workspace/Test_openjdk8_hs_extended.system_x86-64_linux/aqa-tests/TKG/../TKG/resources/buildPlatformMap.properties" --diagnostic=failure --jdkVersion=8 --jdkImpl=hotspot --jdkVendor="temurin" --spec=linux_x86-64 --buildList=system --customTarget="" --testTarget=extended.system --tapPath=/home/jenkins/workspace/Test_openjdk8_hs_extended.system_x86-64_linux/aqa-tests/TKG/../TKG/output_17394830468193/ --tapName=Test_openjdk8_hs_extended.system_x86-64_linux.tap --comment=""
[2025-02-13T21:45:54.544Z]
[2025-02-13T21:45:54.544Z]
[2025-02-13T21:45:54.544Z] TEST TARGETS SUMMARY
[2025-02-13T21:45:54.544Z] ++++++++++++++++++++++++++++++++++++++++++++++++++++++++++++++++++++++++++
[2025-02-13T21:45:54.544Z] DISABLED test targets:
[2025-02-13T21:45:54.544Z] JdiTest_0
[2025-02-13T21:45:54.544Z] JdiTest_1
[2025-02-13T21:45:54.544Z] JdiTest_2
[2025-02-13T21:45:54.544Z]
[2025-02-13T21:45:54.544Z] PASSED test targets:
[2025-02-13T21:45:54.544Z] MachineInfo_0
[2025-02-13T21:45:54.544Z] OAuthTest_0
[2025-02-13T21:45:54.544Z] MachineInfo_0
[2025-02-13T21:45:54.544Z] MachineInfo_0
[2025-02-13T21:45:54.544Z] MachineInfo_0
[2025-02-13T21:45:54.544Z] MachineInfo_0
[2025-02-13T21:45:54.544Z] MachineInfo_0
[2025-02-13T21:45:54.544Z] MachineInfo_0
[2025-02-13T21:45:54.544Z] MachineInfo_0
[2025-02-13T21:45:54.544Z] MachineInfo_0
[2025-02-13T21:45:54.544Z]
[2025-02-13T21:45:54.544Z] FAILED test targets:
[2025-02-13T21:45:54.544Z] MathLoadTest_all_5m_0
[2025-02-13T21:45:54.544Z] MathLoadTest_all_5m_1
[2025-02-13T21:45:54.544Z] MiniMix_5m_0
[2025-02-13T21:45:54.544Z] MiniMix_5m_1
[2025-02-13T21:45:54.544Z] MiniMix_10m_0
[2025-02-13T21:45:54.544Z] MiniMix_10m_1
[2025-02-13T21:45:54.544Z] MiniMix_aot_5m_0
[2025-02-13T21:45:54.544Z] ConcurrentLoadTest_5m_0
[2025-02-13T21:45:54.544Z] ConcurrentLoadTest_5m_1
[2025-02-13T21:45:54.544Z] DBBLoadTest_5m_0
[2025-02-13T21:45:54.544Z] DBBLoadTest_5m_1
[2025-02-13T21:45:54.544Z] LangLoadTest_5m_0
[2025-02-13T21:45:54.544Z] LangLoadTest_5m_1
[2025-02-13T21:45:54.544Z] LockingLoadTest_0
[2025-02-13T21:45:54.544Z] LockingLoadTest_1
[2025-02-13T21:45:54.544Z] UtilLoadTest_5m_0
[2025-02-13T21:45:54.544Z] UtilLoadTest_5m_1
[2025-02-13T21:45:54.544Z] HCRLateAttachWorkload_0
[2025-02-13T21:45:54.544Z] HCRLateAttachWorkload_1
[2025-02-13T21:45:54.544Z]
[2025-02-13T21:45:54.544Z] TOTAL: 41 EXECUTED: 29 PASSED: 10 FAILED: 19 DISABLED: 3 SKIPPED: 9
[2025-02-13T21:45:54.544Z] ++++++++++++++++++++++++++++++++++++++++++++++++++++++++++++++++++++++++++
[2025-02-13T21:45:54.544Z]
[2025-02-13T21:45:54.544Z] make[1]: *** [settings.mk:445: resultsSummary] Error 2
[2025-02-13T21:45:54.544Z] make[1]: Leaving directory '/home/jenkins/workspace/Test_openjdk8_hs_extended.system_x86-64_linux/aqa-tests/TKG'
[2025-02-13T21:45:54.544Z] make: *** [makefile:62: _extended.system] Error 2
[Pipeline] sh
[2025-02-13T21:45:56.475Z] + uname
[2025-02-13T21:45:56.475Z] + [ Linux = AIX ]
[2025-02-13T21:45:56.475Z] + uname
[2025-02-13T21:45:56.475Z] + [ Linux = SunOS ]
[2025-02-13T21:45:56.475Z] + uname
[2025-02-13T21:45:56.475Z] + [ Linux = *BSD ]
[2025-02-13T21:45:56.475Z] + MAKE=make
[2025-02-13T21:45:56.475Z] + make -f ./aqa-tests/TKG/testEnv.mk testEnvTeardown
[2025-02-13T21:45:56.475Z] make: Nothing to be done for 'testEnvTeardown'.
[Pipeline] }
[2025-02-13T21:45:56.860Z] Xvfb stopping
[Pipeline] // wrap
[Pipeline] echo
[2025-02-13T21:45:57.407Z] There were test failures, set build result to UNSTABLE.
[Pipeline] }
[Pipeline] // stage
[Pipeline] stage
[Pipeline] { (Post)
[Pipeline] step
[2025-02-13T21:45:57.636Z] TAP Reports Processing: START
[2025-02-13T21:45:57.637Z] Looking for TAP results report in workspace using pattern: aqa-tests/TKG/**/*.tap
[2025-02-13T21:45:58.330Z] Saving reports...
[2025-02-13T21:45:58.479Z] Processing '/home/jenkins/.jenkins/jobs/Test_openjdk8_hs_extended.system_x86-64_linux/builds/1216/tap-master-files/aqa-tests/TKG/output_17394830468193/Test_openjdk8_hs_extended.system_x86-64_linux.tap'
[2025-02-13T21:45:58.479Z] Parsing TAP test result [/home/jenkins/.jenkins/jobs/Test_openjdk8_hs_extended.system_x86-64_linux/builds/1216/tap-master-files/aqa-tests/TKG/output_17394830468193/Test_openjdk8_hs_extended.system_x86-64_linux.tap].
[2025-02-13T21:45:58.554Z] There are failed test cases. Marking build as UNSTABLE
[2025-02-13T21:45:58.554Z] TAP Reports Processing: FINISH
[Pipeline] echo
[2025-02-13T21:45:58.566Z] Saving aqa-tests/testenv/testenv.properties file on jenkins.
[Pipeline] archiveArtifacts
[2025-02-13T21:45:58.732Z] Archiving artifacts
[2025-02-13T21:45:59.006Z] Recording fingerprints
[Pipeline] echo
[2025-02-13T21:45:59.151Z] Saving aqa-tests/TKG/**/*.tap file on jenkins.
[Pipeline] archiveArtifacts
[2025-02-13T21:45:59.285Z] Archiving artifacts
[2025-02-13T21:45:59.586Z] Recording fingerprints
[Pipeline] sh
[2025-02-13T21:46:01.199Z] + tar -cf - ./aqa-tests/TKG/output_17394830468193
[2025-02-13T21:46:01.199Z] + pigz -9
[2025-02-13T21:46:01.199Z] + gzip -9
[Pipeline] echo
[2025-02-13T21:46:01.592Z] ARTIFACTORY_SERVER is not set. Saving artifacts on jenkins.
[Pipeline] archiveArtifacts
[2025-02-13T21:46:01.746Z] Archiving artifacts
[2025-02-13T21:46:02.052Z] Recording fingerprints
[Pipeline] findFiles
[Pipeline] echo
[2025-02-13T21:46:04.221Z] Tap file found: aqa-tests/TKG/output_17394830468193/Test_openjdk8_hs_extended.system_x86-64_linux.tap...
[Pipeline] readFile
[Pipeline] echo
[2025-02-13T21:46:05.194Z] Rerun in Grinder with failed test targets: https://ci.adoptium.net/job/Grinder/parambuild/?SDK_RESOURCE=upstream&TARGET=testList+TESTLIST=MathLoadTest_all_5m_0,MathLoadTest_all_5m_1,MiniMix_5m_0,MiniMix_5m_1,MiniMix_10m_0,MiniMix_10m_1,MiniMix_aot_5m_0,ConcurrentLoadTest_5m_0,ConcurrentLoadTest_5m_1,DBBLoadTest_5m_0,DBBLoadTest_5m_1,LangLoadTest_5m_0,LangLoadTest_5m_1,LockingLoadTest_0,LockingLoadTest_1,UtilLoadTest_5m_0,UtilLoadTest_5m_1,HCRLateAttachWorkload_0,HCRLateAttachWorkload_1&BASE_DOCKER_REGISTRY_CREDENTIAL_ID=&TEST_FLAG=&UPSTREAM_TEST_JOB_NAME=&DOCKER_REQUIRED=false&ACTIVE_NODE_TIMEOUT=5&VENDOR_TEST_DIRS=&EXTRA_DOCKER_ARGS=&TKG_OWNER_BRANCH=adoptium%3Amaster&OPENJ9_SYSTEMTEST_OWNER_BRANCH=eclipse%3Amaster&PLATFORM=x86-64_linux&GENERATE_JOBS=true&KEEP_REPORTDIR=false&PERSONAL_BUILD=false&DOCKER_REGISTRY_DIR=&RERUN_ITERATIONS=0&ADOPTOPENJDK_REPO=https%3A%2F%2Fgithub.com%2Fadoptium%2Faqa-tests.git&SETUP_JCK_RUN=false&DOCKER_REGISTRY_URL_CREDENTIAL_ID=&LABEL=&EXTRA_OPTIONS=&CUSTOMIZED_SDK_URL=&BUILD_IDENTIFIER=&JENKINS_KEY=&ADOPTOPENJDK_BRANCH=master&LIGHT_WEIGHT_CHECKOUT=false&USE_JRE=false&ARTIFACTORY_SERVER=&KEEP_WORKSPACE=false&USER_CREDENTIALS_ID=&JDK_VERSION=8&DOCKER_REGISTRY_URL=&ITERATIONS=1&VENDOR_TEST_REPOS=&JDK_REPO=https%3A%2F%2Fgithub.com%2Fadoptium%2Fjdk8u&JCK_GIT_BRANCH=master&OPENJ9_BRANCH=master&OPENJ9_SHA=&JCK_GIT_REPO=&VENDOR_TEST_BRANCHES=&UPSTREAM_JOB_NAME=build-scripts%2Fjobs%2Fjdk8u%2Fjdk8u-linux-x64-temurin&OPENJ9_REPO=https%3A%2F%2Fgithub.com%2Feclipse-openj9%2Fopenj9.git&CLOUD_PROVIDER=&CUSTOM_TARGET=&VENDOR_TEST_SHAS=&JDK_BRANCH=jdk8u452-b02_adopt&LABEL_ADDITION=&ARTIFACTORY_REPO=&ARTIFACTORY_ROOT_DIR=&UPSTREAM_TEST_JOB_NUMBER=&DOCKERIMAGE_TAG=&TEST_TIME=120&JDK_IMPL=hotspot&SSH_AGENT_CREDENTIAL=&AUTO_DETECT=true&SLACK_CHANNEL=aqavit-bot&DYNAMIC_COMPILE=false&RELATED_NODES=&ADOPTOPENJDK_SYSTEMTEST_OWNER_BRANCH=adoptium%3Amaster&APPLICATION_OPTIONS=&CUSTOMIZED_SDK_URL_CREDENTIAL_ID=eclipse_temurin_bot_email_and_token&ARCHIVE_TEST_RESULTS=false&NUM_MACHINES=&OPENJDK_SHA=&TRSS_URL=&RERUN_FAILURE=false&USE_TESTENV_PROPERTIES=false&BUILD_LIST=system&ADDITIONAL_ARTIFACTS_REQUIRED=&UPSTREAM_JOB_NUMBER=506&STF_OWNER_BRANCH=adoptium%3Amaster&TIME_LIMIT=25&JVM_OPTIONS=&PARALLEL=None
[Pipeline] junit
[2025-02-13T21:46:05.374Z] Recording test results
[2025-02-13T21:46:07.171Z] None of the test reports contained any result
[2025-02-13T21:46:07.171Z] [Checks API] No suitable checks publisher found.
[Pipeline] }
[Pipeline] // stage
[Pipeline] echo
[2025-02-13T21:46:07.237Z] PROCESSCATCH: Terminating any hung/left over test processes:
[Pipeline] sh
[2025-02-13T21:46:07.086Z] No test report files were found. Configuration error?
[2025-02-13T21:46:08.657Z] + aqa-tests/terminateTestProcesses.sh jenkins
[2025-02-13T21:46:08.657Z] Unix type machine..
[2025-02-13T21:46:08.657Z] Running on a Linux host
[2025-02-13T21:46:08.657Z] Woohoo - no rogue processes detected!
[Pipeline] cleanWs
[2025-02-13T21:46:09.309Z] [WS-CLEANUP] Deleting project workspace...
[2025-02-13T21:46:09.309Z] [WS-CLEANUP] Deferred wipeout is disabled by the job configuration...
[2025-02-13T21:46:15.526Z] [WS-CLEANUP] done
[Pipeline] sh
[2025-02-13T21:46:17.131Z] + find /tmp -name *core* -print -exec rm -f {} ;
[Pipeline] }
[Pipeline] // timeout
[Pipeline] timeout
[2025-02-13T21:46:17.587Z] Timeout set to expire in 5 min 0 sec
[Pipeline] {
[Pipeline] }
[Pipeline] // timeout
[Pipeline] }
[Pipeline] // node
[Pipeline] }
[Pipeline] // stage
[Pipeline] echo
[2025-02-13T21:46:17.870Z] SETUP_LABEL: ci.role.test
[Pipeline] stage
[Pipeline] { (Parallel Tests)
[Pipeline] parallel
[2025-02-13T21:46:17.936Z] No branches to run
[Pipeline] // parallel
[Pipeline] node
[2025-02-13T21:46:17.997Z] Running on test-docker-sles15-armv8l-1 in /home/jenkins/workspace/Test_openjdk8_hs_extended.system_x86-64_linux
[Pipeline] {
[Pipeline] cleanWs
[2025-02-13T21:46:18.292Z] [WS-CLEANUP] Deleting project workspace...
[2025-02-13T21:46:18.292Z] [WS-CLEANUP] Deferred wipeout is disabled by the job configuration...
[2025-02-13T21:46:18.426Z] [WS-CLEANUP] done
[Pipeline] findFiles
[Pipeline] cleanWs
[2025-02-13T21:46:18.855Z] [WS-CLEANUP] Deleting project workspace...
[2025-02-13T21:46:18.855Z] [WS-CLEANUP] Deferred wipeout is disabled by the job configuration...
[2025-02-13T21:46:18.989Z] [WS-CLEANUP] done
[Pipeline] }
[Pipeline] // node
[Pipeline] }
[Pipeline] // stage
[Pipeline] stage
[Pipeline] { (Rerun)
[Pipeline] echo
[2025-02-13T21:46:19.162Z] allocate a node for generating rerun job ...
[Pipeline] node
[2025-02-13T21:46:19.178Z] Running on test-docker-ubuntu2404-armv7-8 in /home/jenkins/workspace/Test_openjdk8_hs_extended.system_x86-64_linux
[Pipeline] {
[Pipeline] echo
[2025-02-13T21:46:19.220Z] Generating rerun Test_openjdk8_hs_extended.system_x86-64_linux_rerun job for running failed test(s) ...
[Pipeline] parallel
[Pipeline] { (Branch: Test_openjdk8_hs_extended.system_x86-64_linux_rerun)
[Pipeline] echo
[2025-02-13T21:46:19.304Z] GENERATE_JOBS is set to true, set test job Test_openjdk8_hs_extended.system_x86-64_linux_rerun params for generating the job
[Pipeline] fileExists
[Pipeline] sh
[2025-02-13T21:46:21.443Z] + curl -Os https://raw.githubusercontent.com/adoptium/aqa-tests/master/buildenv/jenkins/testJobTemplate
[Pipeline] jobDsl
[2025-02-13T21:46:22.353Z] Processing DSL script testJobTemplate
[2025-02-13T21:49:43.003Z] LEVELS: [extended]
[2025-02-13T21:49:43.003Z] JDK_VERSIONS: [8]
[2025-02-13T21:49:43.003Z] GROUPS: [system]
[2025-02-13T21:49:43.003Z] ARCH_OS_LIST: [x86-64_linux]
[2025-02-13T21:49:43.168Z] Added items:
[2025-02-13T21:49:43.168Z] GeneratedJob{name='Test_openjdk8_hs_extended.system_x86-64_linux_rerun'}
[Pipeline] }
[Pipeline] // parallel
[Pipeline] }
[Pipeline] // node
[Pipeline] echo
[2025-02-13T21:49:47.026Z] Triggering rerun jobs in parallel ...
[Pipeline] parallel
[Pipeline] { (Branch: Test_openjdk8_hs_extended.system_x86-64_linux_rerun)
[Pipeline] build
[2025-02-13T21:49:47.062Z] Scheduling project: Test_openjdk8_hs_extended.system_x86-64_linux_rerun
[2025-02-13T21:49:53.421Z] Starting building: Test_openjdk8_hs_extended.system_x86-64_linux_rerun #11
[2025-02-13T21:51:01.933Z] Build Test_openjdk8_hs_extended.system_x86-64_linux_rerun #11 completed: FAILURE
[Pipeline] }
[Pipeline] // parallel
[Pipeline] node
[2025-02-13T21:51:02.010Z] Running on test-rise-ubuntu2404-riscv64-3 in /home/jenkins/workspace/Test_openjdk8_hs_extended.system_x86-64_linux
[Pipeline] {
[Pipeline] cleanWs
[2025-02-13T21:51:02.112Z] [WS-CLEANUP] Deleting project workspace...
[2025-02-13T21:51:02.113Z] [WS-CLEANUP] Deferred wipeout is disabled by the job configuration...
[2025-02-13T21:51:02.141Z] [WS-CLEANUP] done
[Pipeline] echo
[2025-02-13T21:51:02.150Z] Test_openjdk8_hs_extended.system_x86-64_linux_rerun #11 completed with status FAILURE
[Pipeline] cleanWs
[2025-02-13T21:51:02.226Z] [WS-CLEANUP] Deleting project workspace...
[2025-02-13T21:51:02.226Z] [WS-CLEANUP] Deferred wipeout is disabled by the job configuration...
[2025-02-13T21:51:02.258Z] [WS-CLEANUP] done
[Pipeline] }
[Pipeline] // node
[Pipeline] }
[Pipeline] // stage
[Pipeline] }
[Pipeline] // timestamps
[Pipeline] End of Pipeline
Also: hudson.remoting.ProxyException: org.jenkinsci.plugins.workflow.actions.ErrorAction$ErrorId: 64d87391-fe30-491a-b75c-5ae5f0587b2a
hudson.remoting.ProxyException: groovy.lang.MissingPropertyException: No such property: parallelTestParams for class: Script1
at org.codehaus.groovy.runtime.ScriptBytecodeAdapter.unwrap(ScriptBytecodeAdapter.java:66)
at org.codehaus.groovy.runtime.ScriptBytecodeAdapter.getProperty(ScriptBytecodeAdapter.java:471)
at PluginClassLoader for script-security//org.kohsuke.groovy.sandbox.impl.Checker$7.call(Checker.java:377)
at PluginClassLoader for script-security//org.kohsuke.groovy.sandbox.GroovyInterceptor.onGetProperty(GroovyInterceptor.java:68)
at PluginClassLoader for script-security//org.jenkinsci.plugins.scriptsecurity.sandbox.groovy.SandboxInterceptor.onGetProperty(SandboxInterceptor.java:347)
at PluginClassLoader for script-security//org.kohsuke.groovy.sandbox.impl.Checker$7.call(Checker.java:375)
at PluginClassLoader for script-security//org.kohsuke.groovy.sandbox.impl.Checker.checkedGetProperty(Checker.java:379)
at PluginClassLoader for script-security//org.kohsuke.groovy.sandbox.impl.Checker.checkedGetProperty(Checker.java:355)
at PluginClassLoader for script-security//org.kohsuke.groovy.sandbox.impl.Checker.checkedGetProperty(Checker.java:355)
at PluginClassLoader for workflow-cps//com.cloudbees.groovy.cps.sandbox.SandboxInvoker.getProperty(SandboxInvoker.java:29)
at PluginClassLoader for workflow-cps//org.jenkinsci.plugins.workflow.cps.LoggingInvoker.getProperty(LoggingInvoker.java:133)
at PluginClassLoader for workflow-cps//com.cloudbees.groovy.cps.impl.PropertyAccessBlock.rawGet(PropertyAccessBlock.java:20)
at Script1.archiveChildJobTap(Script1.groovy:1491)
at com.cloudbees.groovy.cps.CpsDefaultGroovyMethods.callClosureForMapEntry(CpsDefaultGroovyMethods:5363)
at com.cloudbees.groovy.cps.CpsDefaultGroovyMethods.each(CpsDefaultGroovyMethods:2202)
at Script1.archiveChildJobTap(Script1.groovy:1482)
at ___cps.transform___(Native Method)
at PluginClassLoader for workflow-cps//com.cloudbees.groovy.cps.impl.PropertyishBlock$ContinuationImpl.get(PropertyishBlock.java:73)
at PluginClassLoader for workflow-cps//com.cloudbees.groovy.cps.LValueBlock$GetAdapter.receive(LValueBlock.java:30)
at PluginClassLoader for workflow-cps//com.cloudbees.groovy.cps.impl.PropertyishBlock$ContinuationImpl.fixName(PropertyishBlock.java:65)
at jdk.internal.reflect.GeneratedMethodAccessor203.invoke(Unknown Source)
at java.base/jdk.internal.reflect.DelegatingMethodAccessorImpl.invoke(DelegatingMethodAccessorImpl.java:43)
at java.base/java.lang.reflect.Method.invoke(Method.java:569)
at PluginClassLoader for workflow-cps//com.cloudbees.groovy.cps.impl.ContinuationPtr$ContinuationImpl.receive(ContinuationPtr.java:72)
at PluginClassLoader for workflow-cps//com.cloudbees.groovy.cps.impl.ConstantBlock.eval(ConstantBlock.java:21)
at PluginClassLoader for workflow-cps//com.cloudbees.groovy.cps.Next.step(Next.java:83)
at PluginClassLoader for workflow-cps//com.cloudbees.groovy.cps.Continuable.run0(Continuable.java:147)
at PluginClassLoader for workflow-cps//org.jenkinsci.plugins.workflow.cps.SandboxContinuable.access$001(SandboxContinuable.java:17)
at PluginClassLoader for workflow-cps//org.jenkinsci.plugins.workflow.cps.SandboxContinuable.run0(SandboxContinuable.java:49)
at PluginClassLoader for workflow-cps//org.jenkinsci.plugins.workflow.cps.CpsThread.runNextChunk(CpsThread.java:180)
at PluginClassLoader for workflow-cps//org.jenkinsci.plugins.workflow.cps.CpsThreadGroup.run(CpsThreadGroup.java:423)
at PluginClassLoader for workflow-cps//org.jenkinsci.plugins.workflow.cps.CpsThreadGroup$2.call(CpsThreadGroup.java:331)
at PluginClassLoader for workflow-cps//org.jenkinsci.plugins.workflow.cps.CpsThreadGroup$2.call(CpsThreadGroup.java:295)
at PluginClassLoader for workflow-cps//org.jenkinsci.plugins.workflow.cps.CpsVmExecutorService.lambda$wrap$4(CpsVmExecutorService.java:140)
at java.base/java.util.concurrent.FutureTask.run(FutureTask.java:264)
at hudson.remoting.SingleLaneExecutorService$1.run(SingleLaneExecutorService.java:139)
at jenkins.util.ContextResettingExecutorService$1.run(ContextResettingExecutorService.java:28)
at jenkins.security.ImpersonatingExecutorService$1.run(ImpersonatingExecutorService.java:68)
at jenkins.util.ErrorLoggingExecutorService.lambda$wrap$0(ErrorLoggingExecutorService.java:51)
at java.base/java.util.concurrent.Executors$RunnableAdapter.call(Executors.java:539)
at java.base/java.util.concurrent.FutureTask.run(FutureTask.java:264)
at java.base/java.util.concurrent.ThreadPoolExecutor.runWorker(ThreadPoolExecutor.java:1136)
at java.base/java.util.concurrent.ThreadPoolExecutor$Worker.run(ThreadPoolExecutor.java:635)
at PluginClassLoader for workflow-cps//org.jenkinsci.plugins.workflow.cps.CpsVmExecutorService$1.call(CpsVmExecutorService.java:53)
at PluginClassLoader for workflow-cps//org.jenkinsci.plugins.workflow.cps.CpsVmExecutorService$1.call(CpsVmExecutorService.java:50)
at org.codehaus.groovy.runtime.GroovyCategorySupport$ThreadCategoryInfo.use(GroovyCategorySupport.java:136)
at org.codehaus.groovy.runtime.GroovyCategorySupport.use(GroovyCategorySupport.java:275)
at PluginClassLoader for workflow-cps//org.jenkinsci.plugins.workflow.cps.CpsVmExecutorService.lambda$categoryThreadFactory$0(CpsVmExecutorService.java:50)
at java.base/java.lang.Thread.run(Thread.java:840)
/home/jenkins/.jenkins/workspace/Test_openjdk8_hs_extended.system_x86-64_linux@tmp/jfrog/1216/.jfrog deleted
Finished: FAILURE