hotspot_custom_0
[2025-02-27T07:39:34.166Z] Running test hotspot_custom_0 ...
[2025-02-27T07:39:34.945Z] ===============================================
[2025-02-27T07:39:34.946Z] hotspot_custom_0 Start Time: Thu Feb 27 07:39:34 2025 Epoch Time (ms): 1740641974100
[2025-02-27T07:39:34.946Z] variation: Mode150
[2025-02-27T07:39:34.946Z] JVM_OPTIONS: -XX:+UseCompressedOops
[2025-02-27T07:39:34.946Z] { \
[2025-02-27T07:39:34.946Z] echo ""; echo "TEST SETUP:"; \
[2025-02-27T07:39:34.946Z] echo "Nothing to be done for setup."; \
[2025-02-27T07:39:34.946Z] mkdir -p "/home/jenkins/workspace/Test_openjdk17_hs_sanity.openjdk_ppc64_aix_rerun/aqa-tests/TKG/../TKG/output_17406419738799/hotspot_custom_0"; \
[2025-02-27T07:39:34.946Z] cd "/home/jenkins/workspace/Test_openjdk17_hs_sanity.openjdk_ppc64_aix_rerun/aqa-tests/TKG/../TKG/output_17406419738799/hotspot_custom_0"; \
[2025-02-27T07:39:34.946Z] echo ""; echo "TESTING:"; \
[2025-02-27T07:39:34.946Z] "/home/jenkins/workspace/Test_openjdk17_hs_sanity.openjdk_ppc64_aix_rerun/jdkbinary/j2sdk-image/bin/java" -Xmx512m -jar "/home/jenkins/workspace/Test_openjdk17_hs_sanity.openjdk_ppc64_aix_rerun/aqa-tests/TKG/../../jvmtest/openjdk/jtreg/lib/jtreg.jar" \
[2025-02-27T07:39:34.946Z] -agentvm -a -ea -esa -v:fail,error,time,nopass -retain:fail,error,*.dmp,javacore.*,heapdump.*,*.trc -ignore:quiet -timeoutFactor:8 -xml:verify -concurrency:1 -nativepath:"/home/jenkins/workspace/Test_openjdk17_hs_sanity.openjdk_ppc64_aix_rerun/jdkbinary/openjdk-test-image/hotspot/jtreg/native" -vmoptions:"-Xmx512m -XX:+UseCompressedOops " \
[2025-02-27T07:39:34.946Z] \
[2025-02-27T07:39:34.946Z] -w ""/home/jenkins/workspace/Test_openjdk17_hs_sanity.openjdk_ppc64_aix_rerun/aqa-tests/TKG/../TKG/output_17406419738799/hotspot_custom_0"/work" \
[2025-02-27T07:39:34.946Z] -r ""/home/jenkins/workspace/Test_openjdk17_hs_sanity.openjdk_ppc64_aix_rerun/aqa-tests/TKG/../TKG/output_17406419738799/hotspot_custom_0"/report" \
[2025-02-27T07:39:34.946Z] -jdk:"/home/jenkins/workspace/Test_openjdk17_hs_sanity.openjdk_ppc64_aix_rerun/jdkbinary/j2sdk-image" \
[2025-02-27T07:39:34.946Z] /home/jenkins/workspace/Test_openjdk17_hs_sanity.openjdk_ppc64_aix_rerun/aqa-tests/TKG/../openjdk/openjdk-jdk/test/hotspot/jtreg/gc/metaspace/TestMetaspacePerfCounters.java#Epsilon-64 /home/jenkins/workspace/Test_openjdk17_hs_sanity.openjdk_ppc64_aix_rerun/aqa-tests/TKG/../openjdk/openjdk-jdk/test/hotspot/jtreg/runtime/ErrorHandling/MachCodeFramesInErrorFile.java /home/jenkins/workspace/Test_openjdk17_hs_sanity.openjdk_ppc64_aix_rerun/aqa-tests/TKG/../openjdk/openjdk-jdk/test/hotspot/jtreg/runtime/DefineClass/NullClassBytesTest.java /home/jenkins/workspace/Test_openjdk17_hs_sanity.openjdk_ppc64_aix_rerun/aqa-tests/TKG/../openjdk/openjdk-jdk/test/hotspot/jtreg/runtime/jni/getCreatedJavaVMs/TestGetCreatedJavaVMs.java; \
[2025-02-27T07:39:34.946Z] if [ $? -eq 0 ]; then echo "-----------------------------------"; echo "hotspot_custom_0""_PASSED"; echo "-----------------------------------"; cd /home/jenkins/workspace/Test_openjdk17_hs_sanity.openjdk_ppc64_aix_rerun/aqa-tests/TKG/..; else echo "-----------------------------------"; echo "hotspot_custom_0""_FAILED"; echo "-----------------------------------"; fi; \
[2025-02-27T07:39:34.946Z] echo ""; echo "TEST TEARDOWN:"; \
[2025-02-27T07:39:34.946Z] echo "Nothing to be done for teardown."; \
[2025-02-27T07:39:34.946Z] } 2>&1 | tee -a "/home/jenkins/workspace/Test_openjdk17_hs_sanity.openjdk_ppc64_aix_rerun/aqa-tests/TKG/../TKG/output_17406419738799/TestTargetResult";
[2025-02-27T07:39:34.946Z]
[2025-02-27T07:39:34.946Z] TEST SETUP:
[2025-02-27T07:39:34.946Z] Nothing to be done for setup.
[2025-02-27T07:39:34.946Z]
[2025-02-27T07:39:34.946Z] TESTING:
[2025-02-27T07:39:35.727Z] Directory "/home/jenkins/workspace/Test_openjdk17_hs_sanity.openjdk_ppc64_aix_rerun/aqa-tests/TKG/../TKG/output_17406419738799/hotspot_custom_0/work" not found: creating
[2025-02-27T07:39:35.727Z] Directory "/home/jenkins/workspace/Test_openjdk17_hs_sanity.openjdk_ppc64_aix_rerun/aqa-tests/TKG/../TKG/output_17406419738799/hotspot_custom_0/report" not found: creating
[2025-02-27T07:39:42.665Z] XML output with verification to /home/jenkins/workspace/Test_openjdk17_hs_sanity.openjdk_ppc64_aix_rerun/aqa-tests/TKG/output_17406419738799/hotspot_custom_0/work
[2025-02-27T07:39:52.643Z] --------------------------------------------------
[2025-02-27T07:39:52.643Z] TEST: runtime/DefineClass/NullClassBytesTest.java
[2025-02-27T07:39:52.643Z] TEST JDK: /home/jenkins/workspace/Test_openjdk17_hs_sanity.openjdk_ppc64_aix_rerun/jdkbinary/j2sdk-image
[2025-02-27T07:39:52.643Z]
[2025-02-27T07:39:52.643Z] ACTION: compile -- Passed. Compilation successful
[2025-02-27T07:39:52.643Z] REASON: User specified action: run compile A.java
[2025-02-27T07:39:52.643Z] TIME: 0.255 seconds
[2025-02-27T07:39:52.643Z] messages:
[2025-02-27T07:39:52.643Z] command: compile /home/jenkins/workspace/Test_openjdk17_hs_sanity.openjdk_ppc64_aix_rerun/aqa-tests/openjdk/openjdk-jdk/test/hotspot/jtreg/runtime/DefineClass/A.java
[2025-02-27T07:39:52.644Z] reason: User specified action: run compile A.java
[2025-02-27T07:39:52.644Z] started: Thu Feb 27 07:39:49 UTC 2025
[2025-02-27T07:39:52.644Z] Additional options from @modules: --add-modules java.base --add-exports java.base/jdk.internal.misc=ALL-UNNAMED
[2025-02-27T07:39:52.644Z] Mode: agentvm
[2025-02-27T07:39:52.644Z] Agent id: 1
[2025-02-27T07:39:52.644Z] finished: Thu Feb 27 07:39:50 UTC 2025
[2025-02-27T07:39:52.644Z] elapsed time (seconds): 0.255
[2025-02-27T07:39:52.644Z] configuration:
[2025-02-27T07:39:52.644Z] Boot Layer (javac runtime environment)
[2025-02-27T07:39:52.644Z] class path: /home/jenkins/workspace/Test_openjdk17_hs_sanity.openjdk_ppc64_aix_rerun/jvmtest/openjdk/jtreg/lib/javatest.jar
[2025-02-27T07:39:52.644Z] /home/jenkins/workspace/Test_openjdk17_hs_sanity.openjdk_ppc64_aix_rerun/jvmtest/openjdk/jtreg/lib/jtreg.jar
[2025-02-27T07:39:52.644Z] patch: java.base /home/jenkins/workspace/Test_openjdk17_hs_sanity.openjdk_ppc64_aix_rerun/aqa-tests/TKG/output_17406419738799/hotspot_custom_0/work/patches/java.base
[2025-02-27T07:39:52.644Z]
[2025-02-27T07:39:52.644Z] javac compilation environment
[2025-02-27T07:39:52.644Z] add modules: java.base
[2025-02-27T07:39:52.644Z] add exports: java.base/jdk.internal.misc ALL-UNNAMED
[2025-02-27T07:39:52.644Z] source path: /home/jenkins/workspace/Test_openjdk17_hs_sanity.openjdk_ppc64_aix_rerun/aqa-tests/openjdk/openjdk-jdk/test/hotspot/jtreg/runtime/DefineClass
[2025-02-27T07:39:52.644Z] /home/jenkins/workspace/Test_openjdk17_hs_sanity.openjdk_ppc64_aix_rerun/aqa-tests/openjdk/openjdk-jdk/test/lib
[2025-02-27T07:39:52.644Z] class path: /home/jenkins/workspace/Test_openjdk17_hs_sanity.openjdk_ppc64_aix_rerun/aqa-tests/openjdk/openjdk-jdk/test/hotspot/jtreg/runtime/DefineClass
[2025-02-27T07:39:52.644Z] /home/jenkins/workspace/Test_openjdk17_hs_sanity.openjdk_ppc64_aix_rerun/aqa-tests/TKG/output_17406419738799/hotspot_custom_0/work/classes/runtime/DefineClass/NullClassBytesTest.d
[2025-02-27T07:39:52.644Z] /home/jenkins/workspace/Test_openjdk17_hs_sanity.openjdk_ppc64_aix_rerun/aqa-tests/TKG/output_17406419738799/hotspot_custom_0/work/classes/test/lib
[2025-02-27T07:39:52.644Z]
[2025-02-27T07:39:52.644Z] rerun:
[2025-02-27T07:39:52.644Z] cd /home/jenkins/workspace/Test_openjdk17_hs_sanity.openjdk_ppc64_aix_rerun/aqa-tests/TKG/output_17406419738799/hotspot_custom_0/work/scratch && \
[2025-02-27T07:39:52.644Z] DISPLAY=unix:0 \
[2025-02-27T07:39:52.644Z] HOME=/home/jenkins \
[2025-02-27T07:39:52.644Z] LANG=en_US \
[2025-02-27T07:39:52.644Z] PATH=/bin:/usr/bin:/usr/sbin \
[2025-02-27T07:39:52.644Z] TZ=Etc/UTC \
[2025-02-27T07:39:52.644Z] /home/jenkins/workspace/Test_openjdk17_hs_sanity.openjdk_ppc64_aix_rerun/jdkbinary/j2sdk-image/bin/javac \
[2025-02-27T07:39:52.644Z] -J-ea \
[2025-02-27T07:39:52.644Z] -J-esa \
[2025-02-27T07:39:52.644Z] -J-Xmx512m \
[2025-02-27T07:39:52.644Z] -J-XX:+UseCompressedOops \
[2025-02-27T07:39:52.644Z] -J-Dtest.vm.opts='-ea -esa -Xmx512m -XX:+UseCompressedOops' \
[2025-02-27T07:39:52.644Z] -J-Dtest.tool.vm.opts='-J-ea -J-esa -J-Xmx512m -J-XX:+UseCompressedOops' \
[2025-02-27T07:39:52.644Z] -J-Dtest.compiler.opts= \
[2025-02-27T07:39:52.644Z] -J-Dtest.java.opts= \
[2025-02-27T07:39:52.644Z] -J-Dtest.jdk=/home/jenkins/workspace/Test_openjdk17_hs_sanity.openjdk_ppc64_aix_rerun/jdkbinary/j2sdk-image \
[2025-02-27T07:39:52.644Z] -J-Dcompile.jdk=/home/jenkins/workspace/Test_openjdk17_hs_sanity.openjdk_ppc64_aix_rerun/jdkbinary/j2sdk-image \
[2025-02-27T07:39:52.644Z] -J-Dtest.timeout.factor=8.0 \
[2025-02-27T07:39:52.644Z] -J-Dtest.nativepath=/home/jenkins/workspace/Test_openjdk17_hs_sanity.openjdk_ppc64_aix_rerun/jdkbinary/openjdk-test-image/hotspot/jtreg/native \
[2025-02-27T07:39:52.644Z] -J-Dtest.root=/home/jenkins/workspace/Test_openjdk17_hs_sanity.openjdk_ppc64_aix_rerun/aqa-tests/openjdk/openjdk-jdk/test/hotspot/jtreg \
[2025-02-27T07:39:52.644Z] -J-Dtest.name=runtime/DefineClass/NullClassBytesTest.java \
[2025-02-27T07:39:52.644Z] -J-Dtest.file=/home/jenkins/workspace/Test_openjdk17_hs_sanity.openjdk_ppc64_aix_rerun/aqa-tests/openjdk/openjdk-jdk/test/hotspot/jtreg/runtime/DefineClass/NullClassBytesTest.java \
[2025-02-27T07:39:52.644Z] -J-Dtest.src=/home/jenkins/workspace/Test_openjdk17_hs_sanity.openjdk_ppc64_aix_rerun/aqa-tests/openjdk/openjdk-jdk/test/hotspot/jtreg/runtime/DefineClass \
[2025-02-27T07:39:52.644Z] -J-Dtest.src.path=/home/jenkins/workspace/Test_openjdk17_hs_sanity.openjdk_ppc64_aix_rerun/aqa-tests/openjdk/openjdk-jdk/test/hotspot/jtreg/runtime/DefineClass:/home/jenkins/workspace/Test_openjdk17_hs_sanity.openjdk_ppc64_aix_rerun/aqa-tests/openjdk/openjdk-jdk/test/lib \
[2025-02-27T07:39:52.644Z] -J-Dtest.classes=/home/jenkins/workspace/Test_openjdk17_hs_sanity.openjdk_ppc64_aix_rerun/aqa-tests/TKG/output_17406419738799/hotspot_custom_0/work/classes/runtime/DefineClass/NullClassBytesTest.d \
[2025-02-27T07:39:52.644Z] -J-Dtest.class.path=/home/jenkins/workspace/Test_openjdk17_hs_sanity.openjdk_ppc64_aix_rerun/aqa-tests/TKG/output_17406419738799/hotspot_custom_0/work/classes/runtime/DefineClass/NullClassBytesTest.d:/home/jenkins/workspace/Test_openjdk17_hs_sanity.openjdk_ppc64_aix_rerun/aqa-tests/TKG/output_17406419738799/hotspot_custom_0/work/classes/test/lib \
[2025-02-27T07:39:52.644Z] -J-Dtest.class.path.prefix=/home/jenkins/workspace/Test_openjdk17_hs_sanity.openjdk_ppc64_aix_rerun/aqa-tests/TKG/output_17406419738799/hotspot_custom_0/work/classes/runtime/DefineClass/NullClassBytesTest.d:/home/jenkins/workspace/Test_openjdk17_hs_sanity.openjdk_ppc64_aix_rerun/aqa-tests/openjdk/openjdk-jdk/test/hotspot/jtreg/runtime/DefineClass:/home/jenkins/workspace/Test_openjdk17_hs_sanity.openjdk_ppc64_aix_rerun/aqa-tests/TKG/output_17406419738799/hotspot_custom_0/work/classes/test/lib \
[2025-02-27T07:39:52.644Z] -J-Dtest.modules=java.base/jdk.internal.misc \
[2025-02-27T07:39:52.644Z] --add-modules java.base \
[2025-02-27T07:39:52.644Z] --add-exports java.base/jdk.internal.misc=ALL-UNNAMED \
[2025-02-27T07:39:52.644Z] -d /home/jenkins/workspace/Test_openjdk17_hs_sanity.openjdk_ppc64_aix_rerun/aqa-tests/TKG/output_17406419738799/hotspot_custom_0/work/classes/runtime/DefineClass/NullClassBytesTest.d \
[2025-02-27T07:39:52.644Z] -sourcepath /home/jenkins/workspace/Test_openjdk17_hs_sanity.openjdk_ppc64_aix_rerun/aqa-tests/openjdk/openjdk-jdk/test/hotspot/jtreg/runtime/DefineClass:/home/jenkins/workspace/Test_openjdk17_hs_sanity.openjdk_ppc64_aix_rerun/aqa-tests/openjdk/openjdk-jdk/test/lib \
[2025-02-27T07:39:52.644Z] -classpath /home/jenkins/workspace/Test_openjdk17_hs_sanity.openjdk_ppc64_aix_rerun/aqa-tests/openjdk/openjdk-jdk/test/hotspot/jtreg/runtime/DefineClass:/home/jenkins/workspace/Test_openjdk17_hs_sanity.openjdk_ppc64_aix_rerun/aqa-tests/TKG/output_17406419738799/hotspot_custom_0/work/classes/runtime/DefineClass/NullClassBytesTest.d:/home/jenkins/workspace/Test_openjdk17_hs_sanity.openjdk_ppc64_aix_rerun/aqa-tests/TKG/output_17406419738799/hotspot_custom_0/work/classes/test/lib /home/jenkins/workspace/Test_openjdk17_hs_sanity.openjdk_ppc64_aix_rerun/aqa-tests/openjdk/openjdk-jdk/test/hotspot/jtreg/runtime/DefineClass/A.java
[2025-02-27T07:39:52.644Z]
[2025-02-27T07:39:52.644Z] ACTION: build -- Passed. Build successful
[2025-02-27T07:39:52.644Z] REASON: Named class compiled on demand
[2025-02-27T07:39:52.644Z] TIME: 0.463 seconds
[2025-02-27T07:39:52.644Z] messages:
[2025-02-27T07:39:52.644Z] command: build NullClassBytesTest
[2025-02-27T07:39:52.644Z] reason: Named class compiled on demand
[2025-02-27T07:39:52.644Z] started: Thu Feb 27 07:39:50 UTC 2025
[2025-02-27T07:39:52.644Z] Test directory:
[2025-02-27T07:39:52.644Z] compile: NullClassBytesTest
[2025-02-27T07:39:52.644Z] finished: Thu Feb 27 07:39:50 UTC 2025
[2025-02-27T07:39:52.644Z] elapsed time (seconds): 0.463
[2025-02-27T07:39:52.644Z]
[2025-02-27T07:39:52.644Z] ACTION: compile -- Passed. Compilation successful
[2025-02-27T07:39:52.644Z] REASON: .class file out of date or does not exist
[2025-02-27T07:39:52.644Z] TIME: 0.462 seconds
[2025-02-27T07:39:52.644Z] messages:
[2025-02-27T07:39:52.644Z] command: compile /home/jenkins/workspace/Test_openjdk17_hs_sanity.openjdk_ppc64_aix_rerun/aqa-tests/openjdk/openjdk-jdk/test/hotspot/jtreg/runtime/DefineClass/NullClassBytesTest.java
[2025-02-27T07:39:52.644Z] reason: .class file out of date or does not exist
[2025-02-27T07:39:52.644Z] started: Thu Feb 27 07:39:50 UTC 2025
[2025-02-27T07:39:52.644Z] Additional options from @modules: --add-modules java.base --add-exports java.base/jdk.internal.misc=ALL-UNNAMED
[2025-02-27T07:39:52.644Z] Mode: agentvm
[2025-02-27T07:39:52.644Z] Agent id: 1
[2025-02-27T07:39:52.644Z] finished: Thu Feb 27 07:39:50 UTC 2025
[2025-02-27T07:39:52.644Z] elapsed time (seconds): 0.462
[2025-02-27T07:39:52.644Z] configuration:
[2025-02-27T07:39:52.644Z] Boot Layer (javac runtime environment)
[2025-02-27T07:39:52.644Z] class path: /home/jenkins/workspace/Test_openjdk17_hs_sanity.openjdk_ppc64_aix_rerun/jvmtest/openjdk/jtreg/lib/javatest.jar
[2025-02-27T07:39:52.644Z] /home/jenkins/workspace/Test_openjdk17_hs_sanity.openjdk_ppc64_aix_rerun/jvmtest/openjdk/jtreg/lib/jtreg.jar
[2025-02-27T07:39:52.644Z] patch: java.base /home/jenkins/workspace/Test_openjdk17_hs_sanity.openjdk_ppc64_aix_rerun/aqa-tests/TKG/output_17406419738799/hotspot_custom_0/work/patches/java.base
[2025-02-27T07:39:52.644Z]
[2025-02-27T07:39:52.644Z] javac compilation environment
[2025-02-27T07:39:52.644Z] add modules: java.base
[2025-02-27T07:39:52.645Z] add exports: java.base/jdk.internal.misc ALL-UNNAMED
[2025-02-27T07:39:52.645Z] source path: /home/jenkins/workspace/Test_openjdk17_hs_sanity.openjdk_ppc64_aix_rerun/aqa-tests/openjdk/openjdk-jdk/test/hotspot/jtreg/runtime/DefineClass
[2025-02-27T07:39:52.645Z] /home/jenkins/workspace/Test_openjdk17_hs_sanity.openjdk_ppc64_aix_rerun/aqa-tests/openjdk/openjdk-jdk/test/lib
[2025-02-27T07:39:52.645Z] class path: /home/jenkins/workspace/Test_openjdk17_hs_sanity.openjdk_ppc64_aix_rerun/aqa-tests/openjdk/openjdk-jdk/test/hotspot/jtreg/runtime/DefineClass
[2025-02-27T07:39:52.645Z] /home/jenkins/workspace/Test_openjdk17_hs_sanity.openjdk_ppc64_aix_rerun/aqa-tests/TKG/output_17406419738799/hotspot_custom_0/work/classes/runtime/DefineClass/NullClassBytesTest.d
[2025-02-27T07:39:52.645Z] /home/jenkins/workspace/Test_openjdk17_hs_sanity.openjdk_ppc64_aix_rerun/aqa-tests/TKG/output_17406419738799/hotspot_custom_0/work/classes/test/lib
[2025-02-27T07:39:52.645Z]
[2025-02-27T07:39:52.645Z] rerun:
[2025-02-27T07:39:52.645Z] cd /home/jenkins/workspace/Test_openjdk17_hs_sanity.openjdk_ppc64_aix_rerun/aqa-tests/TKG/output_17406419738799/hotspot_custom_0/work/scratch && \
[2025-02-27T07:39:52.645Z] DISPLAY=unix:0 \
[2025-02-27T07:39:52.645Z] HOME=/home/jenkins \
[2025-02-27T07:39:52.645Z] LANG=en_US \
[2025-02-27T07:39:52.645Z] PATH=/bin:/usr/bin:/usr/sbin \
[2025-02-27T07:39:52.645Z] TZ=Etc/UTC \
[2025-02-27T07:39:52.645Z] /home/jenkins/workspace/Test_openjdk17_hs_sanity.openjdk_ppc64_aix_rerun/jdkbinary/j2sdk-image/bin/javac \
[2025-02-27T07:39:52.645Z] -J-ea \
[2025-02-27T07:39:52.645Z] -J-esa \
[2025-02-27T07:39:52.645Z] -J-Xmx512m \
[2025-02-27T07:39:52.645Z] -J-XX:+UseCompressedOops \
[2025-02-27T07:39:52.645Z] -J-Dtest.vm.opts='-ea -esa -Xmx512m -XX:+UseCompressedOops' \
[2025-02-27T07:39:52.645Z] -J-Dtest.tool.vm.opts='-J-ea -J-esa -J-Xmx512m -J-XX:+UseCompressedOops' \
[2025-02-27T07:39:52.645Z] -J-Dtest.compiler.opts= \
[2025-02-27T07:39:52.645Z] -J-Dtest.java.opts= \
[2025-02-27T07:39:52.645Z] -J-Dtest.jdk=/home/jenkins/workspace/Test_openjdk17_hs_sanity.openjdk_ppc64_aix_rerun/jdkbinary/j2sdk-image \
[2025-02-27T07:39:52.645Z] -J-Dcompile.jdk=/home/jenkins/workspace/Test_openjdk17_hs_sanity.openjdk_ppc64_aix_rerun/jdkbinary/j2sdk-image \
[2025-02-27T07:39:52.645Z] -J-Dtest.timeout.factor=8.0 \
[2025-02-27T07:39:52.645Z] -J-Dtest.nativepath=/home/jenkins/workspace/Test_openjdk17_hs_sanity.openjdk_ppc64_aix_rerun/jdkbinary/openjdk-test-image/hotspot/jtreg/native \
[2025-02-27T07:39:52.645Z] -J-Dtest.root=/home/jenkins/workspace/Test_openjdk17_hs_sanity.openjdk_ppc64_aix_rerun/aqa-tests/openjdk/openjdk-jdk/test/hotspot/jtreg \
[2025-02-27T07:39:52.645Z] -J-Dtest.name=runtime/DefineClass/NullClassBytesTest.java \
[2025-02-27T07:39:52.645Z] -J-Dtest.file=/home/jenkins/workspace/Test_openjdk17_hs_sanity.openjdk_ppc64_aix_rerun/aqa-tests/openjdk/openjdk-jdk/test/hotspot/jtreg/runtime/DefineClass/NullClassBytesTest.java \
[2025-02-27T07:39:52.645Z] -J-Dtest.src=/home/jenkins/workspace/Test_openjdk17_hs_sanity.openjdk_ppc64_aix_rerun/aqa-tests/openjdk/openjdk-jdk/test/hotspot/jtreg/runtime/DefineClass \
[2025-02-27T07:39:52.645Z] -J-Dtest.src.path=/home/jenkins/workspace/Test_openjdk17_hs_sanity.openjdk_ppc64_aix_rerun/aqa-tests/openjdk/openjdk-jdk/test/hotspot/jtreg/runtime/DefineClass:/home/jenkins/workspace/Test_openjdk17_hs_sanity.openjdk_ppc64_aix_rerun/aqa-tests/openjdk/openjdk-jdk/test/lib \
[2025-02-27T07:39:52.645Z] -J-Dtest.classes=/home/jenkins/workspace/Test_openjdk17_hs_sanity.openjdk_ppc64_aix_rerun/aqa-tests/TKG/output_17406419738799/hotspot_custom_0/work/classes/runtime/DefineClass/NullClassBytesTest.d \
[2025-02-27T07:39:52.645Z] -J-Dtest.class.path=/home/jenkins/workspace/Test_openjdk17_hs_sanity.openjdk_ppc64_aix_rerun/aqa-tests/TKG/output_17406419738799/hotspot_custom_0/work/classes/runtime/DefineClass/NullClassBytesTest.d:/home/jenkins/workspace/Test_openjdk17_hs_sanity.openjdk_ppc64_aix_rerun/aqa-tests/TKG/output_17406419738799/hotspot_custom_0/work/classes/test/lib \
[2025-02-27T07:39:52.645Z] -J-Dtest.class.path.prefix=/home/jenkins/workspace/Test_openjdk17_hs_sanity.openjdk_ppc64_aix_rerun/aqa-tests/TKG/output_17406419738799/hotspot_custom_0/work/classes/runtime/DefineClass/NullClassBytesTest.d:/home/jenkins/workspace/Test_openjdk17_hs_sanity.openjdk_ppc64_aix_rerun/aqa-tests/openjdk/openjdk-jdk/test/hotspot/jtreg/runtime/DefineClass:/home/jenkins/workspace/Test_openjdk17_hs_sanity.openjdk_ppc64_aix_rerun/aqa-tests/TKG/output_17406419738799/hotspot_custom_0/work/classes/test/lib \
[2025-02-27T07:39:52.645Z] -J-Dtest.modules=java.base/jdk.internal.misc \
[2025-02-27T07:39:52.645Z] --add-modules java.base \
[2025-02-27T07:39:52.645Z] --add-exports java.base/jdk.internal.misc=ALL-UNNAMED \
[2025-02-27T07:39:52.645Z] -d /home/jenkins/workspace/Test_openjdk17_hs_sanity.openjdk_ppc64_aix_rerun/aqa-tests/TKG/output_17406419738799/hotspot_custom_0/work/classes/runtime/DefineClass/NullClassBytesTest.d \
[2025-02-27T07:39:52.645Z] -sourcepath /home/jenkins/workspace/Test_openjdk17_hs_sanity.openjdk_ppc64_aix_rerun/aqa-tests/openjdk/openjdk-jdk/test/hotspot/jtreg/runtime/DefineClass:/home/jenkins/workspace/Test_openjdk17_hs_sanity.openjdk_ppc64_aix_rerun/aqa-tests/openjdk/openjdk-jdk/test/lib \
[2025-02-27T07:39:52.645Z] -classpath /home/jenkins/workspace/Test_openjdk17_hs_sanity.openjdk_ppc64_aix_rerun/aqa-tests/openjdk/openjdk-jdk/test/hotspot/jtreg/runtime/DefineClass:/home/jenkins/workspace/Test_openjdk17_hs_sanity.openjdk_ppc64_aix_rerun/aqa-tests/TKG/output_17406419738799/hotspot_custom_0/work/classes/runtime/DefineClass/NullClassBytesTest.d:/home/jenkins/workspace/Test_openjdk17_hs_sanity.openjdk_ppc64_aix_rerun/aqa-tests/TKG/output_17406419738799/hotspot_custom_0/work/classes/test/lib /home/jenkins/workspace/Test_openjdk17_hs_sanity.openjdk_ppc64_aix_rerun/aqa-tests/openjdk/openjdk-jdk/test/hotspot/jtreg/runtime/DefineClass/NullClassBytesTest.java
[2025-02-27T07:39:52.645Z]
[2025-02-27T07:39:52.645Z] ACTION: main -- Failed. Execution failed: `main' threw exception: java.lang.OutOfMemoryError
[2025-02-27T07:39:52.645Z] REASON: User specified action: run main/native NullClassBytesTest
[2025-02-27T07:39:52.645Z] TIME: 0.963 seconds
[2025-02-27T07:39:52.645Z] messages:
[2025-02-27T07:39:52.645Z] command: main NullClassBytesTest
[2025-02-27T07:39:52.645Z] reason: User specified action: run main/native NullClassBytesTest
[2025-02-27T07:39:52.645Z] started: Thu Feb 27 07:39:50 UTC 2025
[2025-02-27T07:39:52.645Z] Mode: agentvm
[2025-02-27T07:39:52.645Z] Agent id: 2
[2025-02-27T07:39:52.645Z] Additional exports to unnamed modules from @modules: java.base/jdk.internal.misc
[2025-02-27T07:39:52.645Z] finished: Thu Feb 27 07:39:51 UTC 2025
[2025-02-27T07:39:52.645Z] elapsed time (seconds): 0.963
[2025-02-27T07:39:52.645Z] configuration:
[2025-02-27T07:39:52.645Z] Boot Layer
[2025-02-27T07:39:52.645Z] class path: /home/jenkins/workspace/Test_openjdk17_hs_sanity.openjdk_ppc64_aix_rerun/jvmtest/openjdk/jtreg/lib/javatest.jar
[2025-02-27T07:39:52.645Z] /home/jenkins/workspace/Test_openjdk17_hs_sanity.openjdk_ppc64_aix_rerun/jvmtest/openjdk/jtreg/lib/jtreg.jar
[2025-02-27T07:39:52.645Z] /home/jenkins/workspace/Test_openjdk17_hs_sanity.openjdk_ppc64_aix_rerun/jvmtest/openjdk/jtreg/lib/junit-platform-console-standalone-1.9.2.jar
[2025-02-27T07:39:52.645Z] /home/jenkins/workspace/Test_openjdk17_hs_sanity.openjdk_ppc64_aix_rerun/jvmtest/openjdk/jtreg/lib/testng-7.3.0.jar
[2025-02-27T07:39:52.645Z] /home/jenkins/workspace/Test_openjdk17_hs_sanity.openjdk_ppc64_aix_rerun/jvmtest/openjdk/jtreg/lib/guice-5.1.0.jar
[2025-02-27T07:39:52.645Z] /home/jenkins/workspace/Test_openjdk17_hs_sanity.openjdk_ppc64_aix_rerun/jvmtest/openjdk/jtreg/lib/jcommander-1.82.jar
[2025-02-27T07:39:52.645Z] patch: java.base /home/jenkins/workspace/Test_openjdk17_hs_sanity.openjdk_ppc64_aix_rerun/aqa-tests/TKG/output_17406419738799/hotspot_custom_0/work/patches/java.base
[2025-02-27T07:39:52.645Z]
[2025-02-27T07:39:52.645Z] Test Layer
[2025-02-27T07:39:52.645Z] add exports: java.base/jdk.internal.misc ALL-UNNAMED
[2025-02-27T07:39:52.646Z] class path: /home/jenkins/workspace/Test_openjdk17_hs_sanity.openjdk_ppc64_aix_rerun/aqa-tests/TKG/output_17406419738799/hotspot_custom_0/work/classes/runtime/DefineClass/NullClassBytesTest.d
[2025-02-27T07:39:52.646Z] /home/jenkins/workspace/Test_openjdk17_hs_sanity.openjdk_ppc64_aix_rerun/aqa-tests/openjdk/openjdk-jdk/test/hotspot/jtreg/runtime/DefineClass
[2025-02-27T07:39:52.646Z] /home/jenkins/workspace/Test_openjdk17_hs_sanity.openjdk_ppc64_aix_rerun/aqa-tests/TKG/output_17406419738799/hotspot_custom_0/work/classes/test/lib
[2025-02-27T07:39:52.646Z] /home/jenkins/workspace/Test_openjdk17_hs_sanity.openjdk_ppc64_aix_rerun/aqa-tests/openjdk/openjdk-jdk/test/lib
[2025-02-27T07:39:52.646Z]
[2025-02-27T07:39:52.646Z] rerun:
[2025-02-27T07:39:52.646Z] cd /home/jenkins/workspace/Test_openjdk17_hs_sanity.openjdk_ppc64_aix_rerun/aqa-tests/TKG/output_17406419738799/hotspot_custom_0/work/scratch && \
[2025-02-27T07:39:52.646Z] DISPLAY=unix:0 \
[2025-02-27T07:39:52.646Z] HOME=/home/jenkins \
[2025-02-27T07:39:52.646Z] LANG=en_US \
[2025-02-27T07:39:52.646Z] PATH=/bin:/usr/bin:/usr/sbin \
[2025-02-27T07:39:52.646Z] TZ=Etc/UTC \
[2025-02-27T07:39:52.646Z] /home/jenkins/workspace/Test_openjdk17_hs_sanity.openjdk_ppc64_aix_rerun/jdkbinary/j2sdk-image/bin/java \
[2025-02-27T07:39:52.646Z] -Dtest.vm.opts='-ea -esa -Xmx512m -XX:+UseCompressedOops' \
[2025-02-27T07:39:52.646Z] -Dtest.tool.vm.opts='-J-ea -J-esa -J-Xmx512m -J-XX:+UseCompressedOops' \
[2025-02-27T07:39:52.646Z] -Dtest.compiler.opts= \
[2025-02-27T07:39:52.646Z] -Dtest.java.opts= \
[2025-02-27T07:39:52.646Z] -Dtest.jdk=/home/jenkins/workspace/Test_openjdk17_hs_sanity.openjdk_ppc64_aix_rerun/jdkbinary/j2sdk-image \
[2025-02-27T07:39:52.646Z] -Dcompile.jdk=/home/jenkins/workspace/Test_openjdk17_hs_sanity.openjdk_ppc64_aix_rerun/jdkbinary/j2sdk-image \
[2025-02-27T07:39:52.646Z] -Dtest.timeout.factor=8.0 \
[2025-02-27T07:39:52.646Z] -Dtest.nativepath=/home/jenkins/workspace/Test_openjdk17_hs_sanity.openjdk_ppc64_aix_rerun/jdkbinary/openjdk-test-image/hotspot/jtreg/native \
[2025-02-27T07:39:52.646Z] -Dtest.root=/home/jenkins/workspace/Test_openjdk17_hs_sanity.openjdk_ppc64_aix_rerun/aqa-tests/openjdk/openjdk-jdk/test/hotspot/jtreg \
[2025-02-27T07:39:52.646Z] -Dtest.name=runtime/DefineClass/NullClassBytesTest.java \
[2025-02-27T07:39:52.646Z] -Dtest.file=/home/jenkins/workspace/Test_openjdk17_hs_sanity.openjdk_ppc64_aix_rerun/aqa-tests/openjdk/openjdk-jdk/test/hotspot/jtreg/runtime/DefineClass/NullClassBytesTest.java \
[2025-02-27T07:39:52.646Z] -Dtest.src=/home/jenkins/workspace/Test_openjdk17_hs_sanity.openjdk_ppc64_aix_rerun/aqa-tests/openjdk/openjdk-jdk/test/hotspot/jtreg/runtime/DefineClass \
[2025-02-27T07:39:52.646Z] -Dtest.src.path=/home/jenkins/workspace/Test_openjdk17_hs_sanity.openjdk_ppc64_aix_rerun/aqa-tests/openjdk/openjdk-jdk/test/hotspot/jtreg/runtime/DefineClass:/home/jenkins/workspace/Test_openjdk17_hs_sanity.openjdk_ppc64_aix_rerun/aqa-tests/openjdk/openjdk-jdk/test/lib \
[2025-02-27T07:39:52.646Z] -Dtest.classes=/home/jenkins/workspace/Test_openjdk17_hs_sanity.openjdk_ppc64_aix_rerun/aqa-tests/TKG/output_17406419738799/hotspot_custom_0/work/classes/runtime/DefineClass/NullClassBytesTest.d \
[2025-02-27T07:39:52.646Z] -Dtest.class.path=/home/jenkins/workspace/Test_openjdk17_hs_sanity.openjdk_ppc64_aix_rerun/aqa-tests/TKG/output_17406419738799/hotspot_custom_0/work/classes/runtime/DefineClass/NullClassBytesTest.d:/home/jenkins/workspace/Test_openjdk17_hs_sanity.openjdk_ppc64_aix_rerun/aqa-tests/TKG/output_17406419738799/hotspot_custom_0/work/classes/test/lib \
[2025-02-27T07:39:52.646Z] -Dtest.class.path.prefix=/home/jenkins/workspace/Test_openjdk17_hs_sanity.openjdk_ppc64_aix_rerun/aqa-tests/TKG/output_17406419738799/hotspot_custom_0/work/classes/runtime/DefineClass/NullClassBytesTest.d:/home/jenkins/workspace/Test_openjdk17_hs_sanity.openjdk_ppc64_aix_rerun/aqa-tests/openjdk/openjdk-jdk/test/hotspot/jtreg/runtime/DefineClass:/home/jenkins/workspace/Test_openjdk17_hs_sanity.openjdk_ppc64_aix_rerun/aqa-tests/TKG/output_17406419738799/hotspot_custom_0/work/classes/test/lib \
[2025-02-27T07:39:52.646Z] -Dtest.modules=java.base/jdk.internal.misc \
[2025-02-27T07:39:52.646Z] -classpath /home/jenkins/workspace/Test_openjdk17_hs_sanity.openjdk_ppc64_aix_rerun/aqa-tests/TKG/output_17406419738799/hotspot_custom_0/work/classes/runtime/DefineClass/NullClassBytesTest.d:/home/jenkins/workspace/Test_openjdk17_hs_sanity.openjdk_ppc64_aix_rerun/aqa-tests/openjdk/openjdk-jdk/test/hotspot/jtreg/runtime/DefineClass:/home/jenkins/workspace/Test_openjdk17_hs_sanity.openjdk_ppc64_aix_rerun/aqa-tests/TKG/output_17406419738799/hotspot_custom_0/work/classes/test/lib:/home/jenkins/workspace/Test_openjdk17_hs_sanity.openjdk_ppc64_aix_rerun/aqa-tests/openjdk/openjdk-jdk/test/lib:/home/jenkins/workspace/Test_openjdk17_hs_sanity.openjdk_ppc64_aix_rerun/jvmtest/openjdk/jtreg/lib/javatest.jar:/home/jenkins/workspace/Test_openjdk17_hs_sanity.openjdk_ppc64_aix_rerun/jvmtest/openjdk/jtreg/lib/jtreg.jar \
[2025-02-27T07:39:52.646Z] NullClassBytesTest
[2025-02-27T07:39:52.646Z] stderr:
[2025-02-27T07:39:52.646Z] WARNING: A terminally deprecated method in java.lang.System has been called
[2025-02-27T07:39:52.646Z] WARNING: System::setSecurityManager has been called by com.sun.javatest.regtest.agent.RegressionSecurityManager (file:/home/jenkins/workspace/Test_openjdk17_hs_sanity.openjdk_ppc64_aix_rerun/jvmtest/openjdk/jtreg/lib/jtreg.jar)
[2025-02-27T07:39:52.646Z] WARNING: Please consider reporting this to the maintainers of com.sun.javatest.regtest.agent.RegressionSecurityManager
[2025-02-27T07:39:52.646Z] WARNING: System::setSecurityManager will be removed in a future release
[2025-02-27T07:39:52.646Z] STDOUT:
[2025-02-27T07:39:52.646Z] A called
[2025-02-27T07:39:52.646Z] STDERR:
[2025-02-27T07:39:52.646Z] java.lang.OutOfMemoryError
[2025-02-27T07:39:52.646Z] at java.base/java.lang.ClassLoader.defineClass1(Native Method)
[2025-02-27T07:39:52.646Z] at java.base/java.lang.ClassLoader.defineClass(ClassLoader.java:1017)
[2025-02-27T07:39:52.646Z] at java.base/java.lang.ClassLoader.defineClass(ClassLoader.java:879)
[2025-02-27T07:39:52.646Z] at NullClassBytesTest$SimpleLoader.loadClass(NullClassBytesTest.java:57)
[2025-02-27T07:39:52.646Z] at java.base/java.lang.Class.forName0(Native Method)
[2025-02-27T07:39:52.646Z] at java.base/java.lang.Class.forName(Class.java:467)
[2025-02-27T07:39:52.646Z] at NullClassBytesTest.main(NullClassBytesTest.java:81)
[2025-02-27T07:39:52.646Z] at java.base/jdk.internal.reflect.NativeMethodAccessorImpl.invoke0(Native Method)
[2025-02-27T07:39:52.646Z] at java.base/jdk.internal.reflect.NativeMethodAccessorImpl.invoke(NativeMethodAccessorImpl.java:77)
[2025-02-27T07:39:52.646Z] at java.base/jdk.internal.reflect.DelegatingMethodAccessorImpl.invoke(DelegatingMethodAccessorImpl.java:43)
[2025-02-27T07:39:52.646Z] at java.base/java.lang.reflect.Method.invoke(Method.java:569)
[2025-02-27T07:39:52.646Z] at com.sun.javatest.regtest.agent.MainActionHelper$AgentVMRunnable.run(MainActionHelper.java:333)
[2025-02-27T07:39:52.646Z] at java.base/java.lang.Thread.run(Thread.java:840)
[2025-02-27T07:39:52.646Z]
[2025-02-27T07:39:52.646Z] JavaTest Message: Test threw exception: java.lang.OutOfMemoryError
[2025-02-27T07:39:52.646Z] JavaTest Message: shutting down test
[2025-02-27T07:39:52.646Z]
[2025-02-27T07:39:52.646Z]
[2025-02-27T07:39:52.646Z] TEST RESULT: Failed. Execution failed: `main' threw exception: java.lang.OutOfMemoryError
[2025-02-27T07:39:52.646Z] --------------------------------------------------
[2025-02-27T07:39:54.258Z] TEST: runtime/jni/getCreatedJavaVMs/TestGetCreatedJavaVMs.java
[2025-02-27T07:39:54.258Z] TEST JDK: /home/jenkins/workspace/Test_openjdk17_hs_sanity.openjdk_ppc64_aix_rerun/jdkbinary/j2sdk-image
[2025-02-27T07:39:54.258Z]
[2025-02-27T07:39:54.258Z] ACTION: build -- Passed. Build successful
[2025-02-27T07:39:54.258Z] REASON: Named class compiled on demand
[2025-02-27T07:39:54.258Z] TIME: 0.99 seconds
[2025-02-27T07:39:54.258Z] messages:
[2025-02-27T07:39:54.258Z] command: build TestGetCreatedJavaVMs
[2025-02-27T07:39:54.258Z] reason: Named class compiled on demand
[2025-02-27T07:39:54.258Z] started: Thu Feb 27 07:39:51 UTC 2025
[2025-02-27T07:39:54.258Z] Test directory:
[2025-02-27T07:39:54.258Z] compile: TestGetCreatedJavaVMs
[2025-02-27T07:39:54.258Z] finished: Thu Feb 27 07:39:52 UTC 2025
[2025-02-27T07:39:54.258Z] elapsed time (seconds): 0.99
[2025-02-27T07:39:54.258Z]
[2025-02-27T07:39:54.258Z] ACTION: compile -- Passed. Compilation successful
[2025-02-27T07:39:54.258Z] REASON: .class file out of date or does not exist
[2025-02-27T07:39:54.258Z] TIME: 0.99 seconds
[2025-02-27T07:39:54.258Z] messages:
[2025-02-27T07:39:54.258Z] command: compile /home/jenkins/workspace/Test_openjdk17_hs_sanity.openjdk_ppc64_aix_rerun/aqa-tests/openjdk/openjdk-jdk/test/hotspot/jtreg/runtime/jni/getCreatedJavaVMs/TestGetCreatedJavaVMs.java
[2025-02-27T07:39:54.258Z] reason: .class file out of date or does not exist
[2025-02-27T07:39:54.258Z] started: Thu Feb 27 07:39:51 UTC 2025
[2025-02-27T07:39:54.258Z] Mode: agentvm
[2025-02-27T07:39:54.258Z] Agent id: 1
[2025-02-27T07:39:54.258Z] finished: Thu Feb 27 07:39:52 UTC 2025
[2025-02-27T07:39:54.258Z] elapsed time (seconds): 0.99
[2025-02-27T07:39:54.258Z] configuration:
[2025-02-27T07:39:54.258Z] Boot Layer (javac runtime environment)
[2025-02-27T07:39:54.258Z] class path: /home/jenkins/workspace/Test_openjdk17_hs_sanity.openjdk_ppc64_aix_rerun/jvmtest/openjdk/jtreg/lib/javatest.jar
[2025-02-27T07:39:54.258Z] /home/jenkins/workspace/Test_openjdk17_hs_sanity.openjdk_ppc64_aix_rerun/jvmtest/openjdk/jtreg/lib/jtreg.jar
[2025-02-27T07:39:54.258Z] patch: java.base /home/jenkins/workspace/Test_openjdk17_hs_sanity.openjdk_ppc64_aix_rerun/aqa-tests/TKG/output_17406419738799/hotspot_custom_0/work/patches/java.base
[2025-02-27T07:39:54.258Z]
[2025-02-27T07:39:54.258Z] javac compilation environment
[2025-02-27T07:39:54.258Z] source path: /home/jenkins/workspace/Test_openjdk17_hs_sanity.openjdk_ppc64_aix_rerun/aqa-tests/openjdk/openjdk-jdk/test/hotspot/jtreg/runtime/jni/getCreatedJavaVMs
[2025-02-27T07:39:54.258Z] /home/jenkins/workspace/Test_openjdk17_hs_sanity.openjdk_ppc64_aix_rerun/aqa-tests/openjdk/openjdk-jdk/test/lib
[2025-02-27T07:39:54.258Z] class path: /home/jenkins/workspace/Test_openjdk17_hs_sanity.openjdk_ppc64_aix_rerun/aqa-tests/openjdk/openjdk-jdk/test/hotspot/jtreg/runtime/jni/getCreatedJavaVMs
[2025-02-27T07:39:54.258Z] /home/jenkins/workspace/Test_openjdk17_hs_sanity.openjdk_ppc64_aix_rerun/aqa-tests/TKG/output_17406419738799/hotspot_custom_0/work/classes/runtime/jni/getCreatedJavaVMs/TestGetCreatedJavaVMs.d
[2025-02-27T07:39:54.258Z] /home/jenkins/workspace/Test_openjdk17_hs_sanity.openjdk_ppc64_aix_rerun/aqa-tests/TKG/output_17406419738799/hotspot_custom_0/work/classes/test/lib
[2025-02-27T07:39:54.258Z]
[2025-02-27T07:39:54.258Z] rerun:
[2025-02-27T07:39:54.258Z] cd /home/jenkins/workspace/Test_openjdk17_hs_sanity.openjdk_ppc64_aix_rerun/aqa-tests/TKG/output_17406419738799/hotspot_custom_0/work/scratch && \
[2025-02-27T07:39:54.258Z] DISPLAY=unix:0 \
[2025-02-27T07:39:54.258Z] HOME=/home/jenkins \
[2025-02-27T07:39:54.258Z] LANG=en_US \
[2025-02-27T07:39:54.258Z] PATH=/bin:/usr/bin:/usr/sbin \
[2025-02-27T07:39:54.258Z] TZ=Etc/UTC \
[2025-02-27T07:39:54.258Z] /home/jenkins/workspace/Test_openjdk17_hs_sanity.openjdk_ppc64_aix_rerun/jdkbinary/j2sdk-image/bin/javac \
[2025-02-27T07:39:54.258Z] -J-ea \
[2025-02-27T07:39:54.258Z] -J-esa \
[2025-02-27T07:39:54.258Z] -J-Xmx512m \
[2025-02-27T07:39:54.258Z] -J-XX:+UseCompressedOops \
[2025-02-27T07:39:54.258Z] -J-Dtest.vm.opts='-ea -esa -Xmx512m -XX:+UseCompressedOops' \
[2025-02-27T07:39:54.258Z] -J-Dtest.tool.vm.opts='-J-ea -J-esa -J-Xmx512m -J-XX:+UseCompressedOops' \
[2025-02-27T07:39:54.258Z] -J-Dtest.compiler.opts= \
[2025-02-27T07:39:54.258Z] -J-Dtest.java.opts= \
[2025-02-27T07:39:54.258Z] -J-Dtest.jdk=/home/jenkins/workspace/Test_openjdk17_hs_sanity.openjdk_ppc64_aix_rerun/jdkbinary/j2sdk-image \
[2025-02-27T07:39:54.258Z] -J-Dcompile.jdk=/home/jenkins/workspace/Test_openjdk17_hs_sanity.openjdk_ppc64_aix_rerun/jdkbinary/j2sdk-image \
[2025-02-27T07:39:54.258Z] -J-Dtest.timeout.factor=8.0 \
[2025-02-27T07:39:54.258Z] -J-Dtest.nativepath=/home/jenkins/workspace/Test_openjdk17_hs_sanity.openjdk_ppc64_aix_rerun/jdkbinary/openjdk-test-image/hotspot/jtreg/native \
[2025-02-27T07:39:54.258Z] -J-Dtest.root=/home/jenkins/workspace/Test_openjdk17_hs_sanity.openjdk_ppc64_aix_rerun/aqa-tests/openjdk/openjdk-jdk/test/hotspot/jtreg \
[2025-02-27T07:39:54.258Z] -J-Dtest.name=runtime/jni/getCreatedJavaVMs/TestGetCreatedJavaVMs.java \
[2025-02-27T07:39:54.258Z] -J-Dtest.file=/home/jenkins/workspace/Test_openjdk17_hs_sanity.openjdk_ppc64_aix_rerun/aqa-tests/openjdk/openjdk-jdk/test/hotspot/jtreg/runtime/jni/getCreatedJavaVMs/TestGetCreatedJavaVMs.java \
[2025-02-27T07:39:54.258Z] -J-Dtest.src=/home/jenkins/workspace/Test_openjdk17_hs_sanity.openjdk_ppc64_aix_rerun/aqa-tests/openjdk/openjdk-jdk/test/hotspot/jtreg/runtime/jni/getCreatedJavaVMs \
[2025-02-27T07:39:54.259Z] -J-Dtest.src.path=/home/jenkins/workspace/Test_openjdk17_hs_sanity.openjdk_ppc64_aix_rerun/aqa-tests/openjdk/openjdk-jdk/test/hotspot/jtreg/runtime/jni/getCreatedJavaVMs:/home/jenkins/workspace/Test_openjdk17_hs_sanity.openjdk_ppc64_aix_rerun/aqa-tests/openjdk/openjdk-jdk/test/lib \
[2025-02-27T07:39:54.259Z] -J-Dtest.classes=/home/jenkins/workspace/Test_openjdk17_hs_sanity.openjdk_ppc64_aix_rerun/aqa-tests/TKG/output_17406419738799/hotspot_custom_0/work/classes/runtime/jni/getCreatedJavaVMs/TestGetCreatedJavaVMs.d \
[2025-02-27T07:39:54.259Z] -J-Dtest.class.path=/home/jenkins/workspace/Test_openjdk17_hs_sanity.openjdk_ppc64_aix_rerun/aqa-tests/TKG/output_17406419738799/hotspot_custom_0/work/classes/runtime/jni/getCreatedJavaVMs/TestGetCreatedJavaVMs.d:/home/jenkins/workspace/Test_openjdk17_hs_sanity.openjdk_ppc64_aix_rerun/aqa-tests/TKG/output_17406419738799/hotspot_custom_0/work/classes/test/lib \
[2025-02-27T07:39:54.259Z] -J-Dtest.class.path.prefix=/home/jenkins/workspace/Test_openjdk17_hs_sanity.openjdk_ppc64_aix_rerun/aqa-tests/TKG/output_17406419738799/hotspot_custom_0/work/classes/runtime/jni/getCreatedJavaVMs/TestGetCreatedJavaVMs.d:/home/jenkins/workspace/Test_openjdk17_hs_sanity.openjdk_ppc64_aix_rerun/aqa-tests/openjdk/openjdk-jdk/test/hotspot/jtreg/runtime/jni/getCreatedJavaVMs:/home/jenkins/workspace/Test_openjdk17_hs_sanity.openjdk_ppc64_aix_rerun/aqa-tests/TKG/output_17406419738799/hotspot_custom_0/work/classes/test/lib \
[2025-02-27T07:39:54.259Z] -d /home/jenkins/workspace/Test_openjdk17_hs_sanity.openjdk_ppc64_aix_rerun/aqa-tests/TKG/output_17406419738799/hotspot_custom_0/work/classes/runtime/jni/getCreatedJavaVMs/TestGetCreatedJavaVMs.d \
[2025-02-27T07:39:54.259Z] -sourcepath /home/jenkins/workspace/Test_openjdk17_hs_sanity.openjdk_ppc64_aix_rerun/aqa-tests/openjdk/openjdk-jdk/test/hotspot/jtreg/runtime/jni/getCreatedJavaVMs:/home/jenkins/workspace/Test_openjdk17_hs_sanity.openjdk_ppc64_aix_rerun/aqa-tests/openjdk/openjdk-jdk/test/lib \
[2025-02-27T07:39:54.259Z] -classpath /home/jenkins/workspace/Test_openjdk17_hs_sanity.openjdk_ppc64_aix_rerun/aqa-tests/openjdk/openjdk-jdk/test/hotspot/jtreg/runtime/jni/getCreatedJavaVMs:/home/jenkins/workspace/Test_openjdk17_hs_sanity.openjdk_ppc64_aix_rerun/aqa-tests/TKG/output_17406419738799/hotspot_custom_0/work/classes/runtime/jni/getCreatedJavaVMs/TestGetCreatedJavaVMs.d:/home/jenkins/workspace/Test_openjdk17_hs_sanity.openjdk_ppc64_aix_rerun/aqa-tests/TKG/output_17406419738799/hotspot_custom_0/work/classes/test/lib /home/jenkins/workspace/Test_openjdk17_hs_sanity.openjdk_ppc64_aix_rerun/aqa-tests/openjdk/openjdk-jdk/test/hotspot/jtreg/runtime/jni/getCreatedJavaVMs/TestGetCreatedJavaVMs.java
[2025-02-27T07:39:54.259Z]
[2025-02-27T07:39:54.259Z] ACTION: driver -- Failed. Execution failed: `main' threw exception: java.lang.RuntimeException: Expected to get exit value of [0]
[2025-02-27T07:39:54.259Z] REASON: User specified action: run driver TestGetCreatedJavaVMs
[2025-02-27T07:39:54.259Z] TIME: 1.024 seconds
[2025-02-27T07:39:54.259Z] messages:
[2025-02-27T07:39:54.259Z] command: driver TestGetCreatedJavaVMs
[2025-02-27T07:39:54.259Z] reason: User specified action: run driver TestGetCreatedJavaVMs
[2025-02-27T07:39:54.259Z] started: Thu Feb 27 07:39:52 UTC 2025
[2025-02-27T07:39:54.259Z] Mode: agentvm
[2025-02-27T07:39:54.259Z] Agent id: 3
[2025-02-27T07:39:54.259Z] finished: Thu Feb 27 07:39:53 UTC 2025
[2025-02-27T07:39:54.259Z] elapsed time (seconds): 1.024
[2025-02-27T07:39:54.259Z] configuration:
[2025-02-27T07:39:54.259Z] Boot Layer
[2025-02-27T07:39:54.259Z] class path: /home/jenkins/workspace/Test_openjdk17_hs_sanity.openjdk_ppc64_aix_rerun/jvmtest/openjdk/jtreg/lib/javatest.jar
[2025-02-27T07:39:54.259Z] /home/jenkins/workspace/Test_openjdk17_hs_sanity.openjdk_ppc64_aix_rerun/jvmtest/openjdk/jtreg/lib/jtreg.jar
[2025-02-27T07:39:54.259Z] /home/jenkins/workspace/Test_openjdk17_hs_sanity.openjdk_ppc64_aix_rerun/jvmtest/openjdk/jtreg/lib/junit-platform-console-standalone-1.9.2.jar
[2025-02-27T07:39:54.259Z] /home/jenkins/workspace/Test_openjdk17_hs_sanity.openjdk_ppc64_aix_rerun/jvmtest/openjdk/jtreg/lib/testng-7.3.0.jar
[2025-02-27T07:39:54.259Z] /home/jenkins/workspace/Test_openjdk17_hs_sanity.openjdk_ppc64_aix_rerun/jvmtest/openjdk/jtreg/lib/guice-5.1.0.jar
[2025-02-27T07:39:54.259Z] /home/jenkins/workspace/Test_openjdk17_hs_sanity.openjdk_ppc64_aix_rerun/jvmtest/openjdk/jtreg/lib/jcommander-1.82.jar
[2025-02-27T07:39:54.259Z] patch: java.base /home/jenkins/workspace/Test_openjdk17_hs_sanity.openjdk_ppc64_aix_rerun/aqa-tests/TKG/output_17406419738799/hotspot_custom_0/work/patches/java.base
[2025-02-27T07:39:54.259Z]
[2025-02-27T07:39:54.259Z] Test Layer
[2025-02-27T07:39:54.259Z] class path: /home/jenkins/workspace/Test_openjdk17_hs_sanity.openjdk_ppc64_aix_rerun/aqa-tests/TKG/output_17406419738799/hotspot_custom_0/work/classes/runtime/jni/getCreatedJavaVMs/TestGetCreatedJavaVMs.d
[2025-02-27T07:39:54.259Z] /home/jenkins/workspace/Test_openjdk17_hs_sanity.openjdk_ppc64_aix_rerun/aqa-tests/openjdk/openjdk-jdk/test/hotspot/jtreg/runtime/jni/getCreatedJavaVMs
[2025-02-27T07:39:54.259Z] /home/jenkins/workspace/Test_openjdk17_hs_sanity.openjdk_ppc64_aix_rerun/aqa-tests/TKG/output_17406419738799/hotspot_custom_0/work/classes/test/lib
[2025-02-27T07:39:54.259Z] /home/jenkins/workspace/Test_openjdk17_hs_sanity.openjdk_ppc64_aix_rerun/aqa-tests/openjdk/openjdk-jdk/test/lib
[2025-02-27T07:39:54.259Z]
[2025-02-27T07:39:54.259Z] rerun:
[2025-02-27T07:39:54.259Z] cd /home/jenkins/workspace/Test_openjdk17_hs_sanity.openjdk_ppc64_aix_rerun/aqa-tests/TKG/output_17406419738799/hotspot_custom_0/work/scratch && \
[2025-02-27T07:39:54.259Z] DISPLAY=unix:0 \
[2025-02-27T07:39:54.259Z] HOME=/home/jenkins \
[2025-02-27T07:39:54.259Z] LANG=en_US \
[2025-02-27T07:39:54.259Z] PATH=/bin:/usr/bin:/usr/sbin \
[2025-02-27T07:39:54.259Z] TZ=Etc/UTC \
[2025-02-27T07:39:54.259Z] /home/jenkins/workspace/Test_openjdk17_hs_sanity.openjdk_ppc64_aix_rerun/jdkbinary/j2sdk-image/bin/java \
[2025-02-27T07:39:54.259Z] -Dtest.vm.opts='-ea -esa -Xmx512m -XX:+UseCompressedOops' \
[2025-02-27T07:39:54.259Z] -Dtest.tool.vm.opts='-J-ea -J-esa -J-Xmx512m -J-XX:+UseCompressedOops' \
[2025-02-27T07:39:54.259Z] -Dtest.compiler.opts= \
[2025-02-27T07:39:54.259Z] -Dtest.java.opts= \
[2025-02-27T07:39:54.260Z] -Dtest.jdk=/home/jenkins/workspace/Test_openjdk17_hs_sanity.openjdk_ppc64_aix_rerun/jdkbinary/j2sdk-image \
[2025-02-27T07:39:54.260Z] -Dcompile.jdk=/home/jenkins/workspace/Test_openjdk17_hs_sanity.openjdk_ppc64_aix_rerun/jdkbinary/j2sdk-image \
[2025-02-27T07:39:54.260Z] -Dtest.timeout.factor=8.0 \
[2025-02-27T07:39:54.260Z] -Dtest.nativepath=/home/jenkins/workspace/Test_openjdk17_hs_sanity.openjdk_ppc64_aix_rerun/jdkbinary/openjdk-test-image/hotspot/jtreg/native \
[2025-02-27T07:39:54.260Z] -Dtest.root=/home/jenkins/workspace/Test_openjdk17_hs_sanity.openjdk_ppc64_aix_rerun/aqa-tests/openjdk/openjdk-jdk/test/hotspot/jtreg \
[2025-02-27T07:39:54.260Z] -Dtest.name=runtime/jni/getCreatedJavaVMs/TestGetCreatedJavaVMs.java \
[2025-02-27T07:39:54.260Z] -Dtest.file=/home/jenkins/workspace/Test_openjdk17_hs_sanity.openjdk_ppc64_aix_rerun/aqa-tests/openjdk/openjdk-jdk/test/hotspot/jtreg/runtime/jni/getCreatedJavaVMs/TestGetCreatedJavaVMs.java \
[2025-02-27T07:39:54.260Z] -Dtest.src=/home/jenkins/workspace/Test_openjdk17_hs_sanity.openjdk_ppc64_aix_rerun/aqa-tests/openjdk/openjdk-jdk/test/hotspot/jtreg/runtime/jni/getCreatedJavaVMs \
[2025-02-27T07:39:54.260Z] -Dtest.src.path=/home/jenkins/workspace/Test_openjdk17_hs_sanity.openjdk_ppc64_aix_rerun/aqa-tests/openjdk/openjdk-jdk/test/hotspot/jtreg/runtime/jni/getCreatedJavaVMs:/home/jenkins/workspace/Test_openjdk17_hs_sanity.openjdk_ppc64_aix_rerun/aqa-tests/openjdk/openjdk-jdk/test/lib \
[2025-02-27T07:39:54.260Z] -Dtest.classes=/home/jenkins/workspace/Test_openjdk17_hs_sanity.openjdk_ppc64_aix_rerun/aqa-tests/TKG/output_17406419738799/hotspot_custom_0/work/classes/runtime/jni/getCreatedJavaVMs/TestGetCreatedJavaVMs.d \
[2025-02-27T07:39:54.260Z] -Dtest.class.path=/home/jenkins/workspace/Test_openjdk17_hs_sanity.openjdk_ppc64_aix_rerun/aqa-tests/TKG/output_17406419738799/hotspot_custom_0/work/classes/runtime/jni/getCreatedJavaVMs/TestGetCreatedJavaVMs.d:/home/jenkins/workspace/Test_openjdk17_hs_sanity.openjdk_ppc64_aix_rerun/aqa-tests/TKG/output_17406419738799/hotspot_custom_0/work/classes/test/lib \
[2025-02-27T07:39:54.260Z] -Dtest.class.path.prefix=/home/jenkins/workspace/Test_openjdk17_hs_sanity.openjdk_ppc64_aix_rerun/aqa-tests/TKG/output_17406419738799/hotspot_custom_0/work/classes/runtime/jni/getCreatedJavaVMs/TestGetCreatedJavaVMs.d:/home/jenkins/workspace/Test_openjdk17_hs_sanity.openjdk_ppc64_aix_rerun/aqa-tests/openjdk/openjdk-jdk/test/hotspot/jtreg/runtime/jni/getCreatedJavaVMs:/home/jenkins/workspace/Test_openjdk17_hs_sanity.openjdk_ppc64_aix_rerun/aqa-tests/TKG/output_17406419738799/hotspot_custom_0/work/classes/test/lib \
[2025-02-27T07:39:54.260Z] -classpath /home/jenkins/workspace/Test_openjdk17_hs_sanity.openjdk_ppc64_aix_rerun/aqa-tests/TKG/output_17406419738799/hotspot_custom_0/work/classes/runtime/jni/getCreatedJavaVMs/TestGetCreatedJavaVMs.d:/home/jenkins/workspace/Test_openjdk17_hs_sanity.openjdk_ppc64_aix_rerun/aqa-tests/openjdk/openjdk-jdk/test/hotspot/jtreg/runtime/jni/getCreatedJavaVMs:/home/jenkins/workspace/Test_openjdk17_hs_sanity.openjdk_ppc64_aix_rerun/aqa-tests/TKG/output_17406419738799/hotspot_custom_0/work/classes/test/lib:/home/jenkins/workspace/Test_openjdk17_hs_sanity.openjdk_ppc64_aix_rerun/aqa-tests/openjdk/openjdk-jdk/test/lib:/home/jenkins/workspace/Test_openjdk17_hs_sanity.openjdk_ppc64_aix_rerun/jvmtest/openjdk/jtreg/lib/javatest.jar:/home/jenkins/workspace/Test_openjdk17_hs_sanity.openjdk_ppc64_aix_rerun/jvmtest/openjdk/jtreg/lib/jtreg.jar \
[2025-02-27T07:39:54.260Z] TestGetCreatedJavaVMs
[2025-02-27T07:39:54.260Z] stderr:
[2025-02-27T07:39:54.260Z] WARNING: A terminally deprecated method in java.lang.System has been called
[2025-02-27T07:39:54.260Z] WARNING: System::setSecurityManager has been called by com.sun.javatest.regtest.agent.RegressionSecurityManager (file:/home/jenkins/workspace/Test_openjdk17_hs_sanity.openjdk_ppc64_aix_rerun/jvmtest/openjdk/jtreg/lib/jtreg.jar)
[2025-02-27T07:39:54.260Z] WARNING: Please consider reporting this to the maintainers of com.sun.javatest.regtest.agent.RegressionSecurityManager
[2025-02-27T07:39:54.260Z] WARNING: System::setSecurityManager will be removed in a future release
[2025-02-27T07:39:54.260Z] STDOUT:
[2025-02-27T07:39:54.260Z] [2025-02-27T07:39:53.293650Z] Gathering output for process 10289496
[2025-02-27T07:39:54.260Z] [2025-02-27T07:39:53.417037Z] Waiting for completion for process 10289496
[2025-02-27T07:39:54.260Z] [2025-02-27T07:39:53.417501Z] Waiting for completion finished for process 10289496
[2025-02-27T07:39:54.260Z] Output and diagnostic info for process 10289496 was saved into 'pid-10289496-output.log'
[2025-02-27T07:39:54.260Z] STDERR:
[2025-02-27T07:39:54.260Z] stdout: [Error occurred during initialization of VM
[2025-02-27T07:39:54.260Z] java.lang.StackOverflowError
[2025-02-27T07:39:54.260Z] at java.lang.String.<clinit>(java.base/String.java:224)
[2025-02-27T07:39:54.260Z]
[2025-02-27T07:39:54.260Z] [*] Creating thread 0
[2025-02-27T07:39:54.260Z] [*] Creating thread 1
[2025-02-27T07:39:54.260Z] [0] BEGIN JNI_CreateJavaVM
[2025-02-27T07:39:54.260Z] [1] BEGIN JNI_CreateJavaVM
[2025-02-27T07:39:54.260Z] [1] END JNI_CreateJavaVM
[2025-02-27T07:39:54.260Z] [1] Error creating JVM: -5
[2025-02-27T07:39:54.260Z] [1] BEGIN JNI_GetCreatedJavaVMs
[2025-02-27T07:39:54.260Z] [1] END JNI_GetCreatedJavaVMs
[2025-02-27T07:39:54.260Z] [1] Obtained 0 created VMs
[2025-02-27T07:39:54.260Z] ];
[2025-02-27T07:39:54.260Z] stderr: []
[2025-02-27T07:39:54.260Z] exitValue = 1
[2025-02-27T07:39:54.260Z]
[2025-02-27T07:39:54.260Z] java.lang.RuntimeException: Expected to get exit value of [0]
[2025-02-27T07:39:54.260Z]
[2025-02-27T07:39:54.260Z] at jdk.test.lib.process.OutputAnalyzer.shouldHaveExitValue(OutputAnalyzer.java:489)
[2025-02-27T07:39:54.260Z] at TestGetCreatedJavaVMs.main(TestGetCreatedJavaVMs.java:39)
[2025-02-27T07:39:54.260Z] at java.base/jdk.internal.reflect.NativeMethodAccessorImpl.invoke0(Native Method)
[2025-02-27T07:39:54.260Z] at java.base/jdk.internal.reflect.NativeMethodAccessorImpl.invoke(NativeMethodAccessorImpl.java:77)
[2025-02-27T07:39:54.260Z] at java.base/jdk.internal.reflect.DelegatingMethodAccessorImpl.invoke(DelegatingMethodAccessorImpl.java:43)
[2025-02-27T07:39:54.260Z] at java.base/java.lang.reflect.Method.invoke(Method.java:569)
[2025-02-27T07:39:54.260Z] at com.sun.javatest.regtest.agent.MainActionHelper$AgentVMRunnable.run(MainActionHelper.java:333)
[2025-02-27T07:39:54.260Z] at java.base/java.lang.Thread.run(Thread.java:840)
[2025-02-27T07:39:54.260Z]
[2025-02-27T07:39:54.260Z] JavaTest Message: Test threw exception: java.lang.RuntimeException
[2025-02-27T07:39:54.260Z] JavaTest Message: shutting down test
[2025-02-27T07:39:54.260Z]
[2025-02-27T07:39:54.260Z]
[2025-02-27T07:39:54.260Z] TEST RESULT: Failed. Execution failed: `main' threw exception: java.lang.RuntimeException: Expected to get exit value of [0]
[2025-02-27T07:39:54.260Z] --------------------------------------------------
[2025-02-27T07:39:54.260Z] Test results: passed: 1; failed: 2
[2025-02-27T07:40:08.120Z] Report written to /home/jenkins/workspace/Test_openjdk17_hs_sanity.openjdk_ppc64_aix_rerun/aqa-tests/TKG/output_17406419738799/hotspot_custom_0/report/html/report.html
[2025-02-27T07:40:08.120Z] Results written to /home/jenkins/workspace/Test_openjdk17_hs_sanity.openjdk_ppc64_aix_rerun/aqa-tests/TKG/output_17406419738799/hotspot_custom_0/work
[2025-02-27T07:40:08.120Z] Error: Some tests failed or other problems occurred.
[2025-02-27T07:40:08.120Z] -----------------------------------
[2025-02-27T07:40:08.120Z] hotspot_custom_0_FAILED
[2025-02-27T07:40:08.120Z] -----------------------------------
[2025-02-27T07:40:08.120Z]
[2025-02-27T07:40:08.120Z] TEST TEARDOWN:
[2025-02-27T07:40:08.120Z] Nothing to be done for teardown.
[2025-02-27T07:40:08.120Z] hotspot_custom_0 Finish Time: Thu Feb 27 07:40:07 2025 Epoch Time (ms): 1740642007900