jdk_jfr_1
[2025-02-27T15:52:33.136Z] Running test jdk_jfr_1 ...
[2025-02-27T15:52:33.136Z] ===============================================
[2025-02-27T15:52:33.136Z] jdk_jfr_1 Start Time: Thu Feb 27 15:52:32 2025 Epoch Time (ms): 1740671552222
[2025-02-27T15:52:33.136Z] variation: Mode650
[2025-02-27T15:52:33.136Z] JVM_OPTIONS: -XX:-UseCompressedOops
[2025-02-27T15:52:33.136Z] { \
[2025-02-27T15:52:33.136Z] echo ""; echo "TEST SETUP:"; \
[2025-02-27T15:52:33.136Z] echo "Nothing to be done for setup."; \
[2025-02-27T15:52:33.136Z] mkdir -p "/home/jenkins/workspace/Test_openjdk17_hs_extended.openjdk_x86-64_alpine-linux_testList_3/aqa-tests/TKG/../TKG/output_17406674401554/jdk_jfr_1"; \
[2025-02-27T15:52:33.136Z] cd "/home/jenkins/workspace/Test_openjdk17_hs_extended.openjdk_x86-64_alpine-linux_testList_3/aqa-tests/TKG/../TKG/output_17406674401554/jdk_jfr_1"; \
[2025-02-27T15:52:33.136Z] echo ""; echo "TESTING:"; \
[2025-02-27T15:52:33.136Z] "/home/jenkins/workspace/Test_openjdk17_hs_extended.openjdk_x86-64_alpine-linux_testList_3/jdkbinary/j2sdk-image/bin/java" -Xmx512m -jar "/home/jenkins/workspace/Test_openjdk17_hs_extended.openjdk_x86-64_alpine-linux_testList_3/aqa-tests/TKG/../../jvmtest/openjdk/jtreg/lib/jtreg.jar" \
[2025-02-27T15:52:33.136Z] -agentvm -a -ea -esa -v:fail,error,time,nopass -retain:fail,error,*.dmp,javacore.*,heapdump.*,*.trc -ignore:quiet -timeoutFactor:8 -xml:verify -k:'!headful' -concurrency:3 -nativepath:"/home/jenkins/workspace/Test_openjdk17_hs_extended.openjdk_x86-64_alpine-linux_testList_3/jdkbinary/openjdk-test-image/jdk/jtreg/native" -vmoptions:"-Xmx768m -XX:-UseCompressedOops -Djava.awt.headless=true" \
[2025-02-27T15:52:33.136Z] -w ""/home/jenkins/workspace/Test_openjdk17_hs_extended.openjdk_x86-64_alpine-linux_testList_3/aqa-tests/TKG/../TKG/output_17406674401554/jdk_jfr_1"/work" \
[2025-02-27T15:52:33.136Z] -r ""/home/jenkins/workspace/Test_openjdk17_hs_extended.openjdk_x86-64_alpine-linux_testList_3/aqa-tests/TKG/../TKG/output_17406674401554/jdk_jfr_1"/report" \
[2025-02-27T15:52:33.136Z] -jdk:"/home/jenkins/workspace/Test_openjdk17_hs_extended.openjdk_x86-64_alpine-linux_testList_3/jdkbinary/j2sdk-image" \
[2025-02-27T15:52:33.136Z] -exclude:"/home/jenkins/workspace/Test_openjdk17_hs_extended.openjdk_x86-64_alpine-linux_testList_3/aqa-tests/TKG/../openjdk/openjdk-jdk/test/jdk/ProblemList.txt" \
[2025-02-27T15:52:33.136Z] -exclude:"/home/jenkins/workspace/Test_openjdk17_hs_extended.openjdk_x86-64_alpine-linux_testList_3/aqa-tests/TKG/../../jvmtest/openjdk/excludes/ProblemList_openjdk17.txt" \
[2025-02-27T15:52:33.136Z] \
[2025-02-27T15:52:33.136Z] -exclude:"/home/jenkins/workspace/Test_openjdk17_hs_extended.openjdk_x86-64_alpine-linux_testList_3/aqa-tests/TKG/../openjdk/excludes/vendors/eclipse/ProblemList_openjdk17.txt" \
[2025-02-27T15:52:33.136Z] "/home/jenkins/workspace/Test_openjdk17_hs_extended.openjdk_x86-64_alpine-linux_testList_3/aqa-tests/TKG/../openjdk/openjdk-jdk/test/jdk:jdk_jfr"; \
[2025-02-27T15:52:33.136Z] if [ $? -eq 0 ]; then echo "-----------------------------------"; echo "jdk_jfr_1""_PASSED"; echo "-----------------------------------"; cd /home/jenkins/workspace/Test_openjdk17_hs_extended.openjdk_x86-64_alpine-linux_testList_3/aqa-tests/TKG/..; else echo "-----------------------------------"; echo "jdk_jfr_1""_FAILED"; echo "-----------------------------------"; fi; \
[2025-02-27T15:52:33.136Z] echo ""; echo "TEST TEARDOWN:"; \
[2025-02-27T15:52:33.136Z] echo "Nothing to be done for teardown."; \
[2025-02-27T15:52:33.136Z] } 2>&1 | tee -a "/home/jenkins/workspace/Test_openjdk17_hs_extended.openjdk_x86-64_alpine-linux_testList_3/aqa-tests/TKG/../TKG/output_17406674401554/TestTargetResult";
[2025-02-27T15:52:33.136Z]
[2025-02-27T15:52:33.136Z] TEST SETUP:
[2025-02-27T15:52:33.136Z] Nothing to be done for setup.
[2025-02-27T15:52:33.136Z]
[2025-02-27T15:52:33.136Z] TESTING:
[2025-02-27T15:52:33.136Z] Directory "/home/jenkins/workspace/Test_openjdk17_hs_extended.openjdk_x86-64_alpine-linux_testList_3/aqa-tests/TKG/../TKG/output_17406674401554/jdk_jfr_1/work" not found: creating
[2025-02-27T15:52:33.136Z] Directory "/home/jenkins/workspace/Test_openjdk17_hs_extended.openjdk_x86-64_alpine-linux_testList_3/aqa-tests/TKG/../TKG/output_17406674401554/jdk_jfr_1/report" not found: creating
[2025-02-27T15:52:36.060Z] XML output with verification to /home/jenkins/workspace/Test_openjdk17_hs_extended.openjdk_x86-64_alpine-linux_testList_3/aqa-tests/TKG/output_17406674401554/jdk_jfr_1/work
[2025-02-27T15:54:29.196Z] --------------------------------------------------
[2025-02-27T15:54:29.196Z] TEST: jdk/jfr/api/event/TestShouldCommit.java
[2025-02-27T15:54:29.196Z] TEST JDK: /home/jenkins/workspace/Test_openjdk17_hs_extended.openjdk_x86-64_alpine-linux_testList_3/jdkbinary/j2sdk-image
[2025-02-27T15:54:29.196Z]
[2025-02-27T15:54:29.196Z] ACTION: build -- Passed. Build successful
[2025-02-27T15:54:29.196Z] REASON: Named class compiled on demand
[2025-02-27T15:54:29.196Z] TIME: 0.171 seconds
[2025-02-27T15:54:29.196Z] messages:
[2025-02-27T15:54:29.196Z] command: build jdk.jfr.api.event.TestShouldCommit
[2025-02-27T15:54:29.196Z] reason: Named class compiled on demand
[2025-02-27T15:54:29.196Z] started: Thu Feb 27 15:54:14 GMT 2025
[2025-02-27T15:54:29.196Z] Test directory:
[2025-02-27T15:54:29.196Z] compile: jdk.jfr.api.event.TestShouldCommit
[2025-02-27T15:54:29.196Z] finished: Thu Feb 27 15:54:15 GMT 2025
[2025-02-27T15:54:29.196Z] elapsed time (seconds): 0.171
[2025-02-27T15:54:29.196Z]
[2025-02-27T15:54:29.196Z] ACTION: compile -- Passed. Compilation successful
[2025-02-27T15:54:29.196Z] REASON: .class file out of date or does not exist
[2025-02-27T15:54:29.196Z] TIME: 0.171 seconds
[2025-02-27T15:54:29.196Z] messages:
[2025-02-27T15:54:29.196Z] command: compile /home/jenkins/workspace/Test_openjdk17_hs_extended.openjdk_x86-64_alpine-linux_testList_3/aqa-tests/openjdk/openjdk-jdk/test/jdk/jdk/jfr/api/event/TestShouldCommit.java
[2025-02-27T15:54:29.196Z] reason: .class file out of date or does not exist
[2025-02-27T15:54:29.196Z] started: Thu Feb 27 15:54:14 GMT 2025
[2025-02-27T15:54:29.197Z] Additional options from @modules: --add-modules jdk.jfr,java.management
[2025-02-27T15:54:29.197Z] Mode: agentvm
[2025-02-27T15:54:29.197Z] Agent id: 1
[2025-02-27T15:54:29.197Z] finished: Thu Feb 27 15:54:15 GMT 2025
[2025-02-27T15:54:29.197Z] elapsed time (seconds): 0.171
[2025-02-27T15:54:29.197Z] configuration:
[2025-02-27T15:54:29.197Z] Boot Layer (javac runtime environment)
[2025-02-27T15:54:29.197Z] class path: /home/jenkins/workspace/Test_openjdk17_hs_extended.openjdk_x86-64_alpine-linux_testList_3/jvmtest/openjdk/jtreg/lib/javatest.jar
[2025-02-27T15:54:29.197Z] /home/jenkins/workspace/Test_openjdk17_hs_extended.openjdk_x86-64_alpine-linux_testList_3/jvmtest/openjdk/jtreg/lib/jtreg.jar
[2025-02-27T15:54:29.197Z] patch: java.base /home/jenkins/workspace/Test_openjdk17_hs_extended.openjdk_x86-64_alpine-linux_testList_3/aqa-tests/TKG/output_17406674401554/jdk_jfr_1/work/patches/java.base
[2025-02-27T15:54:29.197Z]
[2025-02-27T15:54:29.197Z] javac compilation environment
[2025-02-27T15:54:29.197Z] add modules: jdk.jfr java.management
[2025-02-27T15:54:29.197Z] source path: /home/jenkins/workspace/Test_openjdk17_hs_extended.openjdk_x86-64_alpine-linux_testList_3/aqa-tests/openjdk/openjdk-jdk/test/jdk/jdk/jfr/api/event
[2025-02-27T15:54:29.197Z] /home/jenkins/workspace/Test_openjdk17_hs_extended.openjdk_x86-64_alpine-linux_testList_3/aqa-tests/openjdk/openjdk-jdk/test/lib
[2025-02-27T15:54:29.197Z] class path: /home/jenkins/workspace/Test_openjdk17_hs_extended.openjdk_x86-64_alpine-linux_testList_3/aqa-tests/openjdk/openjdk-jdk/test/jdk/jdk/jfr/api/event
[2025-02-27T15:54:29.197Z] /home/jenkins/workspace/Test_openjdk17_hs_extended.openjdk_x86-64_alpine-linux_testList_3/aqa-tests/TKG/output_17406674401554/jdk_jfr_1/work/classes/0/jdk/jfr/api/event/TestShouldCommit.d
[2025-02-27T15:54:29.197Z] /home/jenkins/workspace/Test_openjdk17_hs_extended.openjdk_x86-64_alpine-linux_testList_3/aqa-tests/TKG/output_17406674401554/jdk_jfr_1/work/classes/0/test/lib
[2025-02-27T15:54:29.197Z]
[2025-02-27T15:54:29.197Z] rerun:
[2025-02-27T15:54:29.197Z] cd /home/jenkins/workspace/Test_openjdk17_hs_extended.openjdk_x86-64_alpine-linux_testList_3/aqa-tests/TKG/output_17406674401554/jdk_jfr_1/work/scratch/2 && \
[2025-02-27T15:54:29.197Z] DISPLAY=:0 \
[2025-02-27T15:54:29.197Z] HOME=/home/jenkins \
[2025-02-27T15:54:29.197Z] PATH=/bin:/usr/bin:/usr/sbin \
[2025-02-27T15:54:29.197Z] /home/jenkins/workspace/Test_openjdk17_hs_extended.openjdk_x86-64_alpine-linux_testList_3/jdkbinary/j2sdk-image/bin/javac \
[2025-02-27T15:54:29.197Z] -J-ea \
[2025-02-27T15:54:29.197Z] -J-esa \
[2025-02-27T15:54:29.197Z] -J-Xmx768m \
[2025-02-27T15:54:29.197Z] -J-XX:-UseCompressedOops \
[2025-02-27T15:54:29.197Z] -J-Djava.awt.headless=true \
[2025-02-27T15:54:29.197Z] -J-Dtest.vm.opts='-ea -esa -Xmx768m -XX:-UseCompressedOops -Djava.awt.headless=true' \
[2025-02-27T15:54:29.197Z] -J-Dtest.tool.vm.opts='-J-ea -J-esa -J-Xmx768m -J-XX:-UseCompressedOops -J-Djava.awt.headless=true' \
[2025-02-27T15:54:29.197Z] -J-Dtest.compiler.opts= \
[2025-02-27T15:54:29.197Z] -J-Dtest.java.opts= \
[2025-02-27T15:54:29.197Z] -J-Dtest.jdk=/home/jenkins/workspace/Test_openjdk17_hs_extended.openjdk_x86-64_alpine-linux_testList_3/jdkbinary/j2sdk-image \
[2025-02-27T15:54:29.197Z] -J-Dcompile.jdk=/home/jenkins/workspace/Test_openjdk17_hs_extended.openjdk_x86-64_alpine-linux_testList_3/jdkbinary/j2sdk-image \
[2025-02-27T15:54:29.197Z] -J-Dtest.timeout.factor=8.0 \
[2025-02-27T15:54:29.197Z] -J-Dtest.nativepath=/home/jenkins/workspace/Test_openjdk17_hs_extended.openjdk_x86-64_alpine-linux_testList_3/jdkbinary/openjdk-test-image/jdk/jtreg/native \
[2025-02-27T15:54:29.197Z] -J-Dtest.root=/home/jenkins/workspace/Test_openjdk17_hs_extended.openjdk_x86-64_alpine-linux_testList_3/aqa-tests/openjdk/openjdk-jdk/test/jdk \
[2025-02-27T15:54:29.197Z] -J-Dtest.name=jdk/jfr/api/event/TestShouldCommit.java \
[2025-02-27T15:54:29.197Z] -J-Dtest.file=/home/jenkins/workspace/Test_openjdk17_hs_extended.openjdk_x86-64_alpine-linux_testList_3/aqa-tests/openjdk/openjdk-jdk/test/jdk/jdk/jfr/api/event/TestShouldCommit.java \
[2025-02-27T15:54:29.197Z] -J-Dtest.src=/home/jenkins/workspace/Test_openjdk17_hs_extended.openjdk_x86-64_alpine-linux_testList_3/aqa-tests/openjdk/openjdk-jdk/test/jdk/jdk/jfr/api/event \
[2025-02-27T15:54:29.197Z] -J-Dtest.src.path=/home/jenkins/workspace/Test_openjdk17_hs_extended.openjdk_x86-64_alpine-linux_testList_3/aqa-tests/openjdk/openjdk-jdk/test/jdk/jdk/jfr/api/event:/home/jenkins/workspace/Test_openjdk17_hs_extended.openjdk_x86-64_alpine-linux_testList_3/aqa-tests/openjdk/openjdk-jdk/test/lib \
[2025-02-27T15:54:29.197Z] -J-Dtest.classes=/home/jenkins/workspace/Test_openjdk17_hs_extended.openjdk_x86-64_alpine-linux_testList_3/aqa-tests/TKG/output_17406674401554/jdk_jfr_1/work/classes/0/jdk/jfr/api/event/TestShouldCommit.d \
[2025-02-27T15:54:29.197Z] -J-Dtest.class.path=/home/jenkins/workspace/Test_openjdk17_hs_extended.openjdk_x86-64_alpine-linux_testList_3/aqa-tests/TKG/output_17406674401554/jdk_jfr_1/work/classes/0/jdk/jfr/api/event/TestShouldCommit.d:/home/jenkins/workspace/Test_openjdk17_hs_extended.openjdk_x86-64_alpine-linux_testList_3/aqa-tests/TKG/output_17406674401554/jdk_jfr_1/work/classes/0/test/lib \
[2025-02-27T15:54:29.197Z] -J-Dtest.class.path.prefix=/home/jenkins/workspace/Test_openjdk17_hs_extended.openjdk_x86-64_alpine-linux_testList_3/aqa-tests/TKG/output_17406674401554/jdk_jfr_1/work/classes/0/jdk/jfr/api/event/TestShouldCommit.d:/home/jenkins/workspace/Test_openjdk17_hs_extended.openjdk_x86-64_alpine-linux_testList_3/aqa-tests/openjdk/openjdk-jdk/test/jdk/jdk/jfr/api/event:/home/jenkins/workspace/Test_openjdk17_hs_extended.openjdk_x86-64_alpine-linux_testList_3/aqa-tests/TKG/output_17406674401554/jdk_jfr_1/work/classes/0/test/lib \
[2025-02-27T15:54:29.197Z] -J-Dtest.modules='jdk.jfr java.management' \
[2025-02-27T15:54:29.197Z] --add-modules jdk.jfr,java.management \
[2025-02-27T15:54:29.197Z] -d /home/jenkins/workspace/Test_openjdk17_hs_extended.openjdk_x86-64_alpine-linux_testList_3/aqa-tests/TKG/output_17406674401554/jdk_jfr_1/work/classes/0/jdk/jfr/api/event/TestShouldCommit.d \
[2025-02-27T15:54:29.197Z] -sourcepath /home/jenkins/workspace/Test_openjdk17_hs_extended.openjdk_x86-64_alpine-linux_testList_3/aqa-tests/openjdk/openjdk-jdk/test/jdk/jdk/jfr/api/event:/home/jenkins/workspace/Test_openjdk17_hs_extended.openjdk_x86-64_alpine-linux_testList_3/aqa-tests/openjdk/openjdk-jdk/test/lib \
[2025-02-27T15:54:29.197Z] -classpath /home/jenkins/workspace/Test_openjdk17_hs_extended.openjdk_x86-64_alpine-linux_testList_3/aqa-tests/openjdk/openjdk-jdk/test/jdk/jdk/jfr/api/event:/home/jenkins/workspace/Test_openjdk17_hs_extended.openjdk_x86-64_alpine-linux_testList_3/aqa-tests/TKG/output_17406674401554/jdk_jfr_1/work/classes/0/jdk/jfr/api/event/TestShouldCommit.d:/home/jenkins/workspace/Test_openjdk17_hs_extended.openjdk_x86-64_alpine-linux_testList_3/aqa-tests/TKG/output_17406674401554/jdk_jfr_1/work/classes/0/test/lib /home/jenkins/workspace/Test_openjdk17_hs_extended.openjdk_x86-64_alpine-linux_testList_3/aqa-tests/openjdk/openjdk-jdk/test/jdk/jdk/jfr/api/event/TestShouldCommit.java
[2025-02-27T15:54:29.197Z] direct:
[2025-02-27T15:54:29.197Z] /home/jenkins/workspace/Test_openjdk17_hs_extended.openjdk_x86-64_alpine-linux_testList_3/aqa-tests/openjdk/openjdk-jdk/test/jdk/jdk/jfr/api/event/TestShouldCommit.java:135: warning: [removal] Boolean(boolean) in Boolean has been deprecated and marked for removal
[2025-02-27T15:54:29.197Z] shouldCommit = new Boolean(true); // shouldCommit() must be true
[2025-02-27T15:54:29.197Z] ^
[2025-02-27T15:54:29.197Z] /home/jenkins/workspace/Test_openjdk17_hs_extended.openjdk_x86-64_alpine-linux_testList_3/aqa-tests/openjdk/openjdk-jdk/test/jdk/jdk/jfr/api/event/TestShouldCommit.java:137: warning: [removal] Boolean(boolean) in Boolean has been deprecated and marked for removal
[2025-02-27T15:54:29.197Z] shouldCommit = new Boolean(false); // shouldCommit() must be false
[2025-02-27T15:54:29.197Z] ^
[2025-02-27T15:54:29.197Z] 2 warnings
[2025-02-27T15:54:29.197Z]
[2025-02-27T15:54:29.197Z] ACTION: main -- Failed. Execution failed: `main' threw exception: java.lang.RuntimeException: Wrong shouldCommit(): expected true to equal false
[2025-02-27T15:54:29.197Z] REASON: User specified action: run main/othervm -Xlog:jfr+event+setting=trace jdk.jfr.api.event.TestShouldCommit
[2025-02-27T15:54:29.197Z] TIME: 1.345 seconds
[2025-02-27T15:54:29.197Z] messages:
[2025-02-27T15:54:29.197Z] command: main -Xlog:jfr+event+setting=trace jdk.jfr.api.event.TestShouldCommit
[2025-02-27T15:54:29.197Z] reason: User specified action: run main/othervm -Xlog:jfr+event+setting=trace jdk.jfr.api.event.TestShouldCommit
[2025-02-27T15:54:29.197Z] started: Thu Feb 27 15:54:15 GMT 2025
[2025-02-27T15:54:29.197Z] Mode: othervm [/othervm specified]
[2025-02-27T15:54:29.197Z] Additional options from @modules: --add-modules jdk.jfr,java.management
[2025-02-27T15:54:29.197Z] finished: Thu Feb 27 15:54:16 GMT 2025
[2025-02-27T15:54:29.197Z] elapsed time (seconds): 1.345
[2025-02-27T15:54:29.197Z] configuration:
[2025-02-27T15:54:29.197Z] Boot Layer
[2025-02-27T15:54:29.197Z] add modules: jdk.jfr java.management
[2025-02-27T15:54:29.197Z]
[2025-02-27T15:54:29.197Z] STDOUT:
[2025-02-27T15:54:29.197Z] [0.001s][warning][logging] No tag set matches selection: jfr+event+setting. Did you mean any of the following? jfr+event* jfr+setting* jfr+system+setting jfr+system+event jfr*
[2025-02-27T15:54:29.197Z] threshold=100000, duration=[93079-97085], shouldCommit()=false, expected=false
[2025-02-27T15:54:29.197Z] threshold=100000, duration=[103075-107082], shouldCommit()=false, expected=true
[2025-02-27T15:54:29.197Z] Unexpected value of shouldCommit(). Searching for active threshold...
[2025-02-27T15:54:29.197Z] shouldCommit()=true after 117,266 ms, expected 100,000
[2025-02-27T15:54:29.197Z] STDERR:
[2025-02-27T15:54:29.197Z] java.lang.RuntimeException: Wrong shouldCommit(): expected true to equal false
[2025-02-27T15:54:29.197Z] at jdk.test.lib.Asserts.fail(Asserts.java:594)
[2025-02-27T15:54:29.197Z] at jdk.test.lib.Asserts.assertEquals(Asserts.java:205)
[2025-02-27T15:54:29.197Z] at jdk.jfr.api.event.TestShouldCommit.verifyThreshold(TestShouldCommit.java:149)
[2025-02-27T15:54:29.197Z] at jdk.jfr.api.event.TestShouldCommit.verifyThreshold(TestShouldCommit.java:106)
[2025-02-27T15:54:29.197Z] at jdk.jfr.api.event.TestShouldCommit.main(TestShouldCommit.java:53)
[2025-02-27T15:54:29.197Z] at java.base/jdk.internal.reflect.NativeMethodAccessorImpl.invoke0(Native Method)
[2025-02-27T15:54:29.197Z] at java.base/jdk.internal.reflect.NativeMethodAccessorImpl.invoke(NativeMethodAccessorImpl.java:77)
[2025-02-27T15:54:29.197Z] at java.base/jdk.internal.reflect.DelegatingMethodAccessorImpl.invoke(DelegatingMethodAccessorImpl.java:43)
[2025-02-27T15:54:29.197Z] at java.base/java.lang.reflect.Method.invoke(Method.java:569)
[2025-02-27T15:54:29.197Z] at com.sun.javatest.regtest.agent.MainWrapper$MainTask.run(MainWrapper.java:138)
[2025-02-27T15:54:29.197Z] at java.base/java.lang.Thread.run(Thread.java:840)
[2025-02-27T15:54:29.197Z]
[2025-02-27T15:54:29.197Z] JavaTest Message: Test threw exception: java.lang.RuntimeException: Wrong shouldCommit(): expected true to equal false
[2025-02-27T15:54:29.197Z] JavaTest Message: shutting down test
[2025-02-27T15:54:29.198Z]
[2025-02-27T15:54:29.198Z] STATUS:Failed.`main' threw exception: java.lang.RuntimeException: Wrong shouldCommit(): expected true to equal false
[2025-02-27T15:54:29.198Z] rerun:
[2025-02-27T15:54:29.198Z] cd /home/jenkins/workspace/Test_openjdk17_hs_extended.openjdk_x86-64_alpine-linux_testList_3/aqa-tests/TKG/output_17406674401554/jdk_jfr_1/work/scratch/2 && \
[2025-02-27T15:54:29.198Z] DISPLAY=:0 \
[2025-02-27T15:54:29.198Z] HOME=/home/jenkins \
[2025-02-27T15:54:29.198Z] PATH=/bin:/usr/bin:/usr/sbin \
[2025-02-27T15:54:29.198Z] CLASSPATH=/home/jenkins/workspace/Test_openjdk17_hs_extended.openjdk_x86-64_alpine-linux_testList_3/aqa-tests/TKG/output_17406674401554/jdk_jfr_1/work/classes/0/jdk/jfr/api/event/TestShouldCommit.d:/home/jenkins/workspace/Test_openjdk17_hs_extended.openjdk_x86-64_alpine-linux_testList_3/aqa-tests/openjdk/openjdk-jdk/test/jdk/jdk/jfr/api/event:/home/jenkins/workspace/Test_openjdk17_hs_extended.openjdk_x86-64_alpine-linux_testList_3/aqa-tests/TKG/output_17406674401554/jdk_jfr_1/work/classes/0/test/lib:/home/jenkins/workspace/Test_openjdk17_hs_extended.openjdk_x86-64_alpine-linux_testList_3/aqa-tests/openjdk/openjdk-jdk/test/lib:/home/jenkins/workspace/Test_openjdk17_hs_extended.openjdk_x86-64_alpine-linux_testList_3/jvmtest/openjdk/jtreg/lib/javatest.jar:/home/jenkins/workspace/Test_openjdk17_hs_extended.openjdk_x86-64_alpine-linux_testList_3/jvmtest/openjdk/jtreg/lib/jtreg.jar \
[2025-02-27T15:54:29.198Z] /home/jenkins/workspace/Test_openjdk17_hs_extended.openjdk_x86-64_alpine-linux_testList_3/jdkbinary/j2sdk-image/bin/java \
[2025-02-27T15:54:29.198Z] -Dtest.vm.opts='-ea -esa -Xmx768m -XX:-UseCompressedOops -Djava.awt.headless=true' \
[2025-02-27T15:54:29.198Z] -Dtest.tool.vm.opts='-J-ea -J-esa -J-Xmx768m -J-XX:-UseCompressedOops -J-Djava.awt.headless=true' \
[2025-02-27T15:54:29.198Z] -Dtest.compiler.opts= \
[2025-02-27T15:54:29.198Z] -Dtest.java.opts= \
[2025-02-27T15:54:29.198Z] -Dtest.jdk=/home/jenkins/workspace/Test_openjdk17_hs_extended.openjdk_x86-64_alpine-linux_testList_3/jdkbinary/j2sdk-image \
[2025-02-27T15:54:29.198Z] -Dcompile.jdk=/home/jenkins/workspace/Test_openjdk17_hs_extended.openjdk_x86-64_alpine-linux_testList_3/jdkbinary/j2sdk-image \
[2025-02-27T15:54:29.198Z] -Dtest.timeout.factor=8.0 \
[2025-02-27T15:54:29.198Z] -Dtest.nativepath=/home/jenkins/workspace/Test_openjdk17_hs_extended.openjdk_x86-64_alpine-linux_testList_3/jdkbinary/openjdk-test-image/jdk/jtreg/native \
[2025-02-27T15:54:29.198Z] -Dtest.root=/home/jenkins/workspace/Test_openjdk17_hs_extended.openjdk_x86-64_alpine-linux_testList_3/aqa-tests/openjdk/openjdk-jdk/test/jdk \
[2025-02-27T15:54:29.198Z] -Dtest.name=jdk/jfr/api/event/TestShouldCommit.java \
[2025-02-27T15:54:29.198Z] -Dtest.file=/home/jenkins/workspace/Test_openjdk17_hs_extended.openjdk_x86-64_alpine-linux_testList_3/aqa-tests/openjdk/openjdk-jdk/test/jdk/jdk/jfr/api/event/TestShouldCommit.java \
[2025-02-27T15:54:29.198Z] -Dtest.src=/home/jenkins/workspace/Test_openjdk17_hs_extended.openjdk_x86-64_alpine-linux_testList_3/aqa-tests/openjdk/openjdk-jdk/test/jdk/jdk/jfr/api/event \
[2025-02-27T15:54:29.198Z] -Dtest.src.path=/home/jenkins/workspace/Test_openjdk17_hs_extended.openjdk_x86-64_alpine-linux_testList_3/aqa-tests/openjdk/openjdk-jdk/test/jdk/jdk/jfr/api/event:/home/jenkins/workspace/Test_openjdk17_hs_extended.openjdk_x86-64_alpine-linux_testList_3/aqa-tests/openjdk/openjdk-jdk/test/lib \
[2025-02-27T15:54:29.198Z] -Dtest.classes=/home/jenkins/workspace/Test_openjdk17_hs_extended.openjdk_x86-64_alpine-linux_testList_3/aqa-tests/TKG/output_17406674401554/jdk_jfr_1/work/classes/0/jdk/jfr/api/event/TestShouldCommit.d \
[2025-02-27T15:54:29.198Z] -Dtest.class.path=/home/jenkins/workspace/Test_openjdk17_hs_extended.openjdk_x86-64_alpine-linux_testList_3/aqa-tests/TKG/output_17406674401554/jdk_jfr_1/work/classes/0/jdk/jfr/api/event/TestShouldCommit.d:/home/jenkins/workspace/Test_openjdk17_hs_extended.openjdk_x86-64_alpine-linux_testList_3/aqa-tests/TKG/output_17406674401554/jdk_jfr_1/work/classes/0/test/lib \
[2025-02-27T15:54:29.198Z] -Dtest.class.path.prefix=/home/jenkins/workspace/Test_openjdk17_hs_extended.openjdk_x86-64_alpine-linux_testList_3/aqa-tests/TKG/output_17406674401554/jdk_jfr_1/work/classes/0/jdk/jfr/api/event/TestShouldCommit.d:/home/jenkins/workspace/Test_openjdk17_hs_extended.openjdk_x86-64_alpine-linux_testList_3/aqa-tests/openjdk/openjdk-jdk/test/jdk/jdk/jfr/api/event:/home/jenkins/workspace/Test_openjdk17_hs_extended.openjdk_x86-64_alpine-linux_testList_3/aqa-tests/TKG/output_17406674401554/jdk_jfr_1/work/classes/0/test/lib \
[2025-02-27T15:54:29.198Z] -Dtest.modules='jdk.jfr java.management' \
[2025-02-27T15:54:29.198Z] --add-modules jdk.jfr,java.management \
[2025-02-27T15:54:29.198Z] -ea \
[2025-02-27T15:54:29.198Z] -esa \
[2025-02-27T15:54:29.198Z] -Xmx768m \
[2025-02-27T15:54:29.198Z] -XX:-UseCompressedOops \
[2025-02-27T15:54:29.198Z] -Djava.awt.headless=true \
[2025-02-27T15:54:29.198Z] -Djava.library.path=/home/jenkins/workspace/Test_openjdk17_hs_extended.openjdk_x86-64_alpine-linux_testList_3/jdkbinary/openjdk-test-image/jdk/jtreg/native \
[2025-02-27T15:54:29.198Z] -Xlog:jfr+event+setting=trace \
[2025-02-27T15:54:29.198Z] com.sun.javatest.regtest.agent.MainWrapper /home/jenkins/workspace/Test_openjdk17_hs_extended.openjdk_x86-64_alpine-linux_testList_3/aqa-tests/TKG/output_17406674401554/jdk_jfr_1/work/jdk/jfr/api/event/TestShouldCommit.d/main.0.jta
[2025-02-27T15:54:29.198Z]
[2025-02-27T15:54:29.198Z] TEST RESULT: Failed. Execution failed: `main' threw exception: java.lang.RuntimeException: Wrong shouldCommit(): expected true to equal false
[2025-02-27T15:54:29.198Z] --------------------------------------------------
[2025-02-27T15:59:23.215Z] Test results: passed: 537; failed: 1
[2025-02-27T15:59:27.893Z] Report written to /home/jenkins/workspace/Test_openjdk17_hs_extended.openjdk_x86-64_alpine-linux_testList_3/aqa-tests/TKG/output_17406674401554/jdk_jfr_1/report/html/report.html
[2025-02-27T15:59:27.893Z] Results written to /home/jenkins/workspace/Test_openjdk17_hs_extended.openjdk_x86-64_alpine-linux_testList_3/aqa-tests/TKG/output_17406674401554/jdk_jfr_1/work
[2025-02-27T15:59:27.893Z] Error: Some tests failed or other problems occurred.
[2025-02-27T15:59:27.893Z] -----------------------------------
[2025-02-27T15:59:27.893Z] jdk_jfr_1_FAILED
[2025-02-27T15:59:27.893Z] -----------------------------------
[2025-02-27T15:59:27.893Z]
[2025-02-27T15:59:27.893Z] TEST TEARDOWN:
[2025-02-27T15:59:27.893Z] Nothing to be done for teardown.
[2025-02-27T15:59:27.893Z] jdk_jfr_1 Finish Time: Thu Feb 27 15:59:27 2025 Epoch Time (ms): 1740671967140