jdk_jfr_1
[2025-07-16T19:15:02.616Z] Running test jdk_jfr_1 ...
[2025-07-16T19:15:02.616Z] ===============================================
[2025-07-16T19:15:02.616Z] jdk_jfr_1 Start Time: Wed Jul 16 19:14:59 2025 Epoch Time (ms): 1752693299227
[2025-07-16T19:15:02.616Z] variation: Mode650
[2025-07-16T19:15:02.616Z] JVM_OPTIONS: -XX:-UseCompressedOops
[2025-07-16T19:15:02.616Z] { \
[2025-07-16T19:15:02.616Z] echo ""; echo "TEST SETUP:"; \
[2025-07-16T19:15:02.616Z] echo "Nothing to be done for setup."; \
[2025-07-16T19:15:02.616Z] mkdir -p "/home/jenkins/workspace/Test_openjdk11_hs_extended.openjdk_x86-64_linux_testList_4/aqa-tests/TKG/../TKG/output_17526784562195/jdk_jfr_1"; \
[2025-07-16T19:15:02.616Z] cd "/home/jenkins/workspace/Test_openjdk11_hs_extended.openjdk_x86-64_linux_testList_4/aqa-tests/TKG/../TKG/output_17526784562195/jdk_jfr_1"; \
[2025-07-16T19:15:02.616Z] echo ""; echo "TESTING:"; \
[2025-07-16T19:15:02.616Z] "/home/jenkins/workspace/Test_openjdk11_hs_extended.openjdk_x86-64_linux_testList_4/jdkbinary/j2sdk-image/bin/java" -Xmx512m -jar "/home/jenkins/workspace/Test_openjdk11_hs_extended.openjdk_x86-64_linux_testList_4/aqa-tests/TKG/../../jvmtest/openjdk/jtreg/lib/jtreg.jar" \
[2025-07-16T19:15:02.616Z] -agentvm -a -ea -esa -v:fail,error,time,nopass -retain:fail,error,*.dmp,javacore.*,heapdump.*,*.trc -ignore:quiet -timeoutFactor:8 -xml:verify -concurrency:3 -nativepath:"/home/jenkins/workspace/Test_openjdk11_hs_extended.openjdk_x86-64_linux_testList_4/jdkbinary/openjdk-test-image/jdk/jtreg/native" -vmoptions:"-Xmx768m -XX:-UseCompressedOops " \
[2025-07-16T19:15:02.616Z] -w ""/home/jenkins/workspace/Test_openjdk11_hs_extended.openjdk_x86-64_linux_testList_4/aqa-tests/TKG/../TKG/output_17526784562195/jdk_jfr_1"/work" \
[2025-07-16T19:15:02.616Z] -r ""/home/jenkins/workspace/Test_openjdk11_hs_extended.openjdk_x86-64_linux_testList_4/aqa-tests/TKG/../TKG/output_17526784562195/jdk_jfr_1"/report" \
[2025-07-16T19:15:02.616Z] -jdk:"/home/jenkins/workspace/Test_openjdk11_hs_extended.openjdk_x86-64_linux_testList_4/jdkbinary/j2sdk-image" \
[2025-07-16T19:15:02.616Z] -exclude:"/home/jenkins/workspace/Test_openjdk11_hs_extended.openjdk_x86-64_linux_testList_4/aqa-tests/TKG/../openjdk/openjdk-jdk/test/jdk/ProblemList.txt" \
[2025-07-16T19:15:02.616Z] -exclude:"/home/jenkins/workspace/Test_openjdk11_hs_extended.openjdk_x86-64_linux_testList_4/aqa-tests/TKG/../../jvmtest/openjdk/excludes/ProblemList_openjdk11.txt" \
[2025-07-16T19:15:02.616Z] \
[2025-07-16T19:15:02.616Z] -exclude:"/home/jenkins/workspace/Test_openjdk11_hs_extended.openjdk_x86-64_linux_testList_4/aqa-tests/TKG/../openjdk/excludes/vendors/eclipse/ProblemList_openjdk11.txt" \
[2025-07-16T19:15:02.616Z] "/home/jenkins/workspace/Test_openjdk11_hs_extended.openjdk_x86-64_linux_testList_4/aqa-tests/TKG/../openjdk/openjdk-jdk/test/jdk:jdk_jfr"; \
[2025-07-16T19:15:02.616Z] if [ $? -eq 0 ]; then echo "-----------------------------------"; echo "jdk_jfr_1""_PASSED"; echo "-----------------------------------"; cd /home/jenkins/workspace/Test_openjdk11_hs_extended.openjdk_x86-64_linux_testList_4/aqa-tests/TKG/..; else echo "-----------------------------------"; echo "jdk_jfr_1""_FAILED"; echo "-----------------------------------"; fi; \
[2025-07-16T19:15:02.616Z] echo ""; echo "TEST TEARDOWN:"; \
[2025-07-16T19:15:02.616Z] echo "Nothing to be done for teardown."; \
[2025-07-16T19:15:02.616Z] } 2>&1 | tee -a "/home/jenkins/workspace/Test_openjdk11_hs_extended.openjdk_x86-64_linux_testList_4/aqa-tests/TKG/../TKG/output_17526784562195/TestTargetResult";
[2025-07-16T19:15:02.616Z]
[2025-07-16T19:15:02.616Z] TEST SETUP:
[2025-07-16T19:15:02.616Z] Nothing to be done for setup.
[2025-07-16T19:15:02.616Z]
[2025-07-16T19:15:02.616Z] TESTING:
[2025-07-16T19:15:02.616Z] Directory "/home/jenkins/workspace/Test_openjdk11_hs_extended.openjdk_x86-64_linux_testList_4/aqa-tests/TKG/../TKG/output_17526784562195/jdk_jfr_1/work" not found: creating
[2025-07-16T19:15:02.616Z] Directory "/home/jenkins/workspace/Test_openjdk11_hs_extended.openjdk_x86-64_linux_testList_4/aqa-tests/TKG/../TKG/output_17526784562195/jdk_jfr_1/report" not found: creating
[2025-07-16T19:15:24.665Z] XML output with verification to /home/jenkins/workspace/Test_openjdk11_hs_extended.openjdk_x86-64_linux_testList_4/aqa-tests/TKG/output_17526784562195/jdk_jfr_1/work
[2025-07-16T19:50:32.018Z] --------------------------------------------------
[2025-07-16T19:50:32.018Z] TEST: jdk/jfr/event/runtime/TestThreadCpuTimeEvent.java
[2025-07-16T19:50:32.018Z] TEST JDK: /home/jenkins/workspace/Test_openjdk11_hs_extended.openjdk_x86-64_linux_testList_4/jdkbinary/j2sdk-image
[2025-07-16T19:50:32.018Z]
[2025-07-16T19:50:32.018Z] ACTION: build -- Passed. Build successful
[2025-07-16T19:50:32.018Z] REASON: Named class compiled on demand
[2025-07-16T19:50:32.018Z] TIME: 1.828 seconds
[2025-07-16T19:50:32.018Z] messages:
[2025-07-16T19:50:32.018Z] command: build jdk.jfr.event.runtime.TestThreadCpuTimeEvent
[2025-07-16T19:50:32.018Z] reason: Named class compiled on demand
[2025-07-16T19:50:32.018Z] started: Wed Jul 16 19:49:56 UTC 2025
[2025-07-16T19:50:32.018Z] Test directory:
[2025-07-16T19:50:32.018Z] compile: jdk.jfr.event.runtime.TestThreadCpuTimeEvent
[2025-07-16T19:50:32.018Z] finished: Wed Jul 16 19:49:58 UTC 2025
[2025-07-16T19:50:32.018Z] elapsed time (seconds): 1.828
[2025-07-16T19:50:32.018Z]
[2025-07-16T19:50:32.018Z] ACTION: compile -- Passed. Compilation successful
[2025-07-16T19:50:32.018Z] REASON: .class file out of date or does not exist
[2025-07-16T19:50:32.018Z] TIME: 1.827 seconds
[2025-07-16T19:50:32.018Z] messages:
[2025-07-16T19:50:32.018Z] command: compile /home/jenkins/workspace/Test_openjdk11_hs_extended.openjdk_x86-64_linux_testList_4/aqa-tests/openjdk/openjdk-jdk/test/jdk/jdk/jfr/event/runtime/TestThreadCpuTimeEvent.java
[2025-07-16T19:50:32.018Z] reason: .class file out of date or does not exist
[2025-07-16T19:50:32.018Z] started: Wed Jul 16 19:49:56 UTC 2025
[2025-07-16T19:50:32.018Z] Additional options from @modules: --add-modules jdk.jfr,jdk.management
[2025-07-16T19:50:32.018Z] Mode: agentvm
[2025-07-16T19:50:32.018Z] Agent id: 3
[2025-07-16T19:50:32.018Z] finished: Wed Jul 16 19:49:58 UTC 2025
[2025-07-16T19:50:32.018Z] elapsed time (seconds): 1.827
[2025-07-16T19:50:32.018Z] configuration:
[2025-07-16T19:50:32.018Z] Boot Layer (javac runtime environment)
[2025-07-16T19:50:32.018Z] class path: /home/jenkins/workspace/Test_openjdk11_hs_extended.openjdk_x86-64_linux_testList_4/jvmtest/openjdk/jtreg/lib/javatest.jar
[2025-07-16T19:50:32.018Z] /home/jenkins/workspace/Test_openjdk11_hs_extended.openjdk_x86-64_linux_testList_4/jvmtest/openjdk/jtreg/lib/jtreg.jar
[2025-07-16T19:50:32.018Z] patch: java.base /home/jenkins/workspace/Test_openjdk11_hs_extended.openjdk_x86-64_linux_testList_4/aqa-tests/TKG/output_17526784562195/jdk_jfr_1/work/patches/java.base
[2025-07-16T19:50:32.018Z]
[2025-07-16T19:50:32.018Z] javac compilation environment
[2025-07-16T19:50:32.018Z] add modules: jdk.jfr jdk.management
[2025-07-16T19:50:32.018Z] source path: /home/jenkins/workspace/Test_openjdk11_hs_extended.openjdk_x86-64_linux_testList_4/aqa-tests/openjdk/openjdk-jdk/test/jdk/jdk/jfr/event/runtime
[2025-07-16T19:50:32.018Z] /home/jenkins/workspace/Test_openjdk11_hs_extended.openjdk_x86-64_linux_testList_4/aqa-tests/openjdk/openjdk-jdk/test/lib
[2025-07-16T19:50:32.018Z] class path: /home/jenkins/workspace/Test_openjdk11_hs_extended.openjdk_x86-64_linux_testList_4/aqa-tests/openjdk/openjdk-jdk/test/jdk/jdk/jfr/event/runtime
[2025-07-16T19:50:32.018Z] /home/jenkins/workspace/Test_openjdk11_hs_extended.openjdk_x86-64_linux_testList_4/aqa-tests/TKG/output_17526784562195/jdk_jfr_1/work/classes/1/jdk/jfr/event/runtime/TestThreadCpuTimeEvent.d
[2025-07-16T19:50:32.018Z] /home/jenkins/workspace/Test_openjdk11_hs_extended.openjdk_x86-64_linux_testList_4/aqa-tests/TKG/output_17526784562195/jdk_jfr_1/work/classes/1/test/lib
[2025-07-16T19:50:32.018Z]
[2025-07-16T19:50:32.018Z] rerun:
[2025-07-16T19:50:32.018Z] cd /home/jenkins/workspace/Test_openjdk11_hs_extended.openjdk_x86-64_linux_testList_4/aqa-tests/TKG/output_17526784562195/jdk_jfr_1/work/scratch/0 && \
[2025-07-16T19:50:32.018Z] DISPLAY=:0 \
[2025-07-16T19:50:32.018Z] HOME=/home/jenkins \
[2025-07-16T19:50:32.018Z] LANG=C.UTF-8 \
[2025-07-16T19:50:32.018Z] PATH=/bin:/usr/bin:/usr/sbin \
[2025-07-16T19:50:32.018Z] /home/jenkins/workspace/Test_openjdk11_hs_extended.openjdk_x86-64_linux_testList_4/jdkbinary/j2sdk-image/bin/javac \
[2025-07-16T19:50:32.018Z] -J-ea \
[2025-07-16T19:50:32.018Z] -J-esa \
[2025-07-16T19:50:32.018Z] -J-Xmx768m \
[2025-07-16T19:50:32.018Z] -J-XX:-UseCompressedOops \
[2025-07-16T19:50:32.018Z] -J-Dtest.vm.opts='-ea -esa -Xmx768m -XX:-UseCompressedOops' \
[2025-07-16T19:50:32.018Z] -J-Dtest.tool.vm.opts='-J-ea -J-esa -J-Xmx768m -J-XX:-UseCompressedOops' \
[2025-07-16T19:50:32.018Z] -J-Dtest.compiler.opts= \
[2025-07-16T19:50:32.018Z] -J-Dtest.java.opts= \
[2025-07-16T19:50:32.018Z] -J-Dtest.jdk=/home/jenkins/workspace/Test_openjdk11_hs_extended.openjdk_x86-64_linux_testList_4/jdkbinary/j2sdk-image \
[2025-07-16T19:50:32.018Z] -J-Dcompile.jdk=/home/jenkins/workspace/Test_openjdk11_hs_extended.openjdk_x86-64_linux_testList_4/jdkbinary/j2sdk-image \
[2025-07-16T19:50:32.018Z] -J-Dtest.timeout.factor=8.0 \
[2025-07-16T19:50:32.018Z] -J-Dtest.nativepath=/home/jenkins/workspace/Test_openjdk11_hs_extended.openjdk_x86-64_linux_testList_4/jdkbinary/openjdk-test-image/jdk/jtreg/native \
[2025-07-16T19:50:32.018Z] -J-Dtest.root=/home/jenkins/workspace/Test_openjdk11_hs_extended.openjdk_x86-64_linux_testList_4/aqa-tests/openjdk/openjdk-jdk/test/jdk \
[2025-07-16T19:50:32.018Z] -J-Dtest.name=jdk/jfr/event/runtime/TestThreadCpuTimeEvent.java \
[2025-07-16T19:50:32.018Z] -J-Dtest.file=/home/jenkins/workspace/Test_openjdk11_hs_extended.openjdk_x86-64_linux_testList_4/aqa-tests/openjdk/openjdk-jdk/test/jdk/jdk/jfr/event/runtime/TestThreadCpuTimeEvent.java \
[2025-07-16T19:50:32.018Z] -J-Dtest.src=/home/jenkins/workspace/Test_openjdk11_hs_extended.openjdk_x86-64_linux_testList_4/aqa-tests/openjdk/openjdk-jdk/test/jdk/jdk/jfr/event/runtime \
[2025-07-16T19:50:32.018Z] -J-Dtest.src.path=/home/jenkins/workspace/Test_openjdk11_hs_extended.openjdk_x86-64_linux_testList_4/aqa-tests/openjdk/openjdk-jdk/test/jdk/jdk/jfr/event/runtime:/home/jenkins/workspace/Test_openjdk11_hs_extended.openjdk_x86-64_linux_testList_4/aqa-tests/openjdk/openjdk-jdk/test/lib \
[2025-07-16T19:50:32.018Z] -J-Dtest.classes=/home/jenkins/workspace/Test_openjdk11_hs_extended.openjdk_x86-64_linux_testList_4/aqa-tests/TKG/output_17526784562195/jdk_jfr_1/work/classes/1/jdk/jfr/event/runtime/TestThreadCpuTimeEvent.d \
[2025-07-16T19:50:32.018Z] -J-Dtest.class.path=/home/jenkins/workspace/Test_openjdk11_hs_extended.openjdk_x86-64_linux_testList_4/aqa-tests/TKG/output_17526784562195/jdk_jfr_1/work/classes/1/jdk/jfr/event/runtime/TestThreadCpuTimeEvent.d:/home/jenkins/workspace/Test_openjdk11_hs_extended.openjdk_x86-64_linux_testList_4/aqa-tests/TKG/output_17526784562195/jdk_jfr_1/work/classes/1/test/lib \
[2025-07-16T19:50:32.018Z] -J-Dtest.class.path.prefix=/home/jenkins/workspace/Test_openjdk11_hs_extended.openjdk_x86-64_linux_testList_4/aqa-tests/TKG/output_17526784562195/jdk_jfr_1/work/classes/1/jdk/jfr/event/runtime/TestThreadCpuTimeEvent.d:/home/jenkins/workspace/Test_openjdk11_hs_extended.openjdk_x86-64_linux_testList_4/aqa-tests/openjdk/openjdk-jdk/test/jdk/jdk/jfr/event/runtime:/home/jenkins/workspace/Test_openjdk11_hs_extended.openjdk_x86-64_linux_testList_4/aqa-tests/TKG/output_17526784562195/jdk_jfr_1/work/classes/1/test/lib \
[2025-07-16T19:50:32.018Z] -J-Dtest.modules='jdk.jfr jdk.management' \
[2025-07-16T19:50:32.018Z] --add-modules jdk.jfr,jdk.management \
[2025-07-16T19:50:32.018Z] -d /home/jenkins/workspace/Test_openjdk11_hs_extended.openjdk_x86-64_linux_testList_4/aqa-tests/TKG/output_17526784562195/jdk_jfr_1/work/classes/1/jdk/jfr/event/runtime/TestThreadCpuTimeEvent.d \
[2025-07-16T19:50:32.018Z] -sourcepath /home/jenkins/workspace/Test_openjdk11_hs_extended.openjdk_x86-64_linux_testList_4/aqa-tests/openjdk/openjdk-jdk/test/jdk/jdk/jfr/event/runtime:/home/jenkins/workspace/Test_openjdk11_hs_extended.openjdk_x86-64_linux_testList_4/aqa-tests/openjdk/openjdk-jdk/test/lib \
[2025-07-16T19:50:32.018Z] -classpath /home/jenkins/workspace/Test_openjdk11_hs_extended.openjdk_x86-64_linux_testList_4/aqa-tests/openjdk/openjdk-jdk/test/jdk/jdk/jfr/event/runtime:/home/jenkins/workspace/Test_openjdk11_hs_extended.openjdk_x86-64_linux_testList_4/aqa-tests/TKG/output_17526784562195/jdk_jfr_1/work/classes/1/jdk/jfr/event/runtime/TestThreadCpuTimeEvent.d:/home/jenkins/workspace/Test_openjdk11_hs_extended.openjdk_x86-64_linux_testList_4/aqa-tests/TKG/output_17526784562195/jdk_jfr_1/work/classes/1/test/lib /home/jenkins/workspace/Test_openjdk11_hs_extended.openjdk_x86-64_linux_testList_4/aqa-tests/openjdk/openjdk-jdk/test/jdk/jdk/jfr/event/runtime/TestThreadCpuTimeEvent.java
[2025-07-16T19:50:32.018Z]
[2025-07-16T19:50:32.018Z] ACTION: main -- Failed. Execution failed: `main' threw exception: java.lang.RuntimeException: assertLessThan: expected that PT0.188S < PT0.1416525S
[2025-07-16T19:50:32.018Z] REASON: User specified action: run main/othervm jdk.jfr.event.runtime.TestThreadCpuTimeEvent
[2025-07-16T19:50:32.018Z] TIME: 22.171 seconds
[2025-07-16T19:50:32.018Z] messages:
[2025-07-16T19:50:32.018Z] command: main jdk.jfr.event.runtime.TestThreadCpuTimeEvent
[2025-07-16T19:50:32.018Z] reason: User specified action: run main/othervm jdk.jfr.event.runtime.TestThreadCpuTimeEvent
[2025-07-16T19:50:32.018Z] started: Wed Jul 16 19:49:58 UTC 2025
[2025-07-16T19:50:32.018Z] Mode: othervm [/othervm specified]
[2025-07-16T19:50:32.018Z] Additional options from @modules: --add-modules jdk.jfr,jdk.management
[2025-07-16T19:50:32.018Z] finished: Wed Jul 16 19:50:20 UTC 2025
[2025-07-16T19:50:32.018Z] elapsed time (seconds): 22.171
[2025-07-16T19:50:32.018Z] configuration:
[2025-07-16T19:50:32.018Z] Boot Layer
[2025-07-16T19:50:32.018Z] add modules: jdk.jfr jdk.management
[2025-07-16T19:50:32.018Z]
[2025-07-16T19:50:32.018Z] STDOUT:
[2025-07-16T19:50:32.018Z] STDERR:
[2025-07-16T19:50:32.018Z] java.lang.RuntimeException: assertLessThan: expected that PT0.188S < PT0.1416525S
[2025-07-16T19:50:32.018Z] at jdk.test.lib.Asserts.fail(Asserts.java:594)
[2025-07-16T19:50:32.018Z] at jdk.test.lib.Asserts.assertLessThan(Asserts.java:99)
[2025-07-16T19:50:32.018Z] at jdk.test.lib.Asserts.assertLessThan(Asserts.java:82)
[2025-07-16T19:50:32.018Z] at jdk.jfr.event.runtime.TestThreadCpuTimeEvent.testCompareWithMXBean(TestThreadCpuTimeEvent.java:237)
[2025-07-16T19:50:32.018Z] at jdk.jfr.event.runtime.TestThreadCpuTimeEvent.main(TestThreadCpuTimeEvent.java:63)
[2025-07-16T19:50:32.018Z] at java.base/jdk.internal.reflect.NativeMethodAccessorImpl.invoke0(Native Method)
[2025-07-16T19:50:32.019Z] at java.base/jdk.internal.reflect.NativeMethodAccessorImpl.invoke(NativeMethodAccessorImpl.java:62)
[2025-07-16T19:50:32.019Z] at java.base/jdk.internal.reflect.DelegatingMethodAccessorImpl.invoke(DelegatingMethodAccessorImpl.java:43)
[2025-07-16T19:50:32.019Z] at java.base/java.lang.reflect.Method.invoke(Method.java:566)
[2025-07-16T19:50:32.019Z] at com.sun.javatest.regtest.agent.MainWrapper$MainTask.run(MainWrapper.java:138)
[2025-07-16T19:50:32.019Z] at java.base/java.lang.Thread.run(Thread.java:829)
[2025-07-16T19:50:32.019Z]
[2025-07-16T19:50:32.019Z] JavaTest Message: Test threw exception: java.lang.RuntimeException: assertLessThan: expected that PT0.188S < PT0.1416525S
[2025-07-16T19:50:32.019Z] JavaTest Message: shutting down test
[2025-07-16T19:50:32.019Z]
[2025-07-16T19:50:32.019Z] STATUS:Failed.`main' threw exception: java.lang.RuntimeException: assertLessThan: expected that PT0.188S < PT0.1416525S
[2025-07-16T19:50:32.019Z] rerun:
[2025-07-16T19:50:32.019Z] cd /home/jenkins/workspace/Test_openjdk11_hs_extended.openjdk_x86-64_linux_testList_4/aqa-tests/TKG/output_17526784562195/jdk_jfr_1/work/scratch/0 && \
[2025-07-16T19:50:32.019Z] DISPLAY=:0 \
[2025-07-16T19:50:32.019Z] HOME=/home/jenkins \
[2025-07-16T19:50:32.019Z] LANG=C.UTF-8 \
[2025-07-16T19:50:32.019Z] PATH=/bin:/usr/bin:/usr/sbin \
[2025-07-16T19:50:32.019Z] CLASSPATH=/home/jenkins/workspace/Test_openjdk11_hs_extended.openjdk_x86-64_linux_testList_4/aqa-tests/TKG/output_17526784562195/jdk_jfr_1/work/classes/1/jdk/jfr/event/runtime/TestThreadCpuTimeEvent.d:/home/jenkins/workspace/Test_openjdk11_hs_extended.openjdk_x86-64_linux_testList_4/aqa-tests/openjdk/openjdk-jdk/test/jdk/jdk/jfr/event/runtime:/home/jenkins/workspace/Test_openjdk11_hs_extended.openjdk_x86-64_linux_testList_4/aqa-tests/TKG/output_17526784562195/jdk_jfr_1/work/classes/1/test/lib:/home/jenkins/workspace/Test_openjdk11_hs_extended.openjdk_x86-64_linux_testList_4/aqa-tests/openjdk/openjdk-jdk/test/lib:/home/jenkins/workspace/Test_openjdk11_hs_extended.openjdk_x86-64_linux_testList_4/jvmtest/openjdk/jtreg/lib/javatest.jar:/home/jenkins/workspace/Test_openjdk11_hs_extended.openjdk_x86-64_linux_testList_4/jvmtest/openjdk/jtreg/lib/jtreg.jar \
[2025-07-16T19:50:32.019Z] /home/jenkins/workspace/Test_openjdk11_hs_extended.openjdk_x86-64_linux_testList_4/jdkbinary/j2sdk-image/bin/java \
[2025-07-16T19:50:32.019Z] -Dtest.vm.opts='-ea -esa -Xmx768m -XX:-UseCompressedOops' \
[2025-07-16T19:50:32.019Z] -Dtest.tool.vm.opts='-J-ea -J-esa -J-Xmx768m -J-XX:-UseCompressedOops' \
[2025-07-16T19:50:32.019Z] -Dtest.compiler.opts= \
[2025-07-16T19:50:32.019Z] -Dtest.java.opts= \
[2025-07-16T19:50:32.019Z] -Dtest.jdk=/home/jenkins/workspace/Test_openjdk11_hs_extended.openjdk_x86-64_linux_testList_4/jdkbinary/j2sdk-image \
[2025-07-16T19:50:32.019Z] -Dcompile.jdk=/home/jenkins/workspace/Test_openjdk11_hs_extended.openjdk_x86-64_linux_testList_4/jdkbinary/j2sdk-image \
[2025-07-16T19:50:32.019Z] -Dtest.timeout.factor=8.0 \
[2025-07-16T19:50:32.019Z] -Dtest.nativepath=/home/jenkins/workspace/Test_openjdk11_hs_extended.openjdk_x86-64_linux_testList_4/jdkbinary/openjdk-test-image/jdk/jtreg/native \
[2025-07-16T19:50:32.019Z] -Dtest.root=/home/jenkins/workspace/Test_openjdk11_hs_extended.openjdk_x86-64_linux_testList_4/aqa-tests/openjdk/openjdk-jdk/test/jdk \
[2025-07-16T19:50:32.019Z] -Dtest.name=jdk/jfr/event/runtime/TestThreadCpuTimeEvent.java \
[2025-07-16T19:50:32.019Z] -Dtest.file=/home/jenkins/workspace/Test_openjdk11_hs_extended.openjdk_x86-64_linux_testList_4/aqa-tests/openjdk/openjdk-jdk/test/jdk/jdk/jfr/event/runtime/TestThreadCpuTimeEvent.java \
[2025-07-16T19:50:32.019Z] -Dtest.src=/home/jenkins/workspace/Test_openjdk11_hs_extended.openjdk_x86-64_linux_testList_4/aqa-tests/openjdk/openjdk-jdk/test/jdk/jdk/jfr/event/runtime \
[2025-07-16T19:50:32.019Z] -Dtest.src.path=/home/jenkins/workspace/Test_openjdk11_hs_extended.openjdk_x86-64_linux_testList_4/aqa-tests/openjdk/openjdk-jdk/test/jdk/jdk/jfr/event/runtime:/home/jenkins/workspace/Test_openjdk11_hs_extended.openjdk_x86-64_linux_testList_4/aqa-tests/openjdk/openjdk-jdk/test/lib \
[2025-07-16T19:50:32.019Z] -Dtest.classes=/home/jenkins/workspace/Test_openjdk11_hs_extended.openjdk_x86-64_linux_testList_4/aqa-tests/TKG/output_17526784562195/jdk_jfr_1/work/classes/1/jdk/jfr/event/runtime/TestThreadCpuTimeEvent.d \
[2025-07-16T19:50:32.019Z] -Dtest.class.path=/home/jenkins/workspace/Test_openjdk11_hs_extended.openjdk_x86-64_linux_testList_4/aqa-tests/TKG/output_17526784562195/jdk_jfr_1/work/classes/1/jdk/jfr/event/runtime/TestThreadCpuTimeEvent.d:/home/jenkins/workspace/Test_openjdk11_hs_extended.openjdk_x86-64_linux_testList_4/aqa-tests/TKG/output_17526784562195/jdk_jfr_1/work/classes/1/test/lib \
[2025-07-16T19:50:32.019Z] -Dtest.class.path.prefix=/home/jenkins/workspace/Test_openjdk11_hs_extended.openjdk_x86-64_linux_testList_4/aqa-tests/TKG/output_17526784562195/jdk_jfr_1/work/classes/1/jdk/jfr/event/runtime/TestThreadCpuTimeEvent.d:/home/jenkins/workspace/Test_openjdk11_hs_extended.openjdk_x86-64_linux_testList_4/aqa-tests/openjdk/openjdk-jdk/test/jdk/jdk/jfr/event/runtime:/home/jenkins/workspace/Test_openjdk11_hs_extended.openjdk_x86-64_linux_testList_4/aqa-tests/TKG/output_17526784562195/jdk_jfr_1/work/classes/1/test/lib \
[2025-07-16T19:50:32.019Z] -Dtest.modules='jdk.jfr jdk.management' \
[2025-07-16T19:50:32.019Z] --add-modules jdk.jfr,jdk.management \
[2025-07-16T19:50:32.019Z] -ea \
[2025-07-16T19:50:32.019Z] -esa \
[2025-07-16T19:50:32.019Z] -Xmx768m \
[2025-07-16T19:50:32.019Z] -XX:-UseCompressedOops \
[2025-07-16T19:50:32.019Z] -Djava.library.path=/home/jenkins/workspace/Test_openjdk11_hs_extended.openjdk_x86-64_linux_testList_4/jdkbinary/openjdk-test-image/jdk/jtreg/native \
[2025-07-16T19:50:32.019Z] com.sun.javatest.regtest.agent.MainWrapper /home/jenkins/workspace/Test_openjdk11_hs_extended.openjdk_x86-64_linux_testList_4/aqa-tests/TKG/output_17526784562195/jdk_jfr_1/work/jdk/jfr/event/runtime/TestThreadCpuTimeEvent.d/main.0.jta
[2025-07-16T19:50:32.019Z]
[2025-07-16T19:50:32.019Z] TEST RESULT: Failed. Execution failed: `main' threw exception: java.lang.RuntimeException: assertLessThan: expected that PT0.188S < PT0.1416525S
[2025-07-16T19:50:32.019Z] --------------------------------------------------
[2025-07-16T20:08:02.869Z] Test results: passed: 435; failed: 1
[2025-07-16T20:08:25.232Z] Report written to /home/jenkins/workspace/Test_openjdk11_hs_extended.openjdk_x86-64_linux_testList_4/aqa-tests/TKG/output_17526784562195/jdk_jfr_1/report/html/report.html
[2025-07-16T20:08:25.232Z] Results written to /home/jenkins/workspace/Test_openjdk11_hs_extended.openjdk_x86-64_linux_testList_4/aqa-tests/TKG/output_17526784562195/jdk_jfr_1/work
[2025-07-16T20:08:25.232Z] Error: Some tests failed or other problems occurred.
[2025-07-16T20:08:25.232Z] -----------------------------------
[2025-07-16T20:08:25.232Z] jdk_jfr_1_FAILED
[2025-07-16T20:08:25.232Z] -----------------------------------
[2025-07-16T20:08:25.232Z]
[2025-07-16T20:08:25.232Z] TEST TEARDOWN:
[2025-07-16T20:08:25.232Z] Nothing to be done for teardown.
[2025-07-16T20:08:25.232Z] jdk_jfr_1 Finish Time: Wed Jul 16 20:08:22 2025 Epoch Time (ms): 1752696502212