Post Test
[2025-08-12T23:48:05.014Z] gmake[4]: Leaving directory '/home/jenkins/workspace/Test_openjdk8_hs_extended.openjdk_ppc64_aix_testList_2/aqa-tests/openjdk'
[2025-08-12T23:48:05.014Z] gmake[3]: Leaving directory '/home/jenkins/workspace/Test_openjdk8_hs_extended.openjdk_ppc64_aix_testList_2/aqa-tests'
[2025-08-12T23:48:05.014Z]
[2025-08-12T23:48:05.014Z]
[2025-08-12T23:48:05.014Z] All tests finished, run result summary:
[2025-08-12T23:48:05.014Z] cd "/home/jenkins/workspace/Test_openjdk8_hs_extended.openjdk_ppc64_aix_testList_2/aqa-tests/TKG/../TKG/scripts"; \
[2025-08-12T23:48:05.014Z] perl "resultsSum.pl" --failuremk="/home/jenkins/workspace/Test_openjdk8_hs_extended.openjdk_ppc64_aix_testList_2/aqa-tests/TKG/../TKG/failedtargets.mk" --resultFile="/home/jenkins/workspace/Test_openjdk8_hs_extended.openjdk_ppc64_aix_testList_2/aqa-tests/TKG/../TKG/output_17550356275311/TestTargetResult" --platFile="/home/jenkins/workspace/Test_openjdk8_hs_extended.openjdk_ppc64_aix_testList_2/aqa-tests/TKG/../TKG/resources/buildPlatformMap.properties" --diagnostic=failure --jdkVersion=8 --jdkImpl=hotspot --jdkVendor="temurin" --spec=aix_ppc-64 --buildList=openjdk --customTarget="" --testTarget=testList --tapPath=/home/jenkins/workspace/Test_openjdk8_hs_extended.openjdk_ppc64_aix_testList_2/aqa-tests/TKG/../TKG/output_17550356275311/ --tapName=Test_openjdk8_hs_extended.openjdk_ppc64_aix_testList_2.tap --comment=""
[2025-08-12T23:48:05.014Z]
[2025-08-12T23:48:05.014Z]
[2025-08-12T23:48:05.014Z] TEST TARGETS SUMMARY
[2025-08-12T23:48:05.014Z] ++++++++++++++++++++++++++++++++++++++++++++++++++++++++++++++++++++++++++
[2025-08-12T23:48:05.014Z] PASSED test targets:
[2025-08-12T23:48:05.014Z] jdk_other_0 - Test results: passed: 223
[2025-08-12T23:48:05.014Z] jdk_other_1 - Test results: passed: 223
[2025-08-12T23:48:05.014Z] jdk_time_0 - Test results: passed: 170
[2025-08-12T23:48:05.014Z] jdk_instrument_1 - Test results: passed: 57
[2025-08-12T23:48:05.014Z]
[2025-08-12T23:48:05.014Z] FAILED test targets:
[2025-08-12T23:48:05.014Z] jdk_net_0 - Test results: passed: 452; failed: 1
[2025-08-12T23:48:05.014Z] Failed test cases:
[2025-08-12T23:48:05.014Z] TEST: java/net/Socket/B8312065.java
[2025-08-12T23:48:05.014Z]
[2025-08-12T23:48:05.014Z] jdk_net_1 - Test results: passed: 452; failed: 1
[2025-08-12T23:48:05.014Z] Failed test cases:
[2025-08-12T23:48:05.014Z] TEST: java/net/Socket/B8312065.java
[2025-08-12T23:48:05.014Z]
[2025-08-12T23:48:05.014Z]
[2025-08-12T23:48:05.014Z] TOTAL: 6 EXECUTED: 6 PASSED: 4 FAILED: 2 DISABLED: 0 SKIPPED: 0
[2025-08-12T23:48:05.014Z] ++++++++++++++++++++++++++++++++++++++++++++++++++++++++++++++++++++++++++
[2025-08-12T23:48:05.014Z]
[2025-08-12T23:48:05.014Z] TESTCASES RESULTS SUMMARY: passed: 1,577; failed: 2; error: 0; skipped: 0
[2025-08-12T23:48:05.014Z] ++++++++++++++++++++++++++++++++++++++++++++++++++++++++++++++++++++++++++
[2025-08-12T23:48:05.014Z] gmake[2]: *** [settings.mk:454: resultsSummary] Error 2
[2025-08-12T23:48:05.014Z] gmake[2]: Leaving directory '/home/jenkins/workspace/Test_openjdk8_hs_extended.openjdk_ppc64_aix_testList_2/aqa-tests/TKG'
[2025-08-12T23:48:05.014Z] gmake[1]: *** [makefile:62: _testList] Error 2
[2025-08-12T23:48:05.014Z] gmake[1]: Leaving directory '/home/jenkins/workspace/Test_openjdk8_hs_extended.openjdk_ppc64_aix_testList_2/aqa-tests/TKG'
[2025-08-12T23:48:05.014Z] gmake: *** [parallelList.mk:14: testList_2] Error 2
[Pipeline] sh
[2025-08-12T23:48:07.910Z] + uname
[2025-08-12T23:48:07.910Z] + [ AIX = AIX ]
[2025-08-12T23:48:07.910Z] + MAKE=gmake
[2025-08-12T23:48:07.910Z] + gmake -f ./aqa-tests/TKG/testEnv.mk testEnvTeardown
[2025-08-12T23:48:07.910Z] gmake: Nothing to be done for 'testEnvTeardown'.
[Pipeline] }
[2025-08-12T23:48:08.336Z] $ ssh-agent -k
[2025-08-12T23:48:08.346Z] unset SSH_AUTH_SOCK;
[2025-08-12T23:48:08.346Z] unset SSH_AGENT_PID;
[2025-08-12T23:48:08.346Z] echo Agent pid 13107638 killed;
[2025-08-12T23:48:13.671Z] [ssh-agent] Stopped.
[Pipeline] // sshagent
[Pipeline] echo
[2025-08-12T23:48:13.753Z] There were test failures, current build status is UNSTABLE.
[Pipeline] }
[Pipeline] // stage
[Pipeline] stage
[Pipeline] { (Post)
[Pipeline] echo
[2025-08-12T23:48:13.842Z] Saving aqa-tests/testenv/testenv.properties file on jenkins.
[Pipeline] archiveArtifacts
[2025-08-12T23:48:15.024Z] Archiving artifacts
[2025-08-12T23:48:15.374Z] Recording fingerprints
[Pipeline] echo
[2025-08-12T23:48:15.567Z] Saving aqa-tests/TKG/**/*.tap file on jenkins.
[Pipeline] archiveArtifacts
[2025-08-12T23:48:15.747Z] Archiving artifacts
[2025-08-12T23:48:16.696Z] Recording fingerprints
[Pipeline] sh
[2025-08-12T23:48:19.488Z] + tar -cf - ./aqa-tests/TKG/output_17550356275311
[2025-08-12T23:48:19.488Z] + 1> openjdk_test_output.tar.gz
[2025-08-12T23:48:19.488Z] + pigz -9
[2025-08-12T23:48:19.488Z] + 2> /dev/null
[2025-08-12T23:48:19.488Z] + gzip -9
[Pipeline] echo
[2025-08-12T23:48:23.444Z] ARTIFACTORY_SERVER is not set. Saving artifacts on jenkins.
[Pipeline] archiveArtifacts
[2025-08-12T23:48:23.622Z] Archiving artifacts
[2025-08-12T23:48:50.029Z] Recording fingerprints
[Pipeline] findFiles
[Pipeline] echo
[2025-08-12T23:48:54.716Z] Tap file found: aqa-tests/TKG/output_17550356275311/Test_openjdk8_hs_extended.openjdk_ppc64_aix_testList_2.tap...
[Pipeline] readFile
[Pipeline] echo
[2025-08-12T23:48:55.537Z] Rerun in Grinder with failed test targets: https://ci.adoptium.net/job/Grinder/parambuild/?SDK_RESOURCE=upstream&TARGET=testList+TESTLIST=jdk_net_0,jdk_net_1&BASE_DOCKER_REGISTRY_CREDENTIAL_ID=&TEST_FLAG=&UPSTREAM_TEST_JOB_NAME=Test_openjdk8_hs_extended.openjdk_ppc64_aix&DOCKER_REQUIRED=false&ACTIVE_NODE_TIMEOUT=5&VENDOR_TEST_DIRS=&EXTRA_DOCKER_ARGS=&TKG_OWNER_BRANCH=adoptium%3Amaster&OPENJ9_SYSTEMTEST_OWNER_BRANCH=eclipse%3Amaster&PLATFORM=ppc64_aix&GENERATE_JOBS=true&KEEP_REPORTDIR=true&PERSONAL_BUILD=false&DOCKER_REGISTRY_DIR=&RERUN_ITERATIONS=0&ADOPTOPENJDK_REPO=https%3A%2F%2Fgithub.com%2Fadoptium%2Faqa-tests.git&SETUP_JCK_RUN=false&DOCKER_REGISTRY_URL_CREDENTIAL_ID=&LABEL=&EXTRA_OPTIONS=&CUSTOMIZED_SDK_URL=&BUILD_IDENTIFIER=&JENKINS_KEY=&ADOPTOPENJDK_BRANCH=master&LIGHT_WEIGHT_CHECKOUT=false&USE_JRE=false&ARTIFACTORY_SERVER=&KEEP_WORKSPACE=false&USER_CREDENTIALS_ID=&JDK_VERSION=8&DOCKER_REGISTRY_URL=&ITERATIONS=1&VENDOR_TEST_REPOS=&JDK_REPO=https%3A%2F%2Fgithub.com%2Fadoptium%2Fjdk8u&JCK_GIT_BRANCH=master&OPENJ9_BRANCH=master&OPENJ9_SHA=&JCK_GIT_REPO=&VENDOR_TEST_BRANCHES=&UPSTREAM_JOB_NAME=build-scripts%2Fjobs%2Fjdk8u%2Fjdk8u-aix-ppc64-temurin&OPENJ9_REPO=https%3A%2F%2Fgithub.com%2Feclipse-openj9%2Fopenj9.git&CLOUD_PROVIDER=&CUSTOM_TARGET=&VENDOR_TEST_SHAS=&JDK_BRANCH=jdk8u472-b03_adopt&LABEL_ADDITION=sw.os.aix.7_2&ARTIFACTORY_REPO=&ARTIFACTORY_ROOT_DIR=&UPSTREAM_TEST_JOB_NUMBER=185&DOCKERIMAGE_TAG=&TEST_TIME=&JDK_IMPL=hotspot&SSH_AGENT_CREDENTIAL=&AUTO_DETECT=true&SLACK_CHANNEL=aqavit-bot&DYNAMIC_COMPILE=false&RELATED_NODES=&ADOPTOPENJDK_SYSTEMTEST_OWNER_BRANCH=adoptium%3Amaster&APPLICATION_OPTIONS=&CUSTOMIZED_SDK_URL_CREDENTIAL_ID=eclipse_temurin_bot_email_and_token&ARCHIVE_TEST_RESULTS=false&NUM_MACHINES=&OPENJDK_SHA=&TRSS_URL=&RERUN_FAILURE=false&USE_TESTENV_PROPERTIES=false&BUILD_LIST=openjdk&ADDITIONAL_ARTIFACTS_REQUIRED=&UPSTREAM_JOB_NUMBER=512&STF_OWNER_BRANCH=adoptium%3Amaster&TIME_LIMIT=25&JVM_OPTIONS=&PARALLEL=None
[Pipeline] echo
[2025-08-12T23:48:55.569Z] Rerun failed jdk test cases in Grinder with jdk_custom target: https://ci.adoptium.net/job/Grinder/parambuild/?SDK_RESOURCE=upstream&TARGET=jdk_custom&BASE_DOCKER_REGISTRY_CREDENTIAL_ID=&TEST_FLAG=&UPSTREAM_TEST_JOB_NAME=Test_openjdk8_hs_extended.openjdk_ppc64_aix&DOCKER_REQUIRED=false&ACTIVE_NODE_TIMEOUT=5&VENDOR_TEST_DIRS=&EXTRA_DOCKER_ARGS=&TKG_OWNER_BRANCH=adoptium%3Amaster&OPENJ9_SYSTEMTEST_OWNER_BRANCH=eclipse%3Amaster&PLATFORM=ppc64_aix&GENERATE_JOBS=true&KEEP_REPORTDIR=true&PERSONAL_BUILD=false&DOCKER_REGISTRY_DIR=&RERUN_ITERATIONS=0&ADOPTOPENJDK_REPO=https%3A%2F%2Fgithub.com%2Fadoptium%2Faqa-tests.git&SETUP_JCK_RUN=false&DOCKER_REGISTRY_URL_CREDENTIAL_ID=&LABEL=&EXTRA_OPTIONS=&CUSTOMIZED_SDK_URL=&BUILD_IDENTIFIER=&JENKINS_KEY=&ADOPTOPENJDK_BRANCH=master&LIGHT_WEIGHT_CHECKOUT=false&USE_JRE=false&ARTIFACTORY_SERVER=&KEEP_WORKSPACE=false&USER_CREDENTIALS_ID=&JDK_VERSION=8&DOCKER_REGISTRY_URL=&ITERATIONS=1&VENDOR_TEST_REPOS=&JDK_REPO=https%3A%2F%2Fgithub.com%2Fadoptium%2Fjdk8u&JCK_GIT_BRANCH=master&OPENJ9_BRANCH=master&OPENJ9_SHA=&JCK_GIT_REPO=&VENDOR_TEST_BRANCHES=&UPSTREAM_JOB_NAME=build-scripts%2Fjobs%2Fjdk8u%2Fjdk8u-aix-ppc64-temurin&OPENJ9_REPO=https%3A%2F%2Fgithub.com%2Feclipse-openj9%2Fopenj9.git&CLOUD_PROVIDER=&CUSTOM_TARGET=java%2Fnet%2FSocket%2FB8312065.java&VENDOR_TEST_SHAS=&JDK_BRANCH=jdk8u472-b03_adopt&LABEL_ADDITION=sw.os.aix.7_2&ARTIFACTORY_REPO=&ARTIFACTORY_ROOT_DIR=&UPSTREAM_TEST_JOB_NUMBER=185&DOCKERIMAGE_TAG=&TEST_TIME=&JDK_IMPL=hotspot&SSH_AGENT_CREDENTIAL=&AUTO_DETECT=true&SLACK_CHANNEL=aqavit-bot&DYNAMIC_COMPILE=false&RELATED_NODES=&ADOPTOPENJDK_SYSTEMTEST_OWNER_BRANCH=adoptium%3Amaster&APPLICATION_OPTIONS=&CUSTOMIZED_SDK_URL_CREDENTIAL_ID=eclipse_temurin_bot_email_and_token&ARCHIVE_TEST_RESULTS=false&NUM_MACHINES=&OPENJDK_SHA=&TRSS_URL=&RERUN_FAILURE=false&USE_TESTENV_PROPERTIES=false&BUILD_LIST=openjdk&ADDITIONAL_ARTIFACTS_REQUIRED=&UPSTREAM_JOB_NUMBER=512&STF_OWNER_BRANCH=adoptium%3Amaster&TIME_LIMIT=25&JVM_OPTIONS=&PARALLEL=None
[Pipeline] junit
[2025-08-12T23:48:55.874Z] Recording test results
[2025-08-12T23:49:10.446Z] [Checks API] No suitable checks publisher found.
[Pipeline] }
[Pipeline] // stage
[Pipeline] echo
[2025-08-12T23:49:10.497Z] PROCESSCATCH: Terminating any hung/left over test processes:
[Pipeline] sh
[2025-08-12T23:49:13.211Z] + aqa-tests/terminateTestProcesses.sh jenkins
[2025-08-12T23:49:13.211Z] + 2>& 1
[2025-08-12T23:49:13.211Z] Unix type machine..
[2025-08-12T23:49:13.212Z] jenkins 9044236 1 0 May 16 - 4:09 /home/jenkins/workspace/Test_openjdk21_hs_extended.openjdk_ppc64_aix_testList_6/jdkbinary/j2sdk-image/bin/java -cp /home/jenkins/workspace/Test_openjdk21_hs_extended.openjdk_ppc64_aix_testList_6/aqa-tests/TKG/output_1747391755100/jdk_jdi_0/work/classes/com/sun/jdi/JdwpNetProps.d:/home/jenkins/workspace/Test_openjdk21_hs_extended.openjdk_ppc64_aix_testList_6/aqa-tests/openjdk/openjdk-jdk/test/jdk/com/sun/jdi:/home/jenkins/workspace/Test_openjdk21_hs_extended.openjdk_ppc64_aix_testList_6/aqa-tests/TKG/output_1747391755100/jdk_jdi_0/work/classes/test/lib:/home/jenkins/workspace/Test_openjdk21_hs_extended.openjdk_ppc64_aix_testList_6/aqa-tests/openjdk/openjdk-jdk/test/lib:/home/jenkins/workspace/Test_openjdk21_hs_extended.openjdk_ppc64_aix_testList_6/jvmtest/openjdk/jtreg/lib/javatest.jar:/home/jenkins/workspace/Test_openjdk21_hs_extended.openjdk_ppc64_aix_testList_6/jvmtest/openjdk/jtreg/lib/jtreg.jar -ea -esa -Xmx512m -XX:+UseCompressedOops -agentlib:jdwp=transport=dt_socket,address=localhost:0,server=y,suspend=y -Djava.net.preferIPv4Stack=false HelloWorld
[2025-08-12T23:49:13.212Z] jenkins 13894066 1 0 Jul 16 - 1:11 /home/jenkins/workspace/Test_openjdk21_hs_extended.openjdk_ppc64_aix_testList_0/jdkbinary/j2sdk-image/bin/java -cp /home/jenkins/workspace/Test_openjdk21_hs_extended.openjdk_ppc64_aix_testList_0/aqa-tests/TKG/output_17526394998752/jdk_jdi_0/work/classes/com/sun/jdi/JdwpNetProps.d:/home/jenkins/workspace/Test_openjdk21_hs_extended.openjdk_ppc64_aix_testList_0/aqa-tests/openjdk/openjdk-jdk/test/jdk/com/sun/jdi:/home/jenkins/workspace/Test_openjdk21_hs_extended.openjdk_ppc64_aix_testList_0/aqa-tests/TKG/output_17526394998752/jdk_jdi_0/work/classes/test/lib:/home/jenkins/workspace/Test_openjdk21_hs_extended.openjdk_ppc64_aix_testList_0/aqa-tests/openjdk/openjdk-jdk/test/lib:/home/jenkins/workspace/Test_openjdk21_hs_extended.openjdk_ppc64_aix_testList_0/jvmtest/openjdk/jtreg/lib/javatest.jar:/home/jenkins/workspace/Test_openjdk21_hs_extended.openjdk_ppc64_aix_testList_0/jvmtest/openjdk/jtreg/lib/jtreg.jar -ea -esa -Xmx512m -XX:+UseCompressedOops -agentlib:jdwp=transport=dt_socket,address=localhost:0,server=y,suspend=y -Djava.net.preferIPv6Addresses=true HelloWorld
[2025-08-12T23:49:13.212Z] jenkins 15860052 1 0 May 18 - 4:00 /home/jenkins/workspace/Test_openjdk21_hs_extended.openjdk_ppc64_aix_testList_1/jdkbinary/j2sdk-image/bin/java -cp /home/jenkins/workspace/Test_openjdk21_hs_extended.openjdk_ppc64_aix_testList_1/aqa-tests/TKG/output_17475252731152/jdk_jdi_1/work/classes/com/sun/jdi/JdwpNetProps.d:/home/jenkins/workspace/Test_openjdk21_hs_extended.openjdk_ppc64_aix_testList_1/aqa-tests/openjdk/openjdk-jdk/test/jdk/com/sun/jdi:/home/jenkins/workspace/Test_openjdk21_hs_extended.openjdk_ppc64_aix_testList_1/aqa-tests/TKG/output_17475252731152/jdk_jdi_1/work/classes/test/lib:/home/jenkins/workspace/Test_openjdk21_hs_extended.openjdk_ppc64_aix_testList_1/aqa-tests/openjdk/openjdk-jdk/test/lib:/home/jenkins/workspace/Test_openjdk21_hs_extended.openjdk_ppc64_aix_testList_1/jvmtest/openjdk/jtreg/lib/javatest.jar:/home/jenkins/workspace/Test_openjdk21_hs_extended.openjdk_ppc64_aix_testList_1/jvmtest/openjdk/jtreg/lib/jtreg.jar -ea -esa -Xmx512m -XX:-UseCompressedOops -agentlib:jdwp=transport=dt_socket,address=localhost:0,server=y,suspend=y -Djava.net.preferIPv6Addresses=true HelloWorld
[2025-08-12T23:49:13.212Z] jenkins 22741248 1 0 Jul 16 - 1:11 /home/jenkins/workspace/Test_openjdk21_hs_extended.openjdk_ppc64_aix_testList_0/jdkbinary/j2sdk-image/bin/java -cp /home/jenkins/workspace/Test_openjdk21_hs_extended.openjdk_ppc64_aix_testList_0/aqa-tests/TKG/output_17526394998752/jdk_jdi_0/work/classes/com/sun/jdi/JdwpNetProps.d:/home/jenkins/workspace/Test_openjdk21_hs_extended.openjdk_ppc64_aix_testList_0/aqa-tests/openjdk/openjdk-jdk/test/jdk/com/sun/jdi:/home/jenkins/workspace/Test_openjdk21_hs_extended.openjdk_ppc64_aix_testList_0/aqa-tests/TKG/output_17526394998752/jdk_jdi_0/work/classes/test/lib:/home/jenkins/workspace/Test_openjdk21_hs_extended.openjdk_ppc64_aix_testList_0/aqa-tests/openjdk/openjdk-jdk/test/lib:/home/jenkins/workspace/Test_openjdk21_hs_extended.openjdk_ppc64_aix_testList_0/jvmtest/openjdk/jtreg/lib/javatest.jar:/home/jenkins/workspace/Test_openjdk21_hs_extended.openjdk_ppc64_aix_testList_0/jvmtest/openjdk/jtreg/lib/jtreg.jar -ea -esa -Xmx512m -XX:+UseCompressedOops -agentlib:jdwp=transport=dt_socket,address=localhost:0,server=y,suspend=y -Djava.net.preferIPv4Stack=false HelloWorld
[2025-08-12T23:49:13.212Z] jenkins 23462394 1 0 21:53:37 - 0:00 /usr/bin/X11/X -force -vfb -x abx -x dbe -x GLX -secIP 000 :0
[2025-08-12T23:49:13.212Z] Boooo - there are rogue processes kicking about
[2025-08-12T23:49:13.212Z] Issuing a kill to all processes shown above
[2025-08-12T23:49:13.212Z] exec(): 0509-036 Cannot load program gawk_64 because of the following errors:
[2025-08-12T23:49:13.212Z] 0509-130 Symbol resolution failed for gawk_64 because:
[2025-08-12T23:49:13.212Z] 0509-136 Symbol _GLOBAL__AIXI_libintl_so (number 176) is not exported from
[2025-08-12T23:49:13.212Z] dependent module /usr/jdk-17.0.4+7/../lib/libintl.a[libintl.so.8].
[2025-08-12T23:49:13.212Z] 0509-136 Symbol _GLOBAL__AIXD_libintl_so (number 177) is not exported from
[2025-08-12T23:49:13.212Z] dependent module /usr/jdk-17.0.4+7/../lib/libintl.a[libintl.so.8].
[2025-08-12T23:49:13.212Z] 0509-192 Examine .loader section symbols with the
[2025-08-12T23:49:13.212Z] 'dump -Tv' command.
[2025-08-12T23:49:13.212Z] Sleeping for 10 seconds...
[2025-08-12T23:49:23.042Z] jenkins 9044236 1 0 May 16 - 4:09 /home/jenkins/workspace/Test_openjdk21_hs_extended.openjdk_ppc64_aix_testList_6/jdkbinary/j2sdk-image/bin/java -cp /home/jenkins/workspace/Test_openjdk21_hs_extended.openjdk_ppc64_aix_testList_6/aqa-tests/TKG/output_1747391755100/jdk_jdi_0/work/classes/com/sun/jdi/JdwpNetProps.d:/home/jenkins/workspace/Test_openjdk21_hs_extended.openjdk_ppc64_aix_testList_6/aqa-tests/openjdk/openjdk-jdk/test/jdk/com/sun/jdi:/home/jenkins/workspace/Test_openjdk21_hs_extended.openjdk_ppc64_aix_testList_6/aqa-tests/TKG/output_1747391755100/jdk_jdi_0/work/classes/test/lib:/home/jenkins/workspace/Test_openjdk21_hs_extended.openjdk_ppc64_aix_testList_6/aqa-tests/openjdk/openjdk-jdk/test/lib:/home/jenkins/workspace/Test_openjdk21_hs_extended.openjdk_ppc64_aix_testList_6/jvmtest/openjdk/jtreg/lib/javatest.jar:/home/jenkins/workspace/Test_openjdk21_hs_extended.openjdk_ppc64_aix_testList_6/jvmtest/openjdk/jtreg/lib/jtreg.jar -ea -esa -Xmx512m -XX:+UseCompressedOops -agentlib:jdwp=transport=dt_socket,address=localhost:0,server=y,suspend=y -Djava.net.preferIPv4Stack=false HelloWorld
[2025-08-12T23:49:23.042Z] jenkins 13894066 1 0 Jul 16 - 1:11 /home/jenkins/workspace/Test_openjdk21_hs_extended.openjdk_ppc64_aix_testList_0/jdkbinary/j2sdk-image/bin/java -cp /home/jenkins/workspace/Test_openjdk21_hs_extended.openjdk_ppc64_aix_testList_0/aqa-tests/TKG/output_17526394998752/jdk_jdi_0/work/classes/com/sun/jdi/JdwpNetProps.d:/home/jenkins/workspace/Test_openjdk21_hs_extended.openjdk_ppc64_aix_testList_0/aqa-tests/openjdk/openjdk-jdk/test/jdk/com/sun/jdi:/home/jenkins/workspace/Test_openjdk21_hs_extended.openjdk_ppc64_aix_testList_0/aqa-tests/TKG/output_17526394998752/jdk_jdi_0/work/classes/test/lib:/home/jenkins/workspace/Test_openjdk21_hs_extended.openjdk_ppc64_aix_testList_0/aqa-tests/openjdk/openjdk-jdk/test/lib:/home/jenkins/workspace/Test_openjdk21_hs_extended.openjdk_ppc64_aix_testList_0/jvmtest/openjdk/jtreg/lib/javatest.jar:/home/jenkins/workspace/Test_openjdk21_hs_extended.openjdk_ppc64_aix_testList_0/jvmtest/openjdk/jtreg/lib/jtreg.jar -ea -esa -Xmx512m -XX:+UseCompressedOops -agentlib:jdwp=transport=dt_socket,address=localhost:0,server=y,suspend=y -Djava.net.preferIPv6Addresses=true HelloWorld
[2025-08-12T23:49:23.042Z] jenkins 15860052 1 0 May 18 - 4:00 /home/jenkins/workspace/Test_openjdk21_hs_extended.openjdk_ppc64_aix_testList_1/jdkbinary/j2sdk-image/bin/java -cp /home/jenkins/workspace/Test_openjdk21_hs_extended.openjdk_ppc64_aix_testList_1/aqa-tests/TKG/output_17475252731152/jdk_jdi_1/work/classes/com/sun/jdi/JdwpNetProps.d:/home/jenkins/workspace/Test_openjdk21_hs_extended.openjdk_ppc64_aix_testList_1/aqa-tests/openjdk/openjdk-jdk/test/jdk/com/sun/jdi:/home/jenkins/workspace/Test_openjdk21_hs_extended.openjdk_ppc64_aix_testList_1/aqa-tests/TKG/output_17475252731152/jdk_jdi_1/work/classes/test/lib:/home/jenkins/workspace/Test_openjdk21_hs_extended.openjdk_ppc64_aix_testList_1/aqa-tests/openjdk/openjdk-jdk/test/lib:/home/jenkins/workspace/Test_openjdk21_hs_extended.openjdk_ppc64_aix_testList_1/jvmtest/openjdk/jtreg/lib/javatest.jar:/home/jenkins/workspace/Test_openjdk21_hs_extended.openjdk_ppc64_aix_testList_1/jvmtest/openjdk/jtreg/lib/jtreg.jar -ea -esa -Xmx512m -XX:-UseCompressedOops -agentlib:jdwp=transport=dt_socket,address=localhost:0,server=y,suspend=y -Djava.net.preferIPv6Addresses=true HelloWorld
[2025-08-12T23:49:23.042Z] jenkins 22741248 1 0 Jul 16 - 1:11 /home/jenkins/workspace/Test_openjdk21_hs_extended.openjdk_ppc64_aix_testList_0/jdkbinary/j2sdk-image/bin/java -cp /home/jenkins/workspace/Test_openjdk21_hs_extended.openjdk_ppc64_aix_testList_0/aqa-tests/TKG/output_17526394998752/jdk_jdi_0/work/classes/com/sun/jdi/JdwpNetProps.d:/home/jenkins/workspace/Test_openjdk21_hs_extended.openjdk_ppc64_aix_testList_0/aqa-tests/openjdk/openjdk-jdk/test/jdk/com/sun/jdi:/home/jenkins/workspace/Test_openjdk21_hs_extended.openjdk_ppc64_aix_testList_0/aqa-tests/TKG/output_17526394998752/jdk_jdi_0/work/classes/test/lib:/home/jenkins/workspace/Test_openjdk21_hs_extended.openjdk_ppc64_aix_testList_0/aqa-tests/openjdk/openjdk-jdk/test/lib:/home/jenkins/workspace/Test_openjdk21_hs_extended.openjdk_ppc64_aix_testList_0/jvmtest/openjdk/jtreg/lib/javatest.jar:/home/jenkins/workspace/Test_openjdk21_hs_extended.openjdk_ppc64_aix_testList_0/jvmtest/openjdk/jtreg/lib/jtreg.jar -ea -esa -Xmx512m -XX:+UseCompressedOops -agentlib:jdwp=transport=dt_socket,address=localhost:0,server=y,suspend=y -Djava.net.preferIPv4Stack=false HelloWorld
[2025-08-12T23:49:23.042Z] jenkins 23462394 1 0 21:53:37 - 0:00 /usr/bin/X11/X -force -vfb -x abx -x dbe -x GLX -secIP 000 :0
[2025-08-12T23:49:23.042Z] Still processes left going to remove those with kill -KILL ...
[2025-08-12T23:49:23.042Z] exec(): 0509-036 Cannot load program gawk_64 because of the following errors:
[2025-08-12T23:49:23.042Z] 0509-130 Symbol resolution failed for gawk_64 because:
[2025-08-12T23:49:23.042Z] 0509-136 Symbol _GLOBAL__AIXI_libintl_so (number 176) is not exported from
[2025-08-12T23:49:23.042Z] dependent module /usr/jdk-17.0.4+7/../lib/libintl.a[libintl.so.8].
[2025-08-12T23:49:23.042Z] 0509-136 Symbol _GLOBAL__AIXD_libintl_so (number 177) is not exported from
[2025-08-12T23:49:23.042Z] dependent module /usr/jdk-17.0.4+7/../lib/libintl.a[libintl.so.8].
[2025-08-12T23:49:23.043Z] 0509-192 Examine .loader section symbols with the
[2025-08-12T23:49:23.043Z] 'dump -Tv' command.
[2025-08-12T23:49:23.043Z] DONE - One final check ...
[2025-08-12T23:49:23.043Z] jenkins 9044236 1 0 May 16 - 4:09 /home/jenkins/workspace/Test_openjdk21_hs_extended.openjdk_ppc64_aix_testList_6/jdkbinary/j2sdk-image/bin/java -cp /home/jenkins/workspace/Test_openjdk21_hs_extended.openjdk_ppc64_aix_testList_6/aqa-tests/TKG/output_1747391755100/jdk_jdi_0/work/classes/com/sun/jdi/JdwpNetProps.d:/home/jenkins/workspace/Test_openjdk21_hs_extended.openjdk_ppc64_aix_testList_6/aqa-tests/openjdk/openjdk-jdk/test/jdk/com/sun/jdi:/home/jenkins/workspace/Test_openjdk21_hs_extended.openjdk_ppc64_aix_testList_6/aqa-tests/TKG/output_1747391755100/jdk_jdi_0/work/classes/test/lib:/home/jenkins/workspace/Test_openjdk21_hs_extended.openjdk_ppc64_aix_testList_6/aqa-tests/openjdk/openjdk-jdk/test/lib:/home/jenkins/workspace/Test_openjdk21_hs_extended.openjdk_ppc64_aix_testList_6/jvmtest/openjdk/jtreg/lib/javatest.jar:/home/jenkins/workspace/Test_openjdk21_hs_extended.openjdk_ppc64_aix_testList_6/jvmtest/openjdk/jtreg/lib/jtreg.jar -ea -esa -Xmx512m -XX:+UseCompressedOops -agentlib:jdwp=transport=dt_socket,address=localhost:0,server=y,suspend=y -Djava.net.preferIPv4Stack=false HelloWorld
[2025-08-12T23:49:23.043Z] jenkins 13894066 1 0 Jul 16 - 1:11 /home/jenkins/workspace/Test_openjdk21_hs_extended.openjdk_ppc64_aix_testList_0/jdkbinary/j2sdk-image/bin/java -cp /home/jenkins/workspace/Test_openjdk21_hs_extended.openjdk_ppc64_aix_testList_0/aqa-tests/TKG/output_17526394998752/jdk_jdi_0/work/classes/com/sun/jdi/JdwpNetProps.d:/home/jenkins/workspace/Test_openjdk21_hs_extended.openjdk_ppc64_aix_testList_0/aqa-tests/openjdk/openjdk-jdk/test/jdk/com/sun/jdi:/home/jenkins/workspace/Test_openjdk21_hs_extended.openjdk_ppc64_aix_testList_0/aqa-tests/TKG/output_17526394998752/jdk_jdi_0/work/classes/test/lib:/home/jenkins/workspace/Test_openjdk21_hs_extended.openjdk_ppc64_aix_testList_0/aqa-tests/openjdk/openjdk-jdk/test/lib:/home/jenkins/workspace/Test_openjdk21_hs_extended.openjdk_ppc64_aix_testList_0/jvmtest/openjdk/jtreg/lib/javatest.jar:/home/jenkins/workspace/Test_openjdk21_hs_extended.openjdk_ppc64_aix_testList_0/jvmtest/openjdk/jtreg/lib/jtreg.jar -ea -esa -Xmx512m -XX:+UseCompressedOops -agentlib:jdwp=transport=dt_socket,address=localhost:0,server=y,suspend=y -Djava.net.preferIPv6Addresses=true HelloWorld
[2025-08-12T23:49:23.043Z] jenkins 15860052 1 0 May 18 - 4:00 /home/jenkins/workspace/Test_openjdk21_hs_extended.openjdk_ppc64_aix_testList_1/jdkbinary/j2sdk-image/bin/java -cp /home/jenkins/workspace/Test_openjdk21_hs_extended.openjdk_ppc64_aix_testList_1/aqa-tests/TKG/output_17475252731152/jdk_jdi_1/work/classes/com/sun/jdi/JdwpNetProps.d:/home/jenkins/workspace/Test_openjdk21_hs_extended.openjdk_ppc64_aix_testList_1/aqa-tests/openjdk/openjdk-jdk/test/jdk/com/sun/jdi:/home/jenkins/workspace/Test_openjdk21_hs_extended.openjdk_ppc64_aix_testList_1/aqa-tests/TKG/output_17475252731152/jdk_jdi_1/work/classes/test/lib:/home/jenkins/workspace/Test_openjdk21_hs_extended.openjdk_ppc64_aix_testList_1/aqa-tests/openjdk/openjdk-jdk/test/lib:/home/jenkins/workspace/Test_openjdk21_hs_extended.openjdk_ppc64_aix_testList_1/jvmtest/openjdk/jtreg/lib/javatest.jar:/home/jenkins/workspace/Test_openjdk21_hs_extended.openjdk_ppc64_aix_testList_1/jvmtest/openjdk/jtreg/lib/jtreg.jar -ea -esa -Xmx512m -XX:-UseCompressedOops -agentlib:jdwp=transport=dt_socket,address=localhost:0,server=y,suspend=y -Djava.net.preferIPv6Addresses=true HelloWorld
[2025-08-12T23:49:23.043Z] jenkins 22741248 1 0 Jul 16 - 1:11 /home/jenkins/workspace/Test_openjdk21_hs_extended.openjdk_ppc64_aix_testList_0/jdkbinary/j2sdk-image/bin/java -cp /home/jenkins/workspace/Test_openjdk21_hs_extended.openjdk_ppc64_aix_testList_0/aqa-tests/TKG/output_17526394998752/jdk_jdi_0/work/classes/com/sun/jdi/JdwpNetProps.d:/home/jenkins/workspace/Test_openjdk21_hs_extended.openjdk_ppc64_aix_testList_0/aqa-tests/openjdk/openjdk-jdk/test/jdk/com/sun/jdi:/home/jenkins/workspace/Test_openjdk21_hs_extended.openjdk_ppc64_aix_testList_0/aqa-tests/TKG/output_17526394998752/jdk_jdi_0/work/classes/test/lib:/home/jenkins/workspace/Test_openjdk21_hs_extended.openjdk_ppc64_aix_testList_0/aqa-tests/openjdk/openjdk-jdk/test/lib:/home/jenkins/workspace/Test_openjdk21_hs_extended.openjdk_ppc64_aix_testList_0/jvmtest/openjdk/jtreg/lib/javatest.jar:/home/jenkins/workspace/Test_openjdk21_hs_extended.openjdk_ppc64_aix_testList_0/jvmtest/openjdk/jtreg/lib/jtreg.jar -ea -esa -Xmx512m -XX:+UseCompressedOops -agentlib:jdwp=transport=dt_socket,address=localhost:0,server=y,suspend=y -Djava.net.preferIPv4Stack=false HelloWorld
[2025-08-12T23:49:23.043Z] jenkins 23462394 1 0 21:53:37 - 0:00 /usr/bin/X11/X -force -vfb -x abx -x dbe -x GLX -secIP 000 :0
[2025-08-12T23:49:23.043Z] Cleanup failed, processes still remain...
[Pipeline] echo
[2025-08-12T23:49:23.388Z] rc = 127, Unable to terminate all processes.
[Pipeline] cleanWs
[2025-08-12T23:49:23.751Z] [WS-CLEANUP] Deleting project workspace...
[2025-08-12T23:49:23.751Z] [WS-CLEANUP] Deferred wipeout is disabled by the job configuration...
[2025-08-12T23:49:35.702Z] [WS-CLEANUP] done
[Pipeline] sh
[2025-08-12T23:49:38.414Z] + find /tmp -name *core* -print -exec rm -f {} ;
[2025-08-12T23:49:38.414Z] + 2> /dev/null
[2025-08-12T23:49:38.414Z] /tmp/dnf-20231201132904/python3-dnf-plugins-core-4.0.16-32_2.aix7.1.noarch.rpm
[2025-08-12T23:49:38.414Z] /tmp/dnf-20231201132904/python3.9-dnf-plugins-core-4.0.16-32_2.aix7.1.noarch.rpm
[2025-08-12T23:49:38.414Z] + true
[Pipeline] }
[Pipeline] // timeout
[Pipeline] timeout
[2025-08-12T23:49:38.795Z] Timeout set to expire in 5 min 0 sec
[Pipeline] {
[Pipeline] }
[Pipeline] // timeout
[Pipeline] }
[Pipeline] // node
[Pipeline] }
[Pipeline] // stage
[Pipeline] }
[Pipeline] // timestamps
[Pipeline] End of Pipeline
Finished: UNSTABLE